Warning: Permanently added '54.152.32.192' (ED25519) to the list of known hosts. You can reproduce this build on your computer by running: sudo dnf install copr-rpmbuild /usr/bin/copr-rpmbuild --verbose --drop-resultdir --task-url https://copr.fedorainfracloud.org/backend/get-build-task/8857860-epel-9-x86_64 --chroot epel-9-x86_64 Version: 1.3 PID: 11274 Logging PID: 11275 Task: {'allow_user_ssh': False, 'appstream': False, 'background': False, 'bootstrap': 'off', 'build_id': 8857860, 'buildroot_pkgs': [], 'chroot': 'epel-9-x86_64', 'enable_net': False, 'fedora_review': False, 'git_hash': '4a3e069c6f37ae8ae732a93138128e1053f56bdd', 'git_repo': 'https://copr-dist-git.fedorainfracloud.org/git/ligenix/enterprise-desktop/python-textile', 'isolation': 'default', 'memory_reqs': 2048, 'package_name': 'python-textile', 'package_version': '3.0.4-5', 'project_dirname': 'enterprise-desktop', 'project_name': 'enterprise-desktop', 'project_owner': 'ligenix', 'repo_priority': None, 'repos': [{'baseurl': 'https://download.copr.fedorainfracloud.org/results/ligenix/enterprise-desktop/epel-9-x86_64/', 'id': 'copr_base', 'module_hotfixes': True, 'name': 'Copr repository', 'priority': None}, {'baseurl': 'https://download.copr.fedorainfracloud.org/results/ligenix/enterprise-buildtools/epel-9-x86_64/', 'id': 'copr_ligenix_enterprise_buildtools_epel_releasever_basearch', 'name': 'Additional repo copr_ligenix_enterprise_buildtools_epel_releasever_basearch'}], 'sandbox': 'ligenix/enterprise-desktop--ligenix', 'source_json': {}, 'source_type': None, 'ssh_public_keys': None, 'storage': None, 'submitter': 'ligenix', 'tags': [], 'task_id': '8857860-epel-9-x86_64', 'timeout': 18000, 'uses_devel_repo': False, 'with_opts': ['libcamera_plugin'], 'without_opts': []} Running: git clone https://copr-dist-git.fedorainfracloud.org/git/ligenix/enterprise-desktop/python-textile /var/lib/copr-rpmbuild/workspace/workdir-zepkhc6_/python-textile --depth 500 --no-single-branch --recursive cmd: ['git', 'clone', 'https://copr-dist-git.fedorainfracloud.org/git/ligenix/enterprise-desktop/python-textile', '/var/lib/copr-rpmbuild/workspace/workdir-zepkhc6_/python-textile', '--depth', '500', '--no-single-branch', '--recursive'] cwd: . rc: 0 stdout: stderr: Cloning into '/var/lib/copr-rpmbuild/workspace/workdir-zepkhc6_/python-textile'... Running: git checkout 4a3e069c6f37ae8ae732a93138128e1053f56bdd -- cmd: ['git', 'checkout', '4a3e069c6f37ae8ae732a93138128e1053f56bdd', '--'] cwd: /var/lib/copr-rpmbuild/workspace/workdir-zepkhc6_/python-textile rc: 0 stdout: stderr: Note: switching to '4a3e069c6f37ae8ae732a93138128e1053f56bdd'. You are in 'detached HEAD' state. You can look around, make experimental changes and commit them, and you can discard any commits you make in this state without impacting any branches by switching back to a branch. If you want to create a new branch to retain commits you create, you may do so (now or later) by using -c with the switch command. Example: git switch -c Or undo this operation with: git switch - Turn off this advice by setting config variable advice.detachedHead to false HEAD is now at 4a3e069 automatic import of python-textile Running: dist-git-client sources cmd: ['dist-git-client', 'sources'] cwd: /var/lib/copr-rpmbuild/workspace/workdir-zepkhc6_/python-textile rc: 0 stdout: stderr: INFO: Reading stdout from command: git rev-parse --abbrev-ref HEAD INFO: Reading stdout from command: git rev-parse HEAD INFO: Reading sources specification file: sources INFO: Downloading textile-3.0.4.tar.gz INFO: Reading stdout from command: curl --help all INFO: Calling: curl -H Pragma: -o textile-3.0.4.tar.gz --location --connect-timeout 60 --retry 3 --retry-delay 10 --remote-time --show-error --fail --retry-all-errors https://copr-dist-git.fedorainfracloud.org/repo/pkgs/ligenix/enterprise-desktop/python-textile/textile-3.0.4.tar.gz/md5/11ed72cbc98bb9d239854d7f29e7044e/textile-3.0.4.tar.gz % Total % Received % Xferd Average Speed Time Time Time Current Dload Upload Total Spent Left Speed 100 49890 100 49890 0 0 2251k 0 --:--:-- --:--:-- --:--:-- 2320k INFO: Reading stdout from command: md5sum textile-3.0.4.tar.gz /usr/bin/tail: /var/lib/copr-rpmbuild/main.log: file truncated Running (timeout=18000): unbuffer mock --spec /var/lib/copr-rpmbuild/workspace/workdir-zepkhc6_/python-textile/python-textile.spec --sources /var/lib/copr-rpmbuild/workspace/workdir-zepkhc6_/python-textile --resultdir /var/lib/copr-rpmbuild/results --uniqueext 1743686669.797466 -r /var/lib/copr-rpmbuild/results/configs/child.cfg --with libcamera_plugin INFO: mock.py version 6.1 starting (python version = 3.13.0, NVR = mock-6.1-1.fc41), args: /usr/libexec/mock/mock --spec /var/lib/copr-rpmbuild/workspace/workdir-zepkhc6_/python-textile/python-textile.spec --sources /var/lib/copr-rpmbuild/workspace/workdir-zepkhc6_/python-textile --resultdir /var/lib/copr-rpmbuild/results --uniqueext 1743686669.797466 -r /var/lib/copr-rpmbuild/results/configs/child.cfg --with libcamera_plugin Start: init plugins INFO: tmpfs initialized INFO: selinux enabled INFO: chroot_scan: initialized INFO: compress_logs: initialized Finish: init plugins INFO: Signal handler active Start: run INFO: Start(/var/lib/copr-rpmbuild/workspace/workdir-zepkhc6_/python-textile/python-textile.spec) Config(rhel+epel-9-x86_64) Start: clean chroot Finish: clean chroot Mock Version: 6.1 INFO: Mock Version: 6.1 Start: chroot init INFO: mounting tmpfs at /var/lib/mock/rhel+epel-9-x86_64-1743686669.797466/root. INFO: calling preinit hooks INFO: enabled root cache INFO: enabled package manager cache Start: cleaning package manager metadata Finish: cleaning package manager metadata INFO: enabled HW Info plugin INFO: Package manager dnf4 detected and used (fallback) INFO: Buildroot is handled by package management from host and used with --installroot: rpm-4.20.1-1.fc41.x86_64 rpm-sequoia-1.7.0-2.fc41.x86_64 python3-dnf-4.23.0-1.fc41.noarch python3-dnf-plugins-core-4.10.1-1.fc41.noarch dnf5-5.2.12.0-1.fc41.x86_64 dnf5-plugins-5.2.12.0-1.fc41.x86_64 Start: installing minimal buildroot with dnf No matches found for the following disable plugin patterns: local, spacewalk, versionlock Updating Subscription Management repositories. Unable to read consumer identity This system is not registered with an entitlement server. You can use subscription-manager to register. Copr repository 129 kB/s | 2.1 kB 00:00 Additional repo copr_ligenix_enterprise_buildto 180 kB/s | 2.1 kB 00:00 Red Hat Enterprise Linux - BaseOS 50 kB/s | 4.1 kB 00:00 Red Hat Enterprise Linux - AppStream 33 kB/s | 4.5 kB 00:00 Red Hat Enterprise Linux - CodeReady Linux Buil 54 kB/s | 4.5 kB 00:00 Extra Packages for Enterprise Linux 9 - x86_64 536 kB/s | 32 kB 00:00 Dependencies resolved. ======================================================================================= Package Arch Version Repo Size ======================================================================================= Installing: bash x86_64 5.1.8-9.el9 baseos 1.7 M bzip2 x86_64 1.0.8-10.el9_5 baseos 60 k coreutils x86_64 8.32-36.el9 baseos 1.2 M cpio x86_64 2.13-16.el9 baseos 279 k diffutils x86_64 3.7-12.el9 baseos 402 k epel-rpm-macros noarch 9-15.el9 epel 15 k findutils x86_64 1:4.8.0-7.el9 baseos 550 k gawk x86_64 5.1.0-6.el9 baseos 1.0 M glibc-minimal-langpack x86_64 2.34-125.el9_5.3 baseos 17 k grep x86_64 3.6-5.el9 baseos 273 k gzip x86_64 1.12-1.el9 baseos 167 k info x86_64 6.7-15.el9 baseos 228 k patch x86_64 2.7.6-16.el9 appstream 130 k redhat-release x86_64 9.5-0.6.el9 baseos 45 k redhat-rpm-config noarch 208-1.el9 appstream 75 k rpm-build x86_64 4.16.1.3-34.el9 appstream 71 k sed x86_64 4.8-9.el9 baseos 309 k tar x86_64 2:1.34-7.el9 baseos 889 k unzip x86_64 6.0-58.el9_5 baseos 186 k util-linux x86_64 2.37.4-20.el9 baseos 2.3 M which x86_64 2.21-29.el9 baseos 45 k xz x86_64 5.2.5-8.el9_0 baseos 230 k Installing dependencies: alternatives x86_64 1.24-1.el9_5.1 baseos 42 k ansible-srpm-macros noarch 1-16.el9 epel 21 k audit-libs x86_64 3.1.5-1.el9 baseos 124 k basesystem noarch 11-13.el9 baseos 8.0 k binutils x86_64 2.35.2-54.el9 baseos 4.6 M binutils-gold x86_64 2.35.2-54.el9 baseos 735 k bzip2-libs x86_64 1.0.8-10.el9_5 baseos 42 k ca-certificates noarch 2024.2.69_v8.0.303-91.4.el9_4 baseos 1.0 M coreutils-common x86_64 8.32-36.el9 baseos 2.0 M cracklib x86_64 2.9.6-27.el9 baseos 99 k cracklib-dicts x86_64 2.9.6-27.el9 baseos 3.6 M crypto-policies noarch 20240828-2.git626aa59.el9_5 baseos 90 k curl x86_64 7.76.1-31.el9 baseos 297 k cyrus-sasl-lib x86_64 2.1.27-21.el9 baseos 774 k debugedit x86_64 5.0-5.el9 appstream 81 k dwz x86_64 0.14-3.el9 appstream 130 k ed x86_64 1.14.2-12.el9 baseos 78 k efi-srpm-macros noarch 6-2.el9_0 appstream 24 k elfutils x86_64 0.191-4.el9 baseos 566 k elfutils-debuginfod-client x86_64 0.191-4.el9 baseos 39 k elfutils-default-yama-scope noarch 0.191-4.el9 baseos 12 k elfutils-libelf x86_64 0.191-4.el9 baseos 210 k elfutils-libs x86_64 0.191-4.el9 baseos 262 k file x86_64 5.39-16.el9 baseos 52 k file-libs x86_64 5.39-16.el9 baseos 593 k filesystem x86_64 3.16-5.el9 baseos 4.8 M fonts-srpm-macros noarch 1:2.0.5-7.el9.1 appstream 29 k forge-srpm-macros noarch 0.4.0-1.el9 epel 19 k fpc-srpm-macros noarch 1.3-7.el9 epel 7.5 k gdb-minimal x86_64 14.2-3.el9 appstream 4.2 M gdbm-libs x86_64 1:1.23-1.el9 baseos 59 k ghc-srpm-macros noarch 1.5.0-6.el9 appstream 9.0 k ghc-srpm-macros-epel noarch 1.9.1-1.el9 epel 7.5 k glibc x86_64 2.34-125.el9_5.3 baseos 2.0 M glibc-common x86_64 2.34-125.el9_5.3 baseos 303 k glibc-gconv-extra x86_64 2.34-125.el9_5.3 baseos 1.7 M gmp x86_64 1:6.2.0-13.el9 baseos 319 k go-srpm-macros noarch 3.6.0-3.el9 appstream 28 k go-srpm-macros-epel noarch 3.6.0.1-1.el9 epel 26 k groff-base x86_64 1.22.4-10.el9 baseos 1.1 M kernel-srpm-macros noarch 1.0-13.el9 appstream 17 k keyutils-libs x86_64 1.6.3-1.el9 baseos 34 k krb5-libs x86_64 1.21.1-4.el9_5 baseos 771 k libacl x86_64 2.3.1-4.el9 baseos 24 k libarchive x86_64 3.5.3-4.el9 baseos 392 k libattr x86_64 2.5.1-3.el9 baseos 20 k libblkid x86_64 2.37.4-20.el9 baseos 109 k libbrotli x86_64 1.0.9-7.el9_5 baseos 316 k libcap x86_64 2.48-9.el9_2 baseos 74 k libcap-ng x86_64 0.8.2-7.el9 baseos 36 k libcom_err x86_64 1.46.5-5.el9 baseos 28 k libcurl x86_64 7.76.1-31.el9 baseos 286 k libdb x86_64 5.3.28-54.el9 baseos 737 k libeconf x86_64 0.4.1-4.el9 baseos 30 k libevent x86_64 2.1.12-8.el9_4 baseos 266 k libfdisk x86_64 2.37.4-20.el9 baseos 155 k libffi x86_64 3.4.2-8.el9 baseos 40 k libgcc x86_64 11.5.0-5.el9_5 baseos 88 k libgcrypt x86_64 1.10.0-11.el9 baseos 510 k libgomp x86_64 11.5.0-5.el9_5 baseos 263 k libgpg-error x86_64 1.42-5.el9 baseos 220 k libidn2 x86_64 2.3.0-7.el9 baseos 105 k libmount x86_64 2.37.4-20.el9 baseos 136 k libnghttp2 x86_64 1.43.0-6.el9 baseos 75 k libpkgconf x86_64 1.7.3-10.el9 baseos 37 k libpsl x86_64 0.21.1-5.el9 baseos 66 k libpwquality x86_64 1.4.4-8.el9 baseos 123 k libselinux x86_64 3.6-1.el9 baseos 88 k libsemanage x86_64 3.6-2.1.el9_5 baseos 120 k libsepol x86_64 3.6-1.el9 baseos 331 k libsigsegv x86_64 2.13-4.el9 baseos 30 k libsmartcols x86_64 2.37.4-20.el9 baseos 64 k libssh x86_64 0.10.4-13.el9 baseos 220 k libssh-config noarch 0.10.4-13.el9 baseos 11 k libstdc++ x86_64 11.5.0-5.el9_5 baseos 742 k libtasn1 x86_64 4.16.0-8.el9_1 baseos 77 k libunistring x86_64 0.9.10-15.el9 baseos 499 k libutempter x86_64 1.2.1-6.el9 baseos 30 k libuuid x86_64 2.37.4-20.el9 baseos 30 k libverto x86_64 0.3.2-3.el9 baseos 24 k libxcrypt x86_64 4.4.18-3.el9 baseos 120 k libxml2 x86_64 2.9.13-6.el9_5.2 baseos 752 k libzstd x86_64 1.5.1-2.el9 baseos 332 k lua-libs x86_64 5.4.4-4.el9 baseos 132 k lua-srpm-macros noarch 1-6.el9 appstream 10 k lz4-libs x86_64 1.9.3-5.el9 baseos 69 k mpfr x86_64 4.1.0-7.el9 baseos 329 k ncurses x86_64 6.2-10.20210508.el9 baseos 410 k ncurses-base noarch 6.2-10.20210508.el9 baseos 99 k ncurses-libs x86_64 6.2-10.20210508.el9 baseos 332 k ocaml-srpm-macros noarch 6-6.el9 appstream 9.1 k openblas-srpm-macros noarch 2-11.el9 appstream 8.6 k openldap x86_64 2.6.6-3.el9 baseos 286 k openssl x86_64 1:3.2.2-6.el9_5.1 baseos 1.4 M openssl-fips-provider x86_64 3.0.7-6.el9_5 baseos 9.4 k openssl-fips-provider-so x86_64 3.0.7-6.el9_5 baseos 577 k openssl-libs x86_64 1:3.2.2-6.el9_5.1 baseos 2.1 M p11-kit x86_64 0.25.3-3.el9_5 baseos 536 k p11-kit-trust x86_64 0.25.3-3.el9_5 baseos 144 k pam x86_64 1.5.1-22.el9_5 baseos 632 k pcre x86_64 8.44-4.el9 baseos 200 k pcre2 x86_64 10.40-6.el9 baseos 236 k pcre2-syntax noarch 10.40-6.el9 baseos 144 k perl-AutoLoader noarch 5.74-481.el9 appstream 21 k perl-B x86_64 1.80-481.el9 appstream 184 k perl-Carp noarch 1.50-460.el9 appstream 31 k perl-Class-Struct noarch 0.66-481.el9 appstream 22 k perl-Data-Dumper x86_64 2.174-462.el9 appstream 59 k perl-Digest noarch 1.19-4.el9 appstream 29 k perl-Digest-MD5 x86_64 2.58-4.el9 appstream 39 k perl-Encode x86_64 4:3.08-462.el9 appstream 1.7 M perl-Errno x86_64 1.30-481.el9 appstream 15 k perl-Exporter noarch 5.74-461.el9 appstream 34 k perl-Fcntl x86_64 1.13-481.el9 appstream 22 k perl-File-Basename noarch 2.85-481.el9 appstream 17 k perl-File-Path noarch 2.18-4.el9 appstream 38 k perl-File-Temp noarch 1:0.231.100-4.el9 appstream 63 k perl-File-stat noarch 1.09-481.el9 appstream 17 k perl-FileHandle noarch 2.03-481.el9 appstream 16 k perl-Getopt-Long noarch 1:2.52-4.el9 appstream 64 k perl-Getopt-Std noarch 1.12-481.el9 appstream 16 k perl-HTTP-Tiny noarch 0.076-462.el9 appstream 57 k perl-IO x86_64 1.43-481.el9 appstream 92 k perl-IO-Socket-IP noarch 0.41-5.el9 appstream 45 k perl-IO-Socket-SSL noarch 2.073-2.el9 appstream 221 k perl-IPC-Open3 noarch 1.21-481.el9 appstream 24 k perl-MIME-Base64 x86_64 3.16-4.el9 appstream 34 k perl-Mozilla-CA noarch 20200520-6.el9 appstream 14 k perl-Net-SSLeay x86_64 1.94-1.el9 appstream 418 k perl-POSIX x86_64 1.94-481.el9 appstream 98 k perl-PathTools x86_64 3.78-461.el9 appstream 92 k perl-Pod-Escapes noarch 1:1.07-460.el9 appstream 22 k perl-Pod-Perldoc noarch 3.28.01-461.el9 appstream 92 k perl-Pod-Simple noarch 1:3.42-4.el9 appstream 229 k perl-Pod-Usage noarch 4:2.01-4.el9 appstream 43 k perl-Scalar-List-Utils x86_64 4:1.56-462.el9 appstream 75 k perl-SelectSaver noarch 1.02-481.el9 appstream 12 k perl-Socket x86_64 4:2.031-4.el9 appstream 58 k perl-Storable x86_64 1:3.21-460.el9 appstream 98 k perl-Symbol noarch 1.08-481.el9 appstream 14 k perl-Term-ANSIColor noarch 5.01-461.el9 appstream 51 k perl-Term-Cap noarch 1.17-460.el9 appstream 24 k perl-Text-ParseWords noarch 3.30-460.el9 appstream 18 k perl-Text-Tabs+Wrap noarch 2013.0523-460.el9 appstream 25 k perl-Time-Local noarch 2:1.300-7.el9 appstream 37 k perl-URI noarch 5.09-3.el9 appstream 125 k perl-base noarch 2.27-481.el9 appstream 16 k perl-constant noarch 1.33-461.el9 appstream 25 k perl-if noarch 0.60.800-481.el9 appstream 14 k perl-interpreter x86_64 4:5.32.1-481.el9 appstream 73 k perl-libnet noarch 3.13-4.el9 appstream 134 k perl-libs x86_64 4:5.32.1-481.el9 appstream 2.2 M perl-mro x86_64 1.23-481.el9 appstream 29 k perl-overload noarch 1.31-481.el9 appstream 46 k perl-overloading noarch 0.02-481.el9 appstream 13 k perl-parent noarch 1:0.238-460.el9 appstream 16 k perl-podlators noarch 1:4.14-460.el9 appstream 118 k perl-srpm-macros noarch 1-41.el9 appstream 9.4 k perl-subs noarch 1.03-481.el9 appstream 12 k perl-vars noarch 1.05-481.el9 appstream 13 k pkgconf x86_64 1.7.3-10.el9 baseos 45 k pkgconf-m4 noarch 1.7.3-10.el9 baseos 16 k pkgconf-pkg-config x86_64 1.7.3-10.el9 baseos 12 k popt x86_64 1.18-8.el9 baseos 69 k publicsuffix-list-dafsa noarch 20210518-3.el9 baseos 59 k pyproject-srpm-macros noarch 1.12.0-1.el9 appstream 14 k python-srpm-macros noarch 3.9-54.el9 appstream 18 k qt5-srpm-macros noarch 5.15.9-1.el9 appstream 9.1 k qt6-srpm-macros noarch 6.6.2-1.el9 epel 8.7 k readline x86_64 8.1-4.el9 baseos 215 k rpm x86_64 4.16.1.3-34.el9 baseos 541 k rpm-build-libs x86_64 4.16.1.3-34.el9 baseos 90 k rpm-libs x86_64 4.16.1.3-34.el9 baseos 311 k rpmautospec-rpm-macros noarch 0.7.3-1.el9 epel 10 k rust-srpm-macros noarch 17-4.el9 appstream 11 k rust-srpm-macros-epel noarch 26.3-1.el9 epel 10 k setup noarch 2.13.7-10.el9 baseos 150 k shadow-utils x86_64 2:4.9-10.el9_5 baseos 1.2 M sqlite-libs x86_64 3.34.1-7.el9_3 baseos 622 k systemd-libs x86_64 252-46.el9_5.3 baseos 680 k tzdata noarch 2025b-1.el9 baseos 842 k util-linux-core x86_64 2.37.4-20.el9 baseos 468 k xz-libs x86_64 5.2.5-8.el9_0 baseos 94 k zip x86_64 3.0-35.el9 baseos 270 k zlib x86_64 1.2.11-40.el9 baseos 93 k zstd x86_64 1.5.1-2.el9 baseos 552 k Transaction Summary ======================================================================================= Install 208 Packages Total size: 69 M Installed size: 219 M Downloading Packages: [SKIPPED] basesystem-11-13.el9.noarch.rpm: Already downloaded [SKIPPED] cpio-2.13-16.el9.x86_64.rpm: Already downloaded [SKIPPED] cracklib-2.9.6-27.el9.x86_64.rpm: Already downloaded [SKIPPED] ed-1.14.2-12.el9.x86_64.rpm: Already downloaded [SKIPPED] grep-3.6-5.el9.x86_64.rpm: Already downloaded [SKIPPED] groff-base-1.22.4-10.el9.x86_64.rpm: Already downloaded [SKIPPED] info-6.7-15.el9.x86_64.rpm: Already downloaded [SKIPPED] libattr-2.5.1-3.el9.x86_64.rpm: Already downloaded [SKIPPED] libcap-ng-0.8.2-7.el9.x86_64.rpm: Already downloaded [SKIPPED] libgpg-error-1.42-5.el9.x86_64.rpm: Already downloaded [SKIPPED] libidn2-2.3.0-7.el9.x86_64.rpm: Already downloaded [SKIPPED] libpsl-0.21.1-5.el9.x86_64.rpm: Already downloaded [SKIPPED] libpwquality-1.4.4-8.el9.x86_64.rpm: Already downloaded [SKIPPED] libsigsegv-2.13-4.el9.x86_64.rpm: Already downloaded [SKIPPED] libunistring-0.9.10-15.el9.x86_64.rpm: Already downloaded [SKIPPED] libutempter-1.2.1-6.el9.x86_64.rpm: Already downloaded [SKIPPED] libverto-0.3.2-3.el9.x86_64.rpm: Already downloaded [SKIPPED] libxcrypt-4.4.18-3.el9.x86_64.rpm: Already downloaded [SKIPPED] libzstd-1.5.1-2.el9.x86_64.rpm: Already downloaded [SKIPPED] lz4-libs-1.9.3-5.el9.x86_64.rpm: Already downloaded [SKIPPED] mpfr-4.1.0-7.el9.x86_64.rpm: Already downloaded [SKIPPED] popt-1.18-8.el9.x86_64.rpm: Already downloaded [SKIPPED] publicsuffix-list-dafsa-20210518-3.el9.noarch.rpm: Already downloaded [SKIPPED] readline-8.1-4.el9.x86_64.rpm: Already downloaded [SKIPPED] sed-4.8-9.el9.x86_64.rpm: Already downloaded [SKIPPED] cracklib-dicts-2.9.6-27.el9.x86_64.rpm: Already downloaded [SKIPPED] diffutils-3.7-12.el9.x86_64.rpm: Already downloaded [SKIPPED] gawk-5.1.0-6.el9.x86_64.rpm: Already downloaded [SKIPPED] xz-5.2.5-8.el9_0.x86_64.rpm: Already downloaded [SKIPPED] xz-libs-5.2.5-8.el9_0.x86_64.rpm: Already downloaded [SKIPPED] zstd-1.5.1-2.el9.x86_64.rpm: Already downloaded [SKIPPED] cyrus-sasl-lib-2.1.27-21.el9.x86_64.rpm: Already downloaded [SKIPPED] gzip-1.12-1.el9.x86_64.rpm: Already downloaded [SKIPPED] libtasn1-4.16.0-8.el9_1.x86_64.rpm: Already downloaded [SKIPPED] keyutils-libs-1.6.3-1.el9.x86_64.rpm: Already downloaded [SKIPPED] libarchive-3.5.3-4.el9.x86_64.rpm: Already downloaded [SKIPPED] libcap-2.48-9.el9_2.x86_64.rpm: Already downloaded [SKIPPED] libpkgconf-1.7.3-10.el9.x86_64.rpm: Already downloaded [SKIPPED] pkgconf-1.7.3-10.el9.x86_64.rpm: Already downloaded [SKIPPED] pkgconf-m4-1.7.3-10.el9.noarch.rpm: Already downloaded [SKIPPED] pkgconf-pkg-config-1.7.3-10.el9.x86_64.rpm: Already downloaded [SKIPPED] zip-3.0-35.el9.x86_64.rpm: Already downloaded [SKIPPED] gmp-6.2.0-13.el9.x86_64.rpm: Already downloaded [SKIPPED] libffi-3.4.2-8.el9.x86_64.rpm: Already downloaded [SKIPPED] lua-libs-5.4.4-4.el9.x86_64.rpm: Already downloaded [SKIPPED] ncurses-6.2-10.20210508.el9.x86_64.rpm: Already downloaded [SKIPPED] ncurses-base-6.2-10.20210508.el9.noarch.rpm: Already downloaded [SKIPPED] ncurses-libs-6.2-10.20210508.el9.x86_64.rpm: Already downloaded [SKIPPED] which-2.21-29.el9.x86_64.rpm: Already downloaded [SKIPPED] zlib-1.2.11-40.el9.x86_64.rpm: Already downloaded [SKIPPED] bash-5.1.8-9.el9.x86_64.rpm: Already downloaded [SKIPPED] file-5.39-16.el9.x86_64.rpm: Already downloaded [SKIPPED] file-libs-5.39-16.el9.x86_64.rpm: Already downloaded [SKIPPED] libacl-2.3.1-4.el9.x86_64.rpm: Already downloaded [SKIPPED] libselinux-3.6-1.el9.x86_64.rpm: Already downloaded [SKIPPED] libsepol-3.6-1.el9.x86_64.rpm: Already downloaded [SKIPPED] openldap-2.6.6-3.el9.x86_64.rpm: Already downloaded [SKIPPED] setup-2.13.7-10.el9.noarch.rpm: Already downloaded [SKIPPED] sqlite-libs-3.34.1-7.el9_3.x86_64.rpm: Already downloaded [SKIPPED] ca-certificates-2024.2.69_v8.0.303-91.4.el9_4.noarch.rpm: Already downloaded [SKIPPED] libcom_err-1.46.5-5.el9.x86_64.rpm: Already downloaded [SKIPPED] libevent-2.1.12-8.el9_4.x86_64.rpm: Already downloaded [SKIPPED] libssh-0.10.4-13.el9.x86_64.rpm: Already downloaded [SKIPPED] libssh-config-0.10.4-13.el9.noarch.rpm: Already downloaded [SKIPPED] alternatives-1.24-1.el9_5.1.x86_64.rpm: Already downloaded [SKIPPED] audit-libs-3.1.5-1.el9.x86_64.rpm: Already downloaded [SKIPPED] binutils-2.35.2-54.el9.x86_64.rpm: Already downloaded [SKIPPED] binutils-gold-2.35.2-54.el9.x86_64.rpm: Already downloaded [SKIPPED] coreutils-8.32-36.el9.x86_64.rpm: Already downloaded [SKIPPED] coreutils-common-8.32-36.el9.x86_64.rpm: Already downloaded [SKIPPED] crypto-policies-20240828-2.git626aa59.el9_5.noarch.rpm: Already downloaded [SKIPPED] curl-7.76.1-31.el9.x86_64.rpm: Already downloaded [SKIPPED] elfutils-0.191-4.el9.x86_64.rpm: Already downloaded [SKIPPED] elfutils-debuginfod-client-0.191-4.el9.x86_64.rpm: Already downloaded [SKIPPED] elfutils-default-yama-scope-0.191-4.el9.noarch.rpm: Already downloaded [SKIPPED] elfutils-libelf-0.191-4.el9.x86_64.rpm: Already downloaded [SKIPPED] elfutils-libs-0.191-4.el9.x86_64.rpm: Already downloaded [SKIPPED] filesystem-3.16-5.el9.x86_64.rpm: Already downloaded [SKIPPED] findutils-4.8.0-7.el9.x86_64.rpm: Already downloaded [SKIPPED] gdbm-libs-1.23-1.el9.x86_64.rpm: Already downloaded [SKIPPED] libblkid-2.37.4-20.el9.x86_64.rpm: Already downloaded [SKIPPED] libcurl-7.76.1-31.el9.x86_64.rpm: Already downloaded [SKIPPED] libdb-5.3.28-54.el9.x86_64.rpm: Already downloaded [SKIPPED] libeconf-0.4.1-4.el9.x86_64.rpm: Already downloaded [SKIPPED] libfdisk-2.37.4-20.el9.x86_64.rpm: Already downloaded [SKIPPED] libgcrypt-1.10.0-11.el9.x86_64.rpm: Already downloaded [SKIPPED] libmount-2.37.4-20.el9.x86_64.rpm: Already downloaded [SKIPPED] libnghttp2-1.43.0-6.el9.x86_64.rpm: Already downloaded [SKIPPED] libsmartcols-2.37.4-20.el9.x86_64.rpm: Already downloaded [SKIPPED] libuuid-2.37.4-20.el9.x86_64.rpm: Already downloaded [SKIPPED] openssl-fips-provider-3.0.7-6.el9_5.x86_64.rpm: Already downloaded [SKIPPED] openssl-fips-provider-so-3.0.7-6.el9_5.x86_64.rpm: Already downloaded [SKIPPED] pcre-8.44-4.el9.x86_64.rpm: Already downloaded [SKIPPED] pcre2-10.40-6.el9.x86_64.rpm: Already downloaded [SKIPPED] pcre2-syntax-10.40-6.el9.noarch.rpm: Already downloaded [SKIPPED] redhat-release-9.5-0.6.el9.x86_64.rpm: Already downloaded [SKIPPED] rpm-4.16.1.3-34.el9.x86_64.rpm: Already downloaded [SKIPPED] rpm-build-libs-4.16.1.3-34.el9.x86_64.rpm: Already downloaded [SKIPPED] rpm-libs-4.16.1.3-34.el9.x86_64.rpm: Already downloaded [SKIPPED] tar-1.34-7.el9.x86_64.rpm: Already downloaded [SKIPPED] util-linux-2.37.4-20.el9.x86_64.rpm: Already downloaded [SKIPPED] util-linux-core-2.37.4-20.el9.x86_64.rpm: Already downloaded [SKIPPED] bzip2-1.0.8-10.el9_5.x86_64.rpm: Already downloaded [SKIPPED] bzip2-libs-1.0.8-10.el9_5.x86_64.rpm: Already downloaded [SKIPPED] krb5-libs-1.21.1-4.el9_5.x86_64.rpm: Already downloaded [SKIPPED] libbrotli-1.0.9-7.el9_5.x86_64.rpm: Already downloaded [SKIPPED] libgcc-11.5.0-5.el9_5.x86_64.rpm: Already downloaded [SKIPPED] libgomp-11.5.0-5.el9_5.x86_64.rpm: Already downloaded [SKIPPED] libsemanage-3.6-2.1.el9_5.x86_64.rpm: Already downloaded [SKIPPED] libstdc++-11.5.0-5.el9_5.x86_64.rpm: Already downloaded [SKIPPED] openssl-3.2.2-6.el9_5.1.x86_64.rpm: Already downloaded [SKIPPED] openssl-libs-3.2.2-6.el9_5.1.x86_64.rpm: Already downloaded [SKIPPED] p11-kit-0.25.3-3.el9_5.x86_64.rpm: Already downloaded [SKIPPED] p11-kit-trust-0.25.3-3.el9_5.x86_64.rpm: Already downloaded [SKIPPED] pam-1.5.1-22.el9_5.x86_64.rpm: Already downloaded [SKIPPED] shadow-utils-4.9-10.el9_5.x86_64.rpm: Already downloaded [SKIPPED] glibc-2.34-125.el9_5.3.x86_64.rpm: Already downloaded [SKIPPED] glibc-common-2.34-125.el9_5.3.x86_64.rpm: Already downloaded [SKIPPED] glibc-gconv-extra-2.34-125.el9_5.3.x86_64.rpm: Already downloaded [SKIPPED] glibc-minimal-langpack-2.34-125.el9_5.3.x86_64.rpm: Already downloaded [SKIPPED] libxml2-2.9.13-6.el9_5.2.x86_64.rpm: Already downloaded [SKIPPED] systemd-libs-252-46.el9_5.3.x86_64.rpm: Already downloaded [SKIPPED] unzip-6.0-58.el9_5.x86_64.rpm: Already downloaded [SKIPPED] tzdata-2025b-1.el9.noarch.rpm: Already downloaded [SKIPPED] ghc-srpm-macros-1.5.0-6.el9.noarch.rpm: Already downloaded [SKIPPED] lua-srpm-macros-1-6.el9.noarch.rpm: Already downloaded [SKIPPED] perl-Data-Dumper-2.174-462.el9.x86_64.rpm: Already downloaded [SKIPPED] perl-Digest-MD5-2.58-4.el9.x86_64.rpm: Already downloaded [SKIPPED] perl-Encode-3.08-462.el9.x86_64.rpm: Already downloaded [SKIPPED] perl-Mozilla-CA-20200520-6.el9.noarch.rpm: Already downloaded [SKIPPED] perl-Pod-Simple-3.42-4.el9.noarch.rpm: Already downloaded [SKIPPED] perl-Term-Cap-1.17-460.el9.noarch.rpm: Already downloaded [SKIPPED] perl-Time-Local-1.300-7.el9.noarch.rpm: Already downloaded [SKIPPED] rust-srpm-macros-17-4.el9.noarch.rpm: Already downloaded [SKIPPED] perl-Pod-Escapes-1.07-460.el9.noarch.rpm: Already downloaded [SKIPPED] perl-Storable-3.21-460.el9.x86_64.rpm: Already downloaded [SKIPPED] perl-podlators-4.14-460.el9.noarch.rpm: Already downloaded [SKIPPED] dwz-0.14-3.el9.x86_64.rpm: Already downloaded [SKIPPED] perl-Exporter-5.74-461.el9.noarch.rpm: Already downloaded [SKIPPED] perl-File-Temp-0.231.100-4.el9.noarch.rpm: Already downloaded [SKIPPED] perl-Getopt-Long-2.52-4.el9.noarch.rpm: Already downloaded [SKIPPED] perl-MIME-Base64-3.16-4.el9.x86_64.rpm: Already downloaded [SKIPPED] perl-Text-Tabs+Wrap-2013.0523-460.el9.noarch.rpm: Already downloaded [SKIPPED] perl-parent-0.238-460.el9.noarch.rpm: Already downloaded [SKIPPED] perl-srpm-macros-1-41.el9.noarch.rpm: Already downloaded [SKIPPED] efi-srpm-macros-6-2.el9_0.noarch.rpm: Already downloaded [SKIPPED] openblas-srpm-macros-2-11.el9.noarch.rpm: Already downloaded [SKIPPED] perl-Digest-1.19-4.el9.noarch.rpm: Already downloaded [SKIPPED] perl-File-Path-2.18-4.el9.noarch.rpm: Already downloaded [SKIPPED] perl-IO-Socket-IP-0.41-5.el9.noarch.rpm: Already downloaded [SKIPPED] perl-Pod-Usage-2.01-4.el9.noarch.rpm: Already downloaded [SKIPPED] perl-Socket-2.031-4.el9.x86_64.rpm: Already downloaded [SKIPPED] perl-Term-ANSIColor-5.01-461.el9.noarch.rpm: Already downloaded [SKIPPED] perl-Text-ParseWords-3.30-460.el9.noarch.rpm: Already downloaded [SKIPPED] perl-URI-5.09-3.el9.noarch.rpm: Already downloaded [SKIPPED] perl-constant-1.33-461.el9.noarch.rpm: Already downloaded [SKIPPED] fonts-srpm-macros-2.0.5-7.el9.1.noarch.rpm: Already downloaded [SKIPPED] ocaml-srpm-macros-6-6.el9.noarch.rpm: Already downloaded [SKIPPED] patch-2.7.6-16.el9.x86_64.rpm: Already downloaded [SKIPPED] perl-Pod-Perldoc-3.28.01-461.el9.noarch.rpm: Already downloaded [SKIPPED] perl-libnet-3.13-4.el9.noarch.rpm: Already downloaded [SKIPPED] perl-Carp-1.50-460.el9.noarch.rpm: Already downloaded [SKIPPED] perl-PathTools-3.78-461.el9.x86_64.rpm: Already downloaded [SKIPPED] kernel-srpm-macros-1.0-13.el9.noarch.rpm: Already downloaded [SKIPPED] qt5-srpm-macros-5.15.9-1.el9.noarch.rpm: Already downloaded [SKIPPED] perl-AutoLoader-5.74-481.el9.noarch.rpm: Already downloaded [SKIPPED] perl-SelectSaver-1.02-481.el9.noarch.rpm: Already downloaded [SKIPPED] perl-if-0.60.800-481.el9.noarch.rpm: Already downloaded [SKIPPED] perl-overloading-0.02-481.el9.noarch.rpm: Already downloaded [SKIPPED] perl-B-1.80-481.el9.x86_64.rpm: Already downloaded [SKIPPED] perl-Class-Struct-0.66-481.el9.noarch.rpm: Already downloaded [SKIPPED] perl-Errno-1.30-481.el9.x86_64.rpm: Already downloaded [SKIPPED] perl-File-Basename-2.85-481.el9.noarch.rpm: Already downloaded [SKIPPED] perl-File-stat-1.09-481.el9.noarch.rpm: Already downloaded [SKIPPED] perl-FileHandle-2.03-481.el9.noarch.rpm: Already downloaded [SKIPPED] perl-Getopt-Std-1.12-481.el9.noarch.rpm: Already downloaded [SKIPPED] perl-HTTP-Tiny-0.076-462.el9.noarch.rpm: Already downloaded [SKIPPED] perl-IO-1.43-481.el9.x86_64.rpm: Already downloaded [SKIPPED] perl-IPC-Open3-1.21-481.el9.noarch.rpm: Already downloaded [SKIPPED] perl-POSIX-1.94-481.el9.x86_64.rpm: Already downloaded [SKIPPED] perl-Symbol-1.08-481.el9.noarch.rpm: Already downloaded [SKIPPED] perl-base-2.27-481.el9.noarch.rpm: Already downloaded [SKIPPED] perl-interpreter-5.32.1-481.el9.x86_64.rpm: Already downloaded [SKIPPED] perl-libs-5.32.1-481.el9.x86_64.rpm: Already downloaded [SKIPPED] perl-mro-1.23-481.el9.x86_64.rpm: Already downloaded [SKIPPED] perl-overload-1.31-481.el9.noarch.rpm: Already downloaded [SKIPPED] perl-vars-1.05-481.el9.noarch.rpm: Already downloaded [SKIPPED] pyproject-srpm-macros-1.12.0-1.el9.noarch.rpm: Already downloaded [SKIPPED] debugedit-5.0-5.el9.x86_64.rpm: Already downloaded [SKIPPED] perl-Fcntl-1.13-481.el9.x86_64.rpm: Already downloaded [SKIPPED] perl-subs-1.03-481.el9.noarch.rpm: Already downloaded [SKIPPED] go-srpm-macros-3.6.0-3.el9.noarch.rpm: Already downloaded [SKIPPED] python-srpm-macros-3.9-54.el9.noarch.rpm: Already downloaded [SKIPPED] redhat-rpm-config-208-1.el9.noarch.rpm: Already downloaded [SKIPPED] gdb-minimal-14.2-3.el9.x86_64.rpm: Already downloaded [SKIPPED] perl-IO-Socket-SSL-2.073-2.el9.noarch.rpm: Already downloaded [SKIPPED] perl-Net-SSLeay-1.94-1.el9.x86_64.rpm: Already downloaded [SKIPPED] perl-Scalar-List-Utils-1.56-462.el9.x86_64.rpm: Already downloaded [SKIPPED] rpm-build-4.16.1.3-34.el9.x86_64.rpm: Already downloaded [SKIPPED] ansible-srpm-macros-1-16.el9.noarch.rpm: Already downloaded [SKIPPED] epel-rpm-macros-9-15.el9.noarch.rpm: Already downloaded [SKIPPED] forge-srpm-macros-0.4.0-1.el9.noarch.rpm: Already downloaded [SKIPPED] fpc-srpm-macros-1.3-7.el9.noarch.rpm: Already downloaded [SKIPPED] ghc-srpm-macros-epel-1.9.1-1.el9.noarch.rpm: Already downloaded [SKIPPED] go-srpm-macros-epel-3.6.0.1-1.el9.noarch.rpm: Already downloaded [SKIPPED] qt6-srpm-macros-6.6.2-1.el9.noarch.rpm: Already downloaded [SKIPPED] rpmautospec-rpm-macros-0.7.3-1.el9.noarch.rpm: Already downloaded [SKIPPED] rust-srpm-macros-epel-26.3-1.el9.noarch.rpm: Already downloaded Red Hat Enterprise Linux - BaseOS 3.5 MB/s | 3.6 kB 00:00 Importing GPG key 0xFD431D51: Userid : "Red Hat, Inc. (release key 2) " Fingerprint: 567E 347A D004 4ADE 55BA 8A5F 199E 2F91 FD43 1D51 From : /usr/share/distribution-gpg-keys/redhat/RPM-GPG-KEY-redhat9-release Key imported successfully Importing GPG key 0x5A6340B3: Userid : "Red Hat, Inc. (auxiliary key 3) " Fingerprint: 7E46 2425 8C40 6535 D56D 6F13 5054 E4A4 5A63 40B3 From : /usr/share/distribution-gpg-keys/redhat/RPM-GPG-KEY-redhat9-release Key imported successfully Extra Packages for Enterprise Linux 9 - x86_64 1.6 MB/s | 1.6 kB 00:00 Importing GPG key 0x3228467C: Userid : "Fedora (epel9) " Fingerprint: FF8A D134 4597 106E CE81 3B91 8A38 72BF 3228 467C From : /usr/share/distribution-gpg-keys/epel/RPM-GPG-KEY-EPEL-9 Key imported successfully Running transaction check Transaction check succeeded. Running transaction test Transaction test succeeded. Running transaction Running scriptlet: filesystem-3.16-5.el9.x86_64 1/1 Preparing : 1/1 Installing : libgcc-11.5.0-5.el9_5.x86_64 1/208 Running scriptlet: libgcc-11.5.0-5.el9_5.x86_64 1/208 Installing : rust-srpm-macros-17-4.el9.noarch 2/208 Installing : redhat-release-9.5-0.6.el9.x86_64 3/208 Installing : setup-2.13.7-10.el9.noarch 4/208 warning: /etc/hosts created as /etc/hosts.rpmnew Running scriptlet: setup-2.13.7-10.el9.noarch 4/208 Installing : filesystem-3.16-5.el9.x86_64 5/208 Installing : basesystem-11-13.el9.noarch 6/208 Installing : rust-srpm-macros-epel-26.3-1.el9.noarch 7/208 Installing : qt6-srpm-macros-6.6.2-1.el9.noarch 8/208 Installing : ghc-srpm-macros-epel-1.9.1-1.el9.noarch 9/208 Installing : fpc-srpm-macros-1.3-7.el9.noarch 10/208 Installing : ansible-srpm-macros-1-16.el9.noarch 11/208 Installing : qt5-srpm-macros-5.15.9-1.el9.noarch 12/208 Installing : ocaml-srpm-macros-6-6.el9.noarch 13/208 Installing : openblas-srpm-macros-2-11.el9.noarch 14/208 Installing : perl-srpm-macros-1-41.el9.noarch 15/208 Installing : ghc-srpm-macros-1.5.0-6.el9.noarch 16/208 Installing : tzdata-2025b-1.el9.noarch 17/208 Installing : pcre2-syntax-10.40-6.el9.noarch 18/208 Installing : coreutils-common-8.32-36.el9.x86_64 19/208 Installing : libssh-config-0.10.4-13.el9.noarch 20/208 Installing : ncurses-base-6.2-10.20210508.el9.noarch 21/208 Installing : ncurses-libs-6.2-10.20210508.el9.x86_64 22/208 Installing : bash-5.1.8-9.el9.x86_64 23/208 Running scriptlet: bash-5.1.8-9.el9.x86_64 23/208 Installing : glibc-common-2.34-125.el9_5.3.x86_64 24/208 Installing : glibc-gconv-extra-2.34-125.el9_5.3.x86_64 25/208 Running scriptlet: glibc-gconv-extra-2.34-125.el9_5.3.x86_64 25/208 Installing : glibc-minimal-langpack-2.34-125.el9_5.3.x86_64 26/208 Running scriptlet: glibc-2.34-125.el9_5.3.x86_64 27/208 Installing : glibc-2.34-125.el9_5.3.x86_64 27/208 Running scriptlet: glibc-2.34-125.el9_5.3.x86_64 27/208 Installing : zlib-1.2.11-40.el9.x86_64 28/208 Installing : xz-libs-5.2.5-8.el9_0.x86_64 29/208 Installing : bzip2-libs-1.0.8-10.el9_5.x86_64 30/208 Installing : libzstd-1.5.1-2.el9.x86_64 31/208 Installing : elfutils-libelf-0.191-4.el9.x86_64 32/208 Installing : libxcrypt-4.4.18-3.el9.x86_64 33/208 Installing : libstdc++-11.5.0-5.el9_5.x86_64 34/208 Installing : libuuid-2.37.4-20.el9.x86_64 35/208 Installing : libattr-2.5.1-3.el9.x86_64 36/208 Installing : libacl-2.3.1-4.el9.x86_64 37/208 Installing : popt-1.18-8.el9.x86_64 38/208 Installing : libcap-2.48-9.el9_2.x86_64 39/208 Installing : gmp-1:6.2.0-13.el9.x86_64 40/208 Installing : lz4-libs-1.9.3-5.el9.x86_64 41/208 Installing : readline-8.1-4.el9.x86_64 42/208 Installing : libcom_err-1.46.5-5.el9.x86_64 43/208 Installing : crypto-policies-20240828-2.git626aa59.el9_5.noar 44/208 Running scriptlet: crypto-policies-20240828-2.git626aa59.el9_5.noar 44/208 Installing : mpfr-4.1.0-7.el9.x86_64 45/208 Installing : dwz-0.14-3.el9.x86_64 46/208 Installing : unzip-6.0-58.el9_5.x86_64 47/208 Installing : file-libs-5.39-16.el9.x86_64 48/208 Installing : file-5.39-16.el9.x86_64 49/208 Installing : sqlite-libs-3.34.1-7.el9_3.x86_64 50/208 Installing : libcap-ng-0.8.2-7.el9.x86_64 51/208 Installing : audit-libs-3.1.5-1.el9.x86_64 52/208 Installing : libsigsegv-2.13-4.el9.x86_64 53/208 Installing : gawk-5.1.0-6.el9.x86_64 54/208 Installing : libunistring-0.9.10-15.el9.x86_64 55/208 Installing : libidn2-2.3.0-7.el9.x86_64 56/208 Installing : libtasn1-4.16.0-8.el9_1.x86_64 57/208 Installing : lua-libs-5.4.4-4.el9.x86_64 58/208 Installing : libsepol-3.6-1.el9.x86_64 59/208 Installing : alternatives-1.24-1.el9_5.1.x86_64 60/208 Installing : libsmartcols-2.37.4-20.el9.x86_64 61/208 Installing : zip-3.0-35.el9.x86_64 62/208 Installing : zstd-1.5.1-2.el9.x86_64 63/208 Running scriptlet: groff-base-1.22.4-10.el9.x86_64 64/208 Installing : groff-base-1.22.4-10.el9.x86_64 64/208 Running scriptlet: groff-base-1.22.4-10.el9.x86_64 64/208 Installing : bzip2-1.0.8-10.el9_5.x86_64 65/208 Installing : libxml2-2.9.13-6.el9_5.2.x86_64 66/208 Installing : info-6.7-15.el9.x86_64 67/208 Installing : ed-1.14.2-12.el9.x86_64 68/208 Installing : cpio-2.13-16.el9.x86_64 69/208 Installing : libgpg-error-1.42-5.el9.x86_64 70/208 Installing : libgcrypt-1.10.0-11.el9.x86_64 71/208 Installing : libverto-0.3.2-3.el9.x86_64 72/208 Installing : diffutils-3.7-12.el9.x86_64 73/208 Installing : keyutils-libs-1.6.3-1.el9.x86_64 74/208 Installing : libpkgconf-1.7.3-10.el9.x86_64 75/208 Installing : pkgconf-1.7.3-10.el9.x86_64 76/208 Installing : libffi-3.4.2-8.el9.x86_64 77/208 Installing : p11-kit-0.25.3-3.el9_5.x86_64 78/208 Installing : p11-kit-trust-0.25.3-3.el9_5.x86_64 79/208 Running scriptlet: p11-kit-trust-0.25.3-3.el9_5.x86_64 79/208 Installing : ncurses-6.2-10.20210508.el9.x86_64 80/208 Installing : gdbm-libs-1:1.23-1.el9.x86_64 81/208 Installing : libdb-5.3.28-54.el9.x86_64 82/208 Installing : libeconf-0.4.1-4.el9.x86_64 83/208 Installing : libnghttp2-1.43.0-6.el9.x86_64 84/208 Installing : pcre-8.44-4.el9.x86_64 85/208 Installing : grep-3.6-5.el9.x86_64 86/208 Installing : xz-5.2.5-8.el9_0.x86_64 87/208 Installing : pcre2-10.40-6.el9.x86_64 88/208 Installing : libselinux-3.6-1.el9.x86_64 89/208 Installing : sed-4.8-9.el9.x86_64 90/208 Installing : findutils-1:4.8.0-7.el9.x86_64 91/208 Installing : openssl-fips-provider-so-3.0.7-6.el9_5.x86_64 92/208 Installing : openssl-fips-provider-3.0.7-6.el9_5.x86_64 93/208 Installing : openssl-libs-1:3.2.2-6.el9_5.1.x86_64 94/208 Installing : coreutils-8.32-36.el9.x86_64 95/208 Running scriptlet: ca-certificates-2024.2.69_v8.0.303-91.4.el9_4.no 96/208 Installing : ca-certificates-2024.2.69_v8.0.303-91.4.el9_4.no 96/208 Running scriptlet: ca-certificates-2024.2.69_v8.0.303-91.4.el9_4.no 96/208 Installing : libblkid-2.37.4-20.el9.x86_64 97/208 Running scriptlet: libblkid-2.37.4-20.el9.x86_64 97/208 Installing : krb5-libs-1.21.1-4.el9_5.x86_64 98/208 Installing : libmount-2.37.4-20.el9.x86_64 99/208 Installing : gzip-1.12-1.el9.x86_64 100/208 Installing : cracklib-2.9.6-27.el9.x86_64 101/208 Installing : systemd-libs-252-46.el9_5.3.x86_64 102/208 Running scriptlet: systemd-libs-252-46.el9_5.3.x86_64 102/208 Installing : libarchive-3.5.3-4.el9.x86_64 103/208 Installing : util-linux-core-2.37.4-20.el9.x86_64 104/208 Running scriptlet: util-linux-core-2.37.4-20.el9.x86_64 104/208 Installing : cracklib-dicts-2.9.6-27.el9.x86_64 105/208 Installing : cyrus-sasl-lib-2.1.27-21.el9.x86_64 106/208 Installing : libssh-0.10.4-13.el9.x86_64 107/208 Installing : libfdisk-2.37.4-20.el9.x86_64 108/208 Installing : perl-Digest-1.19-4.el9.noarch 109/208 Installing : perl-Digest-MD5-2.58-4.el9.x86_64 110/208 Installing : perl-B-1.80-481.el9.x86_64 111/208 Installing : perl-FileHandle-2.03-481.el9.noarch 112/208 Installing : perl-Data-Dumper-2.174-462.el9.x86_64 113/208 Installing : perl-base-2.27-481.el9.noarch 114/208 Installing : perl-libnet-3.13-4.el9.noarch 115/208 Installing : perl-AutoLoader-5.74-481.el9.noarch 116/208 Installing : perl-IO-Socket-IP-0.41-5.el9.noarch 117/208 Installing : perl-URI-5.09-3.el9.noarch 118/208 Installing : perl-Time-Local-2:1.300-7.el9.noarch 119/208 Installing : perl-if-0.60.800-481.el9.noarch 120/208 Installing : perl-Mozilla-CA-20200520-6.el9.noarch 121/208 Installing : perl-Pod-Escapes-1:1.07-460.el9.noarch 122/208 Installing : perl-Text-Tabs+Wrap-2013.0523-460.el9.noarch 123/208 Installing : perl-File-Path-2.18-4.el9.noarch 124/208 Installing : perl-Net-SSLeay-1.94-1.el9.x86_64 125/208 Installing : perl-IO-Socket-SSL-2.073-2.el9.noarch 126/208 Installing : perl-Term-ANSIColor-5.01-461.el9.noarch 127/208 Installing : perl-Class-Struct-0.66-481.el9.noarch 128/208 Installing : perl-Term-Cap-1.17-460.el9.noarch 129/208 Installing : perl-File-Temp-1:0.231.100-4.el9.noarch 130/208 Installing : perl-IPC-Open3-1.21-481.el9.noarch 131/208 Installing : perl-POSIX-1.94-481.el9.x86_64 132/208 Installing : perl-subs-1.03-481.el9.noarch 133/208 Installing : perl-Pod-Simple-1:3.42-4.el9.noarch 134/208 Installing : perl-HTTP-Tiny-0.076-462.el9.noarch 135/208 Installing : perl-Socket-4:2.031-4.el9.x86_64 136/208 Installing : perl-SelectSaver-1.02-481.el9.noarch 137/208 Installing : perl-Symbol-1.08-481.el9.noarch 138/208 Installing : perl-podlators-1:4.14-460.el9.noarch 139/208 Installing : perl-Pod-Perldoc-3.28.01-461.el9.noarch 140/208 Installing : perl-File-stat-1.09-481.el9.noarch 141/208 Installing : perl-Text-ParseWords-3.30-460.el9.noarch 142/208 Installing : perl-overloading-0.02-481.el9.noarch 143/208 Installing : perl-mro-1.23-481.el9.x86_64 144/208 Installing : perl-Fcntl-1.13-481.el9.x86_64 145/208 Installing : perl-Pod-Usage-4:2.01-4.el9.noarch 146/208 Installing : perl-IO-1.43-481.el9.x86_64 147/208 Installing : perl-parent-1:0.238-460.el9.noarch 148/208 Installing : perl-MIME-Base64-3.16-4.el9.x86_64 149/208 Installing : perl-constant-1.33-461.el9.noarch 150/208 Installing : perl-Errno-1.30-481.el9.x86_64 151/208 Installing : perl-File-Basename-2.85-481.el9.noarch 152/208 Installing : perl-Getopt-Std-1.12-481.el9.noarch 153/208 Installing : perl-vars-1.05-481.el9.noarch 154/208 Installing : perl-Storable-1:3.21-460.el9.x86_64 155/208 Installing : perl-Getopt-Long-1:2.52-4.el9.noarch 156/208 Installing : perl-overload-1.31-481.el9.noarch 157/208 Installing : perl-Scalar-List-Utils-4:1.56-462.el9.x86_64 158/208 Installing : perl-Exporter-5.74-461.el9.noarch 159/208 Installing : perl-Carp-1.50-460.el9.noarch 160/208 Installing : perl-PathTools-3.78-461.el9.x86_64 161/208 Installing : perl-Encode-4:3.08-462.el9.x86_64 162/208 Installing : perl-libs-4:5.32.1-481.el9.x86_64 163/208 Installing : perl-interpreter-4:5.32.1-481.el9.x86_64 164/208 Installing : kernel-srpm-macros-1.0-13.el9.noarch 165/208 Installing : openssl-1:3.2.2-6.el9_5.1.x86_64 166/208 Installing : libpwquality-1.4.4-8.el9.x86_64 167/208 Installing : pam-1.5.1-22.el9_5.x86_64 168/208 Installing : libevent-2.1.12-8.el9_4.x86_64 169/208 Installing : tar-2:1.34-7.el9.x86_64 170/208 Installing : libsemanage-3.6-2.1.el9_5.x86_64 171/208 Installing : shadow-utils-2:4.9-10.el9_5.x86_64 172/208 Running scriptlet: libutempter-1.2.1-6.el9.x86_64 173/208 Installing : libutempter-1.2.1-6.el9.x86_64 173/208 Installing : openldap-2.6.6-3.el9.x86_64 174/208 Installing : patch-2.7.6-16.el9.x86_64 175/208 Installing : libbrotli-1.0.9-7.el9_5.x86_64 176/208 Installing : libgomp-11.5.0-5.el9_5.x86_64 177/208 Installing : elfutils-default-yama-scope-0.191-4.el9.noarch 178/208 Running scriptlet: elfutils-default-yama-scope-0.191-4.el9.noarch 178/208 Installing : elfutils-libs-0.191-4.el9.x86_64 179/208 Installing : pkgconf-m4-1.7.3-10.el9.noarch 180/208 Installing : pkgconf-pkg-config-1.7.3-10.el9.x86_64 181/208 Installing : publicsuffix-list-dafsa-20210518-3.el9.noarch 182/208 Installing : libpsl-0.21.1-5.el9.x86_64 183/208 Installing : libcurl-7.76.1-31.el9.x86_64 184/208 Installing : elfutils-debuginfod-client-0.191-4.el9.x86_64 185/208 Installing : binutils-gold-2.35.2-54.el9.x86_64 186/208 Installing : binutils-2.35.2-54.el9.x86_64 187/208 Running scriptlet: binutils-2.35.2-54.el9.x86_64 187/208 Installing : elfutils-0.191-4.el9.x86_64 188/208 Installing : gdb-minimal-14.2-3.el9.x86_64 189/208 Installing : debugedit-5.0-5.el9.x86_64 190/208 Installing : curl-7.76.1-31.el9.x86_64 191/208 Installing : rpm-libs-4.16.1.3-34.el9.x86_64 192/208 Installing : rpm-4.16.1.3-34.el9.x86_64 193/208 Installing : lua-srpm-macros-1-6.el9.noarch 194/208 Installing : efi-srpm-macros-6-2.el9_0.noarch 195/208 Installing : rpmautospec-rpm-macros-0.7.3-1.el9.noarch 196/208 Installing : rpm-build-libs-4.16.1.3-34.el9.x86_64 197/208 Installing : fonts-srpm-macros-1:2.0.5-7.el9.1.noarch 198/208 Installing : go-srpm-macros-3.6.0-3.el9.noarch 199/208 Installing : python-srpm-macros-3.9-54.el9.noarch 200/208 Installing : redhat-rpm-config-208-1.el9.noarch 201/208 Installing : rpm-build-4.16.1.3-34.el9.x86_64 202/208 Installing : pyproject-srpm-macros-1.12.0-1.el9.noarch 203/208 Installing : forge-srpm-macros-0.4.0-1.el9.noarch 204/208 Installing : go-srpm-macros-epel-3.6.0.1-1.el9.noarch 205/208 Installing : epel-rpm-macros-9-15.el9.noarch 206/208 Installing : util-linux-2.37.4-20.el9.x86_64 207/208 Installing : which-2.21-29.el9.x86_64 208/208 Running scriptlet: filesystem-3.16-5.el9.x86_64 208/208 Running scriptlet: ca-certificates-2024.2.69_v8.0.303-91.4.el9_4.no 208/208 Running scriptlet: rpm-4.16.1.3-34.el9.x86_64 208/208 Running scriptlet: which-2.21-29.el9.x86_64 208/208 Installed products updated. Installed: alternatives-1.24-1.el9_5.1.x86_64 ansible-srpm-macros-1-16.el9.noarch audit-libs-3.1.5-1.el9.x86_64 basesystem-11-13.el9.noarch bash-5.1.8-9.el9.x86_64 binutils-2.35.2-54.el9.x86_64 binutils-gold-2.35.2-54.el9.x86_64 bzip2-1.0.8-10.el9_5.x86_64 bzip2-libs-1.0.8-10.el9_5.x86_64 ca-certificates-2024.2.69_v8.0.303-91.4.el9_4.noarch coreutils-8.32-36.el9.x86_64 coreutils-common-8.32-36.el9.x86_64 cpio-2.13-16.el9.x86_64 cracklib-2.9.6-27.el9.x86_64 cracklib-dicts-2.9.6-27.el9.x86_64 crypto-policies-20240828-2.git626aa59.el9_5.noarch curl-7.76.1-31.el9.x86_64 cyrus-sasl-lib-2.1.27-21.el9.x86_64 debugedit-5.0-5.el9.x86_64 diffutils-3.7-12.el9.x86_64 dwz-0.14-3.el9.x86_64 ed-1.14.2-12.el9.x86_64 efi-srpm-macros-6-2.el9_0.noarch elfutils-0.191-4.el9.x86_64 elfutils-debuginfod-client-0.191-4.el9.x86_64 elfutils-default-yama-scope-0.191-4.el9.noarch elfutils-libelf-0.191-4.el9.x86_64 elfutils-libs-0.191-4.el9.x86_64 epel-rpm-macros-9-15.el9.noarch file-5.39-16.el9.x86_64 file-libs-5.39-16.el9.x86_64 filesystem-3.16-5.el9.x86_64 findutils-1:4.8.0-7.el9.x86_64 fonts-srpm-macros-1:2.0.5-7.el9.1.noarch forge-srpm-macros-0.4.0-1.el9.noarch fpc-srpm-macros-1.3-7.el9.noarch gawk-5.1.0-6.el9.x86_64 gdb-minimal-14.2-3.el9.x86_64 gdbm-libs-1:1.23-1.el9.x86_64 ghc-srpm-macros-1.5.0-6.el9.noarch ghc-srpm-macros-epel-1.9.1-1.el9.noarch glibc-2.34-125.el9_5.3.x86_64 glibc-common-2.34-125.el9_5.3.x86_64 glibc-gconv-extra-2.34-125.el9_5.3.x86_64 glibc-minimal-langpack-2.34-125.el9_5.3.x86_64 gmp-1:6.2.0-13.el9.x86_64 go-srpm-macros-3.6.0-3.el9.noarch go-srpm-macros-epel-3.6.0.1-1.el9.noarch grep-3.6-5.el9.x86_64 groff-base-1.22.4-10.el9.x86_64 gzip-1.12-1.el9.x86_64 info-6.7-15.el9.x86_64 kernel-srpm-macros-1.0-13.el9.noarch keyutils-libs-1.6.3-1.el9.x86_64 krb5-libs-1.21.1-4.el9_5.x86_64 libacl-2.3.1-4.el9.x86_64 libarchive-3.5.3-4.el9.x86_64 libattr-2.5.1-3.el9.x86_64 libblkid-2.37.4-20.el9.x86_64 libbrotli-1.0.9-7.el9_5.x86_64 libcap-2.48-9.el9_2.x86_64 libcap-ng-0.8.2-7.el9.x86_64 libcom_err-1.46.5-5.el9.x86_64 libcurl-7.76.1-31.el9.x86_64 libdb-5.3.28-54.el9.x86_64 libeconf-0.4.1-4.el9.x86_64 libevent-2.1.12-8.el9_4.x86_64 libfdisk-2.37.4-20.el9.x86_64 libffi-3.4.2-8.el9.x86_64 libgcc-11.5.0-5.el9_5.x86_64 libgcrypt-1.10.0-11.el9.x86_64 libgomp-11.5.0-5.el9_5.x86_64 libgpg-error-1.42-5.el9.x86_64 libidn2-2.3.0-7.el9.x86_64 libmount-2.37.4-20.el9.x86_64 libnghttp2-1.43.0-6.el9.x86_64 libpkgconf-1.7.3-10.el9.x86_64 libpsl-0.21.1-5.el9.x86_64 libpwquality-1.4.4-8.el9.x86_64 libselinux-3.6-1.el9.x86_64 libsemanage-3.6-2.1.el9_5.x86_64 libsepol-3.6-1.el9.x86_64 libsigsegv-2.13-4.el9.x86_64 libsmartcols-2.37.4-20.el9.x86_64 libssh-0.10.4-13.el9.x86_64 libssh-config-0.10.4-13.el9.noarch libstdc++-11.5.0-5.el9_5.x86_64 libtasn1-4.16.0-8.el9_1.x86_64 libunistring-0.9.10-15.el9.x86_64 libutempter-1.2.1-6.el9.x86_64 libuuid-2.37.4-20.el9.x86_64 libverto-0.3.2-3.el9.x86_64 libxcrypt-4.4.18-3.el9.x86_64 libxml2-2.9.13-6.el9_5.2.x86_64 libzstd-1.5.1-2.el9.x86_64 lua-libs-5.4.4-4.el9.x86_64 lua-srpm-macros-1-6.el9.noarch lz4-libs-1.9.3-5.el9.x86_64 mpfr-4.1.0-7.el9.x86_64 ncurses-6.2-10.20210508.el9.x86_64 ncurses-base-6.2-10.20210508.el9.noarch ncurses-libs-6.2-10.20210508.el9.x86_64 ocaml-srpm-macros-6-6.el9.noarch openblas-srpm-macros-2-11.el9.noarch openldap-2.6.6-3.el9.x86_64 openssl-1:3.2.2-6.el9_5.1.x86_64 openssl-fips-provider-3.0.7-6.el9_5.x86_64 openssl-fips-provider-so-3.0.7-6.el9_5.x86_64 openssl-libs-1:3.2.2-6.el9_5.1.x86_64 p11-kit-0.25.3-3.el9_5.x86_64 p11-kit-trust-0.25.3-3.el9_5.x86_64 pam-1.5.1-22.el9_5.x86_64 patch-2.7.6-16.el9.x86_64 pcre-8.44-4.el9.x86_64 pcre2-10.40-6.el9.x86_64 pcre2-syntax-10.40-6.el9.noarch perl-AutoLoader-5.74-481.el9.noarch perl-B-1.80-481.el9.x86_64 perl-Carp-1.50-460.el9.noarch perl-Class-Struct-0.66-481.el9.noarch perl-Data-Dumper-2.174-462.el9.x86_64 perl-Digest-1.19-4.el9.noarch perl-Digest-MD5-2.58-4.el9.x86_64 perl-Encode-4:3.08-462.el9.x86_64 perl-Errno-1.30-481.el9.x86_64 perl-Exporter-5.74-461.el9.noarch perl-Fcntl-1.13-481.el9.x86_64 perl-File-Basename-2.85-481.el9.noarch perl-File-Path-2.18-4.el9.noarch perl-File-Temp-1:0.231.100-4.el9.noarch perl-File-stat-1.09-481.el9.noarch perl-FileHandle-2.03-481.el9.noarch perl-Getopt-Long-1:2.52-4.el9.noarch perl-Getopt-Std-1.12-481.el9.noarch perl-HTTP-Tiny-0.076-462.el9.noarch perl-IO-1.43-481.el9.x86_64 perl-IO-Socket-IP-0.41-5.el9.noarch perl-IO-Socket-SSL-2.073-2.el9.noarch perl-IPC-Open3-1.21-481.el9.noarch perl-MIME-Base64-3.16-4.el9.x86_64 perl-Mozilla-CA-20200520-6.el9.noarch perl-Net-SSLeay-1.94-1.el9.x86_64 perl-POSIX-1.94-481.el9.x86_64 perl-PathTools-3.78-461.el9.x86_64 perl-Pod-Escapes-1:1.07-460.el9.noarch perl-Pod-Perldoc-3.28.01-461.el9.noarch perl-Pod-Simple-1:3.42-4.el9.noarch perl-Pod-Usage-4:2.01-4.el9.noarch perl-Scalar-List-Utils-4:1.56-462.el9.x86_64 perl-SelectSaver-1.02-481.el9.noarch perl-Socket-4:2.031-4.el9.x86_64 perl-Storable-1:3.21-460.el9.x86_64 perl-Symbol-1.08-481.el9.noarch perl-Term-ANSIColor-5.01-461.el9.noarch perl-Term-Cap-1.17-460.el9.noarch perl-Text-ParseWords-3.30-460.el9.noarch perl-Text-Tabs+Wrap-2013.0523-460.el9.noarch perl-Time-Local-2:1.300-7.el9.noarch perl-URI-5.09-3.el9.noarch perl-base-2.27-481.el9.noarch perl-constant-1.33-461.el9.noarch perl-if-0.60.800-481.el9.noarch perl-interpreter-4:5.32.1-481.el9.x86_64 perl-libnet-3.13-4.el9.noarch perl-libs-4:5.32.1-481.el9.x86_64 perl-mro-1.23-481.el9.x86_64 perl-overload-1.31-481.el9.noarch perl-overloading-0.02-481.el9.noarch perl-parent-1:0.238-460.el9.noarch perl-podlators-1:4.14-460.el9.noarch perl-srpm-macros-1-41.el9.noarch perl-subs-1.03-481.el9.noarch perl-vars-1.05-481.el9.noarch pkgconf-1.7.3-10.el9.x86_64 pkgconf-m4-1.7.3-10.el9.noarch pkgconf-pkg-config-1.7.3-10.el9.x86_64 popt-1.18-8.el9.x86_64 publicsuffix-list-dafsa-20210518-3.el9.noarch pyproject-srpm-macros-1.12.0-1.el9.noarch python-srpm-macros-3.9-54.el9.noarch qt5-srpm-macros-5.15.9-1.el9.noarch qt6-srpm-macros-6.6.2-1.el9.noarch readline-8.1-4.el9.x86_64 redhat-release-9.5-0.6.el9.x86_64 redhat-rpm-config-208-1.el9.noarch rpm-4.16.1.3-34.el9.x86_64 rpm-build-4.16.1.3-34.el9.x86_64 rpm-build-libs-4.16.1.3-34.el9.x86_64 rpm-libs-4.16.1.3-34.el9.x86_64 rpmautospec-rpm-macros-0.7.3-1.el9.noarch rust-srpm-macros-17-4.el9.noarch rust-srpm-macros-epel-26.3-1.el9.noarch sed-4.8-9.el9.x86_64 setup-2.13.7-10.el9.noarch shadow-utils-2:4.9-10.el9_5.x86_64 sqlite-libs-3.34.1-7.el9_3.x86_64 systemd-libs-252-46.el9_5.3.x86_64 tar-2:1.34-7.el9.x86_64 tzdata-2025b-1.el9.noarch unzip-6.0-58.el9_5.x86_64 util-linux-2.37.4-20.el9.x86_64 util-linux-core-2.37.4-20.el9.x86_64 which-2.21-29.el9.x86_64 xz-5.2.5-8.el9_0.x86_64 xz-libs-5.2.5-8.el9_0.x86_64 zip-3.0-35.el9.x86_64 zlib-1.2.11-40.el9.x86_64 zstd-1.5.1-2.el9.x86_64 Complete! Finish: installing minimal buildroot with dnf Start: creating root cache Finish: creating root cache Finish: chroot init INFO: Installed packages: INFO: alternatives-1.24-1.el9_5.1.x86_64 ansible-srpm-macros-1-16.el9.noarch audit-libs-3.1.5-1.el9.x86_64 basesystem-11-13.el9.noarch bash-5.1.8-9.el9.x86_64 binutils-2.35.2-54.el9.x86_64 binutils-gold-2.35.2-54.el9.x86_64 bzip2-1.0.8-10.el9_5.x86_64 bzip2-libs-1.0.8-10.el9_5.x86_64 ca-certificates-2024.2.69_v8.0.303-91.4.el9_4.noarch coreutils-8.32-36.el9.x86_64 coreutils-common-8.32-36.el9.x86_64 cpio-2.13-16.el9.x86_64 cracklib-2.9.6-27.el9.x86_64 cracklib-dicts-2.9.6-27.el9.x86_64 crypto-policies-20240828-2.git626aa59.el9_5.noarch curl-7.76.1-31.el9.x86_64 cyrus-sasl-lib-2.1.27-21.el9.x86_64 debugedit-5.0-5.el9.x86_64 diffutils-3.7-12.el9.x86_64 dwz-0.14-3.el9.x86_64 ed-1.14.2-12.el9.x86_64 efi-srpm-macros-6-2.el9_0.noarch elfutils-0.191-4.el9.x86_64 elfutils-debuginfod-client-0.191-4.el9.x86_64 elfutils-default-yama-scope-0.191-4.el9.noarch elfutils-libelf-0.191-4.el9.x86_64 elfutils-libs-0.191-4.el9.x86_64 epel-rpm-macros-9-15.el9.noarch file-5.39-16.el9.x86_64 file-libs-5.39-16.el9.x86_64 filesystem-3.16-5.el9.x86_64 findutils-4.8.0-7.el9.x86_64 fonts-srpm-macros-2.0.5-7.el9.1.noarch forge-srpm-macros-0.4.0-1.el9.noarch fpc-srpm-macros-1.3-7.el9.noarch gawk-5.1.0-6.el9.x86_64 gdb-minimal-14.2-3.el9.x86_64 gdbm-libs-1.23-1.el9.x86_64 ghc-srpm-macros-1.5.0-6.el9.noarch ghc-srpm-macros-epel-1.9.1-1.el9.noarch glibc-2.34-125.el9_5.3.x86_64 glibc-common-2.34-125.el9_5.3.x86_64 glibc-gconv-extra-2.34-125.el9_5.3.x86_64 glibc-minimal-langpack-2.34-125.el9_5.3.x86_64 gmp-6.2.0-13.el9.x86_64 go-srpm-macros-3.6.0-3.el9.noarch go-srpm-macros-epel-3.6.0.1-1.el9.noarch gpg-pubkey-3228467c-613798eb gpg-pubkey-5a6340b3-6229229e gpg-pubkey-fd431d51-4ae0493b grep-3.6-5.el9.x86_64 groff-base-1.22.4-10.el9.x86_64 gzip-1.12-1.el9.x86_64 info-6.7-15.el9.x86_64 kernel-srpm-macros-1.0-13.el9.noarch keyutils-libs-1.6.3-1.el9.x86_64 krb5-libs-1.21.1-4.el9_5.x86_64 libacl-2.3.1-4.el9.x86_64 libarchive-3.5.3-4.el9.x86_64 libattr-2.5.1-3.el9.x86_64 libblkid-2.37.4-20.el9.x86_64 libbrotli-1.0.9-7.el9_5.x86_64 libcap-2.48-9.el9_2.x86_64 libcap-ng-0.8.2-7.el9.x86_64 libcom_err-1.46.5-5.el9.x86_64 libcurl-7.76.1-31.el9.x86_64 libdb-5.3.28-54.el9.x86_64 libeconf-0.4.1-4.el9.x86_64 libevent-2.1.12-8.el9_4.x86_64 libfdisk-2.37.4-20.el9.x86_64 libffi-3.4.2-8.el9.x86_64 libgcc-11.5.0-5.el9_5.x86_64 libgcrypt-1.10.0-11.el9.x86_64 libgomp-11.5.0-5.el9_5.x86_64 libgpg-error-1.42-5.el9.x86_64 libidn2-2.3.0-7.el9.x86_64 libmount-2.37.4-20.el9.x86_64 libnghttp2-1.43.0-6.el9.x86_64 libpkgconf-1.7.3-10.el9.x86_64 libpsl-0.21.1-5.el9.x86_64 libpwquality-1.4.4-8.el9.x86_64 libselinux-3.6-1.el9.x86_64 libsemanage-3.6-2.1.el9_5.x86_64 libsepol-3.6-1.el9.x86_64 libsigsegv-2.13-4.el9.x86_64 libsmartcols-2.37.4-20.el9.x86_64 libssh-0.10.4-13.el9.x86_64 libssh-config-0.10.4-13.el9.noarch libstdc++-11.5.0-5.el9_5.x86_64 libtasn1-4.16.0-8.el9_1.x86_64 libunistring-0.9.10-15.el9.x86_64 libutempter-1.2.1-6.el9.x86_64 libuuid-2.37.4-20.el9.x86_64 libverto-0.3.2-3.el9.x86_64 libxcrypt-4.4.18-3.el9.x86_64 libxml2-2.9.13-6.el9_5.2.x86_64 libzstd-1.5.1-2.el9.x86_64 lua-libs-5.4.4-4.el9.x86_64 lua-srpm-macros-1-6.el9.noarch lz4-libs-1.9.3-5.el9.x86_64 mpfr-4.1.0-7.el9.x86_64 ncurses-6.2-10.20210508.el9.x86_64 ncurses-base-6.2-10.20210508.el9.noarch ncurses-libs-6.2-10.20210508.el9.x86_64 ocaml-srpm-macros-6-6.el9.noarch openblas-srpm-macros-2-11.el9.noarch openldap-2.6.6-3.el9.x86_64 openssl-3.2.2-6.el9_5.1.x86_64 openssl-fips-provider-3.0.7-6.el9_5.x86_64 openssl-fips-provider-so-3.0.7-6.el9_5.x86_64 openssl-libs-3.2.2-6.el9_5.1.x86_64 p11-kit-0.25.3-3.el9_5.x86_64 p11-kit-trust-0.25.3-3.el9_5.x86_64 pam-1.5.1-22.el9_5.x86_64 patch-2.7.6-16.el9.x86_64 pcre-8.44-4.el9.x86_64 pcre2-10.40-6.el9.x86_64 pcre2-syntax-10.40-6.el9.noarch perl-AutoLoader-5.74-481.el9.noarch perl-B-1.80-481.el9.x86_64 perl-Carp-1.50-460.el9.noarch perl-Class-Struct-0.66-481.el9.noarch perl-Data-Dumper-2.174-462.el9.x86_64 perl-Digest-1.19-4.el9.noarch perl-Digest-MD5-2.58-4.el9.x86_64 perl-Encode-3.08-462.el9.x86_64 perl-Errno-1.30-481.el9.x86_64 perl-Exporter-5.74-461.el9.noarch perl-Fcntl-1.13-481.el9.x86_64 perl-File-Basename-2.85-481.el9.noarch perl-File-Path-2.18-4.el9.noarch perl-File-Temp-0.231.100-4.el9.noarch perl-File-stat-1.09-481.el9.noarch perl-FileHandle-2.03-481.el9.noarch perl-Getopt-Long-2.52-4.el9.noarch perl-Getopt-Std-1.12-481.el9.noarch perl-HTTP-Tiny-0.076-462.el9.noarch perl-IO-1.43-481.el9.x86_64 perl-IO-Socket-IP-0.41-5.el9.noarch perl-IO-Socket-SSL-2.073-2.el9.noarch perl-IPC-Open3-1.21-481.el9.noarch perl-MIME-Base64-3.16-4.el9.x86_64 perl-Mozilla-CA-20200520-6.el9.noarch perl-Net-SSLeay-1.94-1.el9.x86_64 perl-POSIX-1.94-481.el9.x86_64 perl-PathTools-3.78-461.el9.x86_64 perl-Pod-Escapes-1.07-460.el9.noarch perl-Pod-Perldoc-3.28.01-461.el9.noarch perl-Pod-Simple-3.42-4.el9.noarch perl-Pod-Usage-2.01-4.el9.noarch perl-Scalar-List-Utils-1.56-462.el9.x86_64 perl-SelectSaver-1.02-481.el9.noarch perl-Socket-2.031-4.el9.x86_64 perl-Storable-3.21-460.el9.x86_64 perl-Symbol-1.08-481.el9.noarch perl-Term-ANSIColor-5.01-461.el9.noarch perl-Term-Cap-1.17-460.el9.noarch perl-Text-ParseWords-3.30-460.el9.noarch perl-Text-Tabs+Wrap-2013.0523-460.el9.noarch perl-Time-Local-1.300-7.el9.noarch perl-URI-5.09-3.el9.noarch perl-base-2.27-481.el9.noarch perl-constant-1.33-461.el9.noarch perl-if-0.60.800-481.el9.noarch perl-interpreter-5.32.1-481.el9.x86_64 perl-libnet-3.13-4.el9.noarch perl-libs-5.32.1-481.el9.x86_64 perl-mro-1.23-481.el9.x86_64 perl-overload-1.31-481.el9.noarch perl-overloading-0.02-481.el9.noarch perl-parent-0.238-460.el9.noarch perl-podlators-4.14-460.el9.noarch perl-srpm-macros-1-41.el9.noarch perl-subs-1.03-481.el9.noarch perl-vars-1.05-481.el9.noarch pkgconf-1.7.3-10.el9.x86_64 pkgconf-m4-1.7.3-10.el9.noarch pkgconf-pkg-config-1.7.3-10.el9.x86_64 popt-1.18-8.el9.x86_64 publicsuffix-list-dafsa-20210518-3.el9.noarch pyproject-srpm-macros-1.12.0-1.el9.noarch python-srpm-macros-3.9-54.el9.noarch qt5-srpm-macros-5.15.9-1.el9.noarch qt6-srpm-macros-6.6.2-1.el9.noarch readline-8.1-4.el9.x86_64 redhat-release-9.5-0.6.el9.x86_64 redhat-rpm-config-208-1.el9.noarch rpm-4.16.1.3-34.el9.x86_64 rpm-build-4.16.1.3-34.el9.x86_64 rpm-build-libs-4.16.1.3-34.el9.x86_64 rpm-libs-4.16.1.3-34.el9.x86_64 rpmautospec-rpm-macros-0.7.3-1.el9.noarch rust-srpm-macros-17-4.el9.noarch rust-srpm-macros-epel-26.3-1.el9.noarch sed-4.8-9.el9.x86_64 setup-2.13.7-10.el9.noarch shadow-utils-4.9-10.el9_5.x86_64 sqlite-libs-3.34.1-7.el9_3.x86_64 systemd-libs-252-46.el9_5.3.x86_64 tar-1.34-7.el9.x86_64 tzdata-2025b-1.el9.noarch unzip-6.0-58.el9_5.x86_64 util-linux-2.37.4-20.el9.x86_64 util-linux-core-2.37.4-20.el9.x86_64 which-2.21-29.el9.x86_64 xz-5.2.5-8.el9_0.x86_64 xz-libs-5.2.5-8.el9_0.x86_64 zip-3.0-35.el9.x86_64 zlib-1.2.11-40.el9.x86_64 zstd-1.5.1-2.el9.x86_64 Start: buildsrpm Start: rpmbuild -bs Building target platforms: x86_64 Building for target x86_64 setting SOURCE_DATE_EPOCH=1570060800 Wrote: /builddir/build/SRPMS/python-textile-3.0.4-5.el9.src.rpm Finish: rpmbuild -bs INFO: chroot_scan: 3 files copied to /var/lib/copr-rpmbuild/results/chroot_scan INFO: /var/lib/mock/rhel+epel-9-x86_64-1743686669.797466/root/var/log/dnf.log /var/lib/mock/rhel+epel-9-x86_64-1743686669.797466/root/var/log/dnf.librepo.log /var/lib/mock/rhel+epel-9-x86_64-1743686669.797466/root/var/log/dnf.rpm.log INFO: chroot_scan: creating tarball /var/lib/copr-rpmbuild/results/chroot_scan.tar.gz /bin/tar: Removing leading `/' from member names Finish: buildsrpm INFO: Done(/var/lib/copr-rpmbuild/workspace/workdir-zepkhc6_/python-textile/python-textile.spec) Config(child) 0 minutes 9 seconds INFO: Results and/or logs in: /var/lib/copr-rpmbuild/results INFO: Cleaning up build root ('cleanup_on_success=True') Start: clean chroot INFO: unmounting tmpfs. Finish: clean chroot INFO: Start(/var/lib/copr-rpmbuild/results/python-textile-3.0.4-5.el9.src.rpm) Config(rhel+epel-9-x86_64) Start: chroot init INFO: mounting tmpfs at /var/lib/mock/rhel+epel-9-x86_64-1743686669.797466/root. INFO: calling preinit hooks INFO: enabled root cache Start: unpacking root cache Finish: unpacking root cache INFO: enabled package manager cache Start: cleaning package manager metadata Finish: cleaning package manager metadata INFO: enabled HW Info plugin INFO: Buildroot is handled by package management from host and used with --installroot: rpm-4.20.1-1.fc41.x86_64 rpm-sequoia-1.7.0-2.fc41.x86_64 python3-dnf-4.23.0-1.fc41.noarch python3-dnf-plugins-core-4.10.1-1.fc41.noarch dnf5-5.2.12.0-1.fc41.x86_64 dnf5-plugins-5.2.12.0-1.fc41.x86_64 Finish: chroot init Start: build phase for python-textile-3.0.4-5.el9.src.rpm Start: build setup for python-textile-3.0.4-5.el9.src.rpm Building target platforms: x86_64 Building for target x86_64 setting SOURCE_DATE_EPOCH=1570060800 Wrote: /builddir/build/SRPMS/python-textile-3.0.4-5.el9.src.rpm No matches found for the following disable plugin patterns: local, spacewalk, versionlock Updating Subscription Management repositories. Unable to read consumer identity This system is not registered with an entitlement server. You can use subscription-manager to register. Copr repository 158 kB/s | 2.1 kB 00:00 Additional repo copr_ligenix_enterprise_buildto 157 kB/s | 2.1 kB 00:00 Red Hat Enterprise Linux - BaseOS 55 kB/s | 4.1 kB 00:00 Red Hat Enterprise Linux - AppStream 80 kB/s | 4.5 kB 00:00 Red Hat Enterprise Linux - CodeReady Linux Buil 57 kB/s | 4.5 kB 00:00 Extra Packages for Enterprise Linux 9 - x86_64 114 kB/s | 32 kB 00:00 Package findutils-1:4.8.0-7.el9.x86_64 is already installed. Package sed-4.8-9.el9.x86_64 is already installed. Dependencies resolved. ================================================================================ Package Arch Version Repository Size ================================================================================ Installing: python3-devel x86_64 3.9.21-1.el9_5 appstream 249 k python3-html5lib noarch 1:1.1-8.el9 epel 209 k python3-pillow x86_64 10.0.1-1.el9 epel 729 k python3-pytest noarch 6.2.2-7.el9 appstream 523 k python3-pytest-cov noarch 4.0.0-2.el9 epel 41 k python3-pytest-runner noarch 4.0-15.el9 epel 17 k python3-regex x86_64 2024.11.6-1.el9 epel 357 k python3-setuptools noarch 53.0.0-13.el9 baseos 947 k python3-six noarch 1.15.0-9.el9 baseos 40 k Installing dependencies: expat x86_64 2.5.0-3.el9_5.3 baseos 119 k freetype x86_64 2.10.4-10.el9_5 baseos 389 k fribidi x86_64 1.0.10-6.el9.2 appstream 89 k glib2 x86_64 2.68.4-14.el9_4.1 baseos 2.6 M gnutls x86_64 3.8.3-4.el9_4 baseos 1.1 M graphite2 x86_64 1.3.14-9.el9 baseos 98 k harfbuzz x86_64 2.7.4-10.el9 baseos 629 k jbigkit-libs x86_64 2.1-23.el9 appstream 56 k lcms2 x86_64 2.12-3.el9 appstream 169 k libXau x86_64 1.0.9-8.el9 appstream 34 k libimagequant x86_64 2.17.0-1.el9 epel 62 k libjpeg-turbo x86_64 2.0.90-7.el9 appstream 178 k libpng x86_64 2:1.6.37-12.el9 baseos 119 k libraqm x86_64 0.8.0-1.el9 epel 19 k libtiff x86_64 4.4.0-13.el9 appstream 201 k libwebp x86_64 1.2.0-8.el9_3 appstream 282 k libxcb x86_64 1.13.1-9.el9 appstream 247 k nettle x86_64 3.9.1-1.el9 baseos 564 k openjpeg2 x86_64 2.4.0-7.el9 appstream 166 k pyproject-rpm-macros noarch 1.12.0-1.el9 codeready-builder 43 k python-rpm-macros noarch 3.9-54.el9 appstream 16 k python3 x86_64 3.9.21-1.el9_5 baseos 30 k python3-attrs noarch 20.3.0-7.el9 appstream 91 k python3-coverage x86_64 6.2-1.el9 epel 257 k python3-coverage+toml x86_64 6.2-1.el9 epel 9.2 k python3-iniconfig noarch 1.1.1-7.el9 appstream 21 k python3-libs x86_64 3.9.21-1.el9_5 baseos 8.1 M python3-olefile noarch 0.46-15.el9 epel 56 k python3-packaging noarch 20.9-5.el9 appstream 81 k python3-pip-wheel noarch 21.3.1-1.el9 baseos 1.1 M python3-pluggy noarch 0.13.1-7.el9 appstream 45 k python3-py noarch 1.10.0-6.el9 appstream 481 k python3-pyparsing noarch 2.4.7-9.el9 baseos 154 k python3-rpm-generators noarch 12-9.el9 appstream 29 k python3-rpm-macros noarch 3.9-54.el9 appstream 10 k python3-setuptools-wheel noarch 53.0.0-13.el9 baseos 469 k python3-toml noarch 0.10.2-6.el9 appstream 46 k python3-tomli noarch 2.0.1-5.el9 appstream 37 k python3-webencodings noarch 0.5.1-17.el9 epel 27 k Transaction Summary ================================================================================ Install 48 Packages Total size: 21 M Total download size: 8.7 M Installed size: 77 M Downloading Packages: [SKIPPED] python3-pyparsing-2.4.7-9.el9.noarch.rpm: Already downloaded [SKIPPED] python3-pip-wheel-21.3.1-1.el9.noarch.rpm: Already downloaded [SKIPPED] python3-setuptools-53.0.0-13.el9.noarch.rpm: Already downloaded [SKIPPED] python3-setuptools-wheel-53.0.0-13.el9.noarch.rpm: Already downloaded [SKIPPED] python3-3.9.21-1.el9_5.x86_64.rpm: Already downloaded [SKIPPED] python3-libs-3.9.21-1.el9_5.x86_64.rpm: Already downloaded [SKIPPED] expat-2.5.0-3.el9_5.3.x86_64.rpm: Already downloaded [SKIPPED] python3-attrs-20.3.0-7.el9.noarch.rpm: Already downloaded [SKIPPED] python3-packaging-20.9-5.el9.noarch.rpm: Already downloaded [SKIPPED] python3-toml-0.10.2-6.el9.noarch.rpm: Already downloaded [SKIPPED] python3-pluggy-0.13.1-7.el9.noarch.rpm: Already downloaded [SKIPPED] python3-iniconfig-1.1.1-7.el9.noarch.rpm: Already downloaded [SKIPPED] python3-py-1.10.0-6.el9.noarch.rpm: Already downloaded [SKIPPED] python3-rpm-generators-12-9.el9.noarch.rpm: Already downloaded [SKIPPED] python3-pytest-6.2.2-7.el9.noarch.rpm: Already downloaded [SKIPPED] python3-rpm-macros-3.9-54.el9.noarch.rpm: Already downloaded [SKIPPED] python-rpm-macros-3.9-54.el9.noarch.rpm: Already downloaded [SKIPPED] python3-devel-3.9.21-1.el9_5.x86_64.rpm: Already downloaded [SKIPPED] pyproject-rpm-macros-1.12.0-1.el9.noarch.rpm: Already downloaded (20/48): graphite2-1.3.14-9.el9.x86_64.rpm 1.4 MB/s | 98 kB 00:00 (21/48): python3-six-1.15.0-9.el9.noarch.rpm 530 kB/s | 40 kB 00:00 (22/48): libpng-1.6.37-12.el9.x86_64.rpm 1.4 MB/s | 119 kB 00:00 (23/48): harfbuzz-2.7.4-10.el9.x86_64.rpm 13 MB/s | 629 kB 00:00 (24/48): nettle-3.9.1-1.el9.x86_64.rpm 12 MB/s | 564 kB 00:00 (25/48): gnutls-3.8.3-4.el9_4.x86_64.rpm 15 MB/s | 1.1 MB 00:00 (26/48): glib2-2.68.4-14.el9_4.1.x86_64.rpm 46 MB/s | 2.6 MB 00:00 (27/48): freetype-2.10.4-10.el9_5.x86_64.rpm 6.8 MB/s | 389 kB 00:00 (28/48): lcms2-2.12-3.el9.x86_64.rpm 2.0 MB/s | 169 kB 00:00 (29/48): jbigkit-libs-2.1-23.el9.x86_64.rpm 857 kB/s | 56 kB 00:00 (30/48): libXau-1.0.9-8.el9.x86_64.rpm 479 kB/s | 34 kB 00:00 (31/48): openjpeg2-2.4.0-7.el9.x86_64.rpm 2.9 MB/s | 166 kB 00:00 (32/48): libxcb-1.13.1-9.el9.x86_64.rpm 3.2 MB/s | 247 kB 00:00 (33/48): libwebp-1.2.0-8.el9_3.x86_64.rpm 4.8 MB/s | 282 kB 00:00 (34/48): fribidi-1.0.10-6.el9.2.x86_64.rpm 550 kB/s | 89 kB 00:00 (35/48): python3-tomli-2.0.1-5.el9.noarch.rpm 222 kB/s | 37 kB 00:00 (36/48): libimagequant-2.17.0-1.el9.x86_64.rpm 5.2 MB/s | 62 kB 00:00 (37/48): libraqm-0.8.0-1.el9.x86_64.rpm 14 MB/s | 19 kB 00:00 (38/48): python3-coverage+toml-6.2-1.el9.x86_64 4.5 MB/s | 9.2 kB 00:00 (39/48): python3-coverage-6.2-1.el9.x86_64.rpm 36 MB/s | 257 kB 00:00 (40/48): python3-html5lib-1.1-8.el9.noarch.rpm 7.6 MB/s | 209 kB 00:00 (41/48): python3-olefile-0.46-15.el9.noarch.rpm 23 MB/s | 56 kB 00:00 (42/48): python3-pillow-10.0.1-1.el9.x86_64.rpm 128 MB/s | 729 kB 00:00 (43/48): python3-pytest-cov-4.0.0-2.el9.noarch. 17 MB/s | 41 kB 00:00 (44/48): python3-pytest-runner-4.0-15.el9.noarc 3.7 MB/s | 17 kB 00:00 (45/48): python3-regex-2024.11.6-1.el9.x86_64.r 30 MB/s | 357 kB 00:00 (46/48): libtiff-4.4.0-13.el9.x86_64.rpm 1.3 MB/s | 201 kB 00:00 (47/48): python3-webencodings-0.5.1-17.el9.noar 1.2 MB/s | 27 kB 00:00 (48/48): libjpeg-turbo-2.0.90-7.el9.x86_64.rpm 853 kB/s | 178 kB 00:00 -------------------------------------------------------------------------------- Total 9.9 MB/s | 8.7 MB 00:00 Running transaction check Transaction check succeeded. Running transaction test Transaction test succeeded. Running transaction Preparing : 1/1 Installing : python-rpm-macros-3.9-54.el9.noarch 1/48 Installing : python3-rpm-macros-3.9-54.el9.noarch 2/48 Installing : libjpeg-turbo-2.0.90-7.el9.x86_64 3/48 Installing : libwebp-1.2.0-8.el9_3.x86_64 4/48 Installing : libimagequant-2.17.0-1.el9.x86_64 5/48 Installing : openjpeg2-2.4.0-7.el9.x86_64 6/48 Installing : fribidi-1.0.10-6.el9.2.x86_64 7/48 Installing : libXau-1.0.9-8.el9.x86_64 8/48 Installing : libxcb-1.13.1-9.el9.x86_64 9/48 Installing : jbigkit-libs-2.1-23.el9.x86_64 10/48 Installing : libtiff-4.4.0-13.el9.x86_64 11/48 Installing : lcms2-2.12-3.el9.x86_64 12/48 Installing : expat-2.5.0-3.el9_5.3.x86_64 13/48 Installing : python3-setuptools-wheel-53.0.0-13.el9.noarch 14/48 Installing : python3-pip-wheel-21.3.1-1.el9.noarch 15/48 Installing : python3-libs-3.9.21-1.el9_5.x86_64 16/48 Installing : python3-3.9.21-1.el9_5.x86_64 17/48 Installing : python3-setuptools-53.0.0-13.el9.noarch 18/48 Installing : python3-coverage-6.2-1.el9.x86_64 19/48 Installing : python3-py-1.10.0-6.el9.noarch 20/48 Installing : python3-pyparsing-2.4.7-9.el9.noarch 21/48 Installing : python3-packaging-20.9-5.el9.noarch 22/48 Installing : python3-rpm-generators-12-9.el9.noarch 23/48 Installing : python3-six-1.15.0-9.el9.noarch 24/48 Installing : python3-attrs-20.3.0-7.el9.noarch 25/48 Installing : python3-toml-0.10.2-6.el9.noarch 26/48 Installing : python3-pluggy-0.13.1-7.el9.noarch 27/48 Installing : python3-iniconfig-1.1.1-7.el9.noarch 28/48 Installing : python3-pytest-6.2.2-7.el9.noarch 29/48 Installing : python3-tomli-2.0.1-5.el9.noarch 30/48 Installing : python3-coverage+toml-6.2-1.el9.x86_64 31/48 Installing : python3-olefile-0.46-15.el9.noarch 32/48 Installing : python3-webencodings-0.5.1-17.el9.noarch 33/48 Installing : nettle-3.9.1-1.el9.x86_64 34/48 Installing : gnutls-3.8.3-4.el9_4.x86_64 35/48 Installing : glib2-2.68.4-14.el9_4.1.x86_64 36/48 Installing : libpng-2:1.6.37-12.el9.x86_64 37/48 Installing : graphite2-1.3.14-9.el9.x86_64 38/48 Installing : freetype-2.10.4-10.el9_5.x86_64 39/48 Installing : harfbuzz-2.7.4-10.el9.x86_64 40/48 Installing : libraqm-0.8.0-1.el9.x86_64 41/48 Installing : python3-pillow-10.0.1-1.el9.x86_64 42/48 Installing : python3-html5lib-1:1.1-8.el9.noarch 43/48 Installing : python3-pytest-cov-4.0.0-2.el9.noarch 44/48 Installing : python3-pytest-runner-4.0-15.el9.noarch 45/48 Installing : python3-devel-3.9.21-1.el9_5.x86_64 46/48 Installing : python3-regex-2024.11.6-1.el9.x86_64 47/48 Installing : pyproject-rpm-macros-1.12.0-1.el9.noarch 48/48 Running scriptlet: pyproject-rpm-macros-1.12.0-1.el9.noarch 48/48 Installed products updated. Installed: expat-2.5.0-3.el9_5.3.x86_64 freetype-2.10.4-10.el9_5.x86_64 fribidi-1.0.10-6.el9.2.x86_64 glib2-2.68.4-14.el9_4.1.x86_64 gnutls-3.8.3-4.el9_4.x86_64 graphite2-1.3.14-9.el9.x86_64 harfbuzz-2.7.4-10.el9.x86_64 jbigkit-libs-2.1-23.el9.x86_64 lcms2-2.12-3.el9.x86_64 libXau-1.0.9-8.el9.x86_64 libimagequant-2.17.0-1.el9.x86_64 libjpeg-turbo-2.0.90-7.el9.x86_64 libpng-2:1.6.37-12.el9.x86_64 libraqm-0.8.0-1.el9.x86_64 libtiff-4.4.0-13.el9.x86_64 libwebp-1.2.0-8.el9_3.x86_64 libxcb-1.13.1-9.el9.x86_64 nettle-3.9.1-1.el9.x86_64 openjpeg2-2.4.0-7.el9.x86_64 pyproject-rpm-macros-1.12.0-1.el9.noarch python-rpm-macros-3.9-54.el9.noarch python3-3.9.21-1.el9_5.x86_64 python3-attrs-20.3.0-7.el9.noarch python3-coverage-6.2-1.el9.x86_64 python3-coverage+toml-6.2-1.el9.x86_64 python3-devel-3.9.21-1.el9_5.x86_64 python3-html5lib-1:1.1-8.el9.noarch python3-iniconfig-1.1.1-7.el9.noarch python3-libs-3.9.21-1.el9_5.x86_64 python3-olefile-0.46-15.el9.noarch python3-packaging-20.9-5.el9.noarch python3-pillow-10.0.1-1.el9.x86_64 python3-pip-wheel-21.3.1-1.el9.noarch python3-pluggy-0.13.1-7.el9.noarch python3-py-1.10.0-6.el9.noarch python3-pyparsing-2.4.7-9.el9.noarch python3-pytest-6.2.2-7.el9.noarch python3-pytest-cov-4.0.0-2.el9.noarch python3-pytest-runner-4.0-15.el9.noarch python3-regex-2024.11.6-1.el9.x86_64 python3-rpm-generators-12-9.el9.noarch python3-rpm-macros-3.9-54.el9.noarch python3-setuptools-53.0.0-13.el9.noarch python3-setuptools-wheel-53.0.0-13.el9.noarch python3-six-1.15.0-9.el9.noarch python3-toml-0.10.2-6.el9.noarch python3-tomli-2.0.1-5.el9.noarch python3-webencodings-0.5.1-17.el9.noarch Complete! Finish: build setup for python-textile-3.0.4-5.el9.src.rpm Start: rpmbuild python-textile-3.0.4-5.el9.src.rpm Building target platforms: x86_64 Building for target x86_64 setting SOURCE_DATE_EPOCH=1570060800 Executing(%prep): /bin/sh -e /var/tmp/rpm-tmp.w8f66K + umask 022 + cd /builddir/build/BUILD + cd /builddir/build/BUILD + rm -rf textile-3.0.4 + /usr/bin/gzip -dc /builddir/build/SOURCES/textile-3.0.4.tar.gz + /usr/bin/tar -xof - + STATUS=0 + '[' 0 -ne 0 ']' + cd textile-3.0.4 + /usr/bin/chmod -Rf a+rX,u+w,g-w,o-w . + RPM_EC=0 ++ jobs -p + exit 0 Executing(%build): /bin/sh -e /var/tmp/rpm-tmp.SqUkzI + umask 022 + cd /builddir/build/BUILD + cd textile-3.0.4 + CFLAGS='-O2 -flto=auto -ffat-lto-objects -fexceptions -g -grecord-gcc-switches -pipe -Wall -Werror=format-security -Wp,-D_FORTIFY_SOURCE=2 -Wp,-D_GLIBCXX_ASSERTIONS -specs=/usr/lib/rpm/redhat/redhat-hardened-cc1 -fstack-protector-strong -specs=/usr/lib/rpm/redhat/redhat-annobin-cc1 -m64 -march=x86-64-v2 -mtune=generic -fasynchronous-unwind-tables -fstack-clash-protection -fcf-protection' + LDFLAGS='-Wl,-z,relro -Wl,--as-needed -Wl,-z,now -specs=/usr/lib/rpm/redhat/redhat-hardened-ld -specs=/usr/lib/rpm/redhat/redhat-annobin-cc1 ' + /usr/bin/python3 setup.py build '--executable=/usr/bin/python3 -s' running build running build_py creating build creating build/lib creating build/lib/textile copying textile/textilefactory.py -> build/lib/textile copying textile/__main__.py -> build/lib/textile copying textile/utils.py -> build/lib/textile copying textile/core.py -> build/lib/textile copying textile/regex_strings.py -> build/lib/textile copying textile/version.py -> build/lib/textile copying textile/__init__.py -> build/lib/textile creating build/lib/textile/tools copying textile/tools/imagesize.py -> build/lib/textile/tools copying textile/tools/sanitizer.py -> build/lib/textile/tools copying textile/tools/__init__.py -> build/lib/textile/tools creating build/lib/textile/objects copying textile/objects/block.py -> build/lib/textile/objects copying textile/objects/__init__.py -> build/lib/textile/objects copying textile/objects/table.py -> build/lib/textile/objects running egg_info writing textile.egg-info/PKG-INFO writing dependency_links to textile.egg-info/dependency_links.txt writing entry points to textile.egg-info/entry_points.txt writing requirements to textile.egg-info/requires.txt writing top-level names to textile.egg-info/top_level.txt reading manifest file 'textile.egg-info/SOURCES.txt' reading manifest template 'MANIFEST.in' adding license file 'LICENSE.txt' writing manifest file 'textile.egg-info/SOURCES.txt' + RPM_EC=0 ++ jobs -p + exit 0 Executing(%install): /bin/sh -e /var/tmp/rpm-tmp.h39PbX + umask 022 + cd /builddir/build/BUILD + '[' /builddir/build/BUILDROOT/python-textile-3.0.4-5.el9.x86_64 '!=' / ']' + rm -rf /builddir/build/BUILDROOT/python-textile-3.0.4-5.el9.x86_64 ++ dirname /builddir/build/BUILDROOT/python-textile-3.0.4-5.el9.x86_64 + mkdir -p /builddir/build/BUILDROOT + mkdir /builddir/build/BUILDROOT/python-textile-3.0.4-5.el9.x86_64 + cd textile-3.0.4 + CFLAGS='-O2 -flto=auto -ffat-lto-objects -fexceptions -g -grecord-gcc-switches -pipe -Wall -Werror=format-security -Wp,-D_FORTIFY_SOURCE=2 -Wp,-D_GLIBCXX_ASSERTIONS -specs=/usr/lib/rpm/redhat/redhat-hardened-cc1 -fstack-protector-strong -specs=/usr/lib/rpm/redhat/redhat-annobin-cc1 -m64 -march=x86-64-v2 -mtune=generic -fasynchronous-unwind-tables -fstack-clash-protection -fcf-protection' + LDFLAGS='-Wl,-z,relro -Wl,--as-needed -Wl,-z,now -specs=/usr/lib/rpm/redhat/redhat-hardened-ld -specs=/usr/lib/rpm/redhat/redhat-annobin-cc1 ' + /usr/bin/python3 setup.py install -O1 --skip-build --root /builddir/build/BUILDROOT/python-textile-3.0.4-5.el9.x86_64 running install running install_lib creating /builddir/build/BUILDROOT/python-textile-3.0.4-5.el9.x86_64/usr creating /builddir/build/BUILDROOT/python-textile-3.0.4-5.el9.x86_64/usr/lib creating /builddir/build/BUILDROOT/python-textile-3.0.4-5.el9.x86_64/usr/lib/python3.9 creating /builddir/build/BUILDROOT/python-textile-3.0.4-5.el9.x86_64/usr/lib/python3.9/site-packages creating /builddir/build/BUILDROOT/python-textile-3.0.4-5.el9.x86_64/usr/lib/python3.9/site-packages/textile copying build/lib/textile/textilefactory.py -> /builddir/build/BUILDROOT/python-textile-3.0.4-5.el9.x86_64/usr/lib/python3.9/site-packages/textile copying build/lib/textile/__main__.py -> /builddir/build/BUILDROOT/python-textile-3.0.4-5.el9.x86_64/usr/lib/python3.9/site-packages/textile copying build/lib/textile/utils.py -> /builddir/build/BUILDROOT/python-textile-3.0.4-5.el9.x86_64/usr/lib/python3.9/site-packages/textile copying build/lib/textile/core.py -> /builddir/build/BUILDROOT/python-textile-3.0.4-5.el9.x86_64/usr/lib/python3.9/site-packages/textile copying build/lib/textile/regex_strings.py -> /builddir/build/BUILDROOT/python-textile-3.0.4-5.el9.x86_64/usr/lib/python3.9/site-packages/textile copying build/lib/textile/version.py -> /builddir/build/BUILDROOT/python-textile-3.0.4-5.el9.x86_64/usr/lib/python3.9/site-packages/textile copying build/lib/textile/__init__.py -> /builddir/build/BUILDROOT/python-textile-3.0.4-5.el9.x86_64/usr/lib/python3.9/site-packages/textile creating /builddir/build/BUILDROOT/python-textile-3.0.4-5.el9.x86_64/usr/lib/python3.9/site-packages/textile/tools copying build/lib/textile/tools/imagesize.py -> /builddir/build/BUILDROOT/python-textile-3.0.4-5.el9.x86_64/usr/lib/python3.9/site-packages/textile/tools copying build/lib/textile/tools/sanitizer.py -> /builddir/build/BUILDROOT/python-textile-3.0.4-5.el9.x86_64/usr/lib/python3.9/site-packages/textile/tools copying build/lib/textile/tools/__init__.py -> /builddir/build/BUILDROOT/python-textile-3.0.4-5.el9.x86_64/usr/lib/python3.9/site-packages/textile/tools creating /builddir/build/BUILDROOT/python-textile-3.0.4-5.el9.x86_64/usr/lib/python3.9/site-packages/textile/objects copying build/lib/textile/objects/block.py -> /builddir/build/BUILDROOT/python-textile-3.0.4-5.el9.x86_64/usr/lib/python3.9/site-packages/textile/objects copying build/lib/textile/objects/__init__.py -> /builddir/build/BUILDROOT/python-textile-3.0.4-5.el9.x86_64/usr/lib/python3.9/site-packages/textile/objects copying build/lib/textile/objects/table.py -> /builddir/build/BUILDROOT/python-textile-3.0.4-5.el9.x86_64/usr/lib/python3.9/site-packages/textile/objects byte-compiling /builddir/build/BUILDROOT/python-textile-3.0.4-5.el9.x86_64/usr/lib/python3.9/site-packages/textile/textilefactory.py to textilefactory.cpython-39.pyc byte-compiling /builddir/build/BUILDROOT/python-textile-3.0.4-5.el9.x86_64/usr/lib/python3.9/site-packages/textile/__main__.py to __main__.cpython-39.pyc byte-compiling /builddir/build/BUILDROOT/python-textile-3.0.4-5.el9.x86_64/usr/lib/python3.9/site-packages/textile/utils.py to utils.cpython-39.pyc byte-compiling /builddir/build/BUILDROOT/python-textile-3.0.4-5.el9.x86_64/usr/lib/python3.9/site-packages/textile/core.py to core.cpython-39.pyc /usr/lib/python3.9/site-packages/textile/core.py:730: SyntaxWarning: "is not" with a literal. Did you mean "!="? /usr/lib/python3.9/site-packages/textile/core.py:730: SyntaxWarning: "is" with a literal. Did you mean "=="? /usr/lib/python3.9/site-packages/textile/core.py:753: SyntaxWarning: "is" with a literal. Did you mean "=="? /usr/lib/python3.9/site-packages/textile/core.py:768: SyntaxWarning: "is" with a literal. Did you mean "=="? /usr/lib/python3.9/site-packages/textile/core.py:1423: SyntaxWarning: "is" with a literal. Did you mean "=="? byte-compiling /builddir/build/BUILDROOT/python-textile-3.0.4-5.el9.x86_64/usr/lib/python3.9/site-packages/textile/regex_strings.py to regex_strings.cpython-39.pyc byte-compiling /builddir/build/BUILDROOT/python-textile-3.0.4-5.el9.x86_64/usr/lib/python3.9/site-packages/textile/version.py to version.cpython-39.pyc byte-compiling /builddir/build/BUILDROOT/python-textile-3.0.4-5.el9.x86_64/usr/lib/python3.9/site-packages/textile/__init__.py to __init__.cpython-39.pyc byte-compiling /builddir/build/BUILDROOT/python-textile-3.0.4-5.el9.x86_64/usr/lib/python3.9/site-packages/textile/tools/imagesize.py to imagesize.cpython-39.pyc byte-compiling /builddir/build/BUILDROOT/python-textile-3.0.4-5.el9.x86_64/usr/lib/python3.9/site-packages/textile/tools/sanitizer.py to sanitizer.cpython-39.pyc byte-compiling /builddir/build/BUILDROOT/python-textile-3.0.4-5.el9.x86_64/usr/lib/python3.9/site-packages/textile/tools/__init__.py to __init__.cpython-39.pyc byte-compiling /builddir/build/BUILDROOT/python-textile-3.0.4-5.el9.x86_64/usr/lib/python3.9/site-packages/textile/objects/block.py to block.cpython-39.pyc byte-compiling /builddir/build/BUILDROOT/python-textile-3.0.4-5.el9.x86_64/usr/lib/python3.9/site-packages/textile/objects/__init__.py to __init__.cpython-39.pyc byte-compiling /builddir/build/BUILDROOT/python-textile-3.0.4-5.el9.x86_64/usr/lib/python3.9/site-packages/textile/objects/table.py to table.cpython-39.pyc writing byte-compilation script '/tmp/tmp7n9bulrl.py' /usr/bin/python3 /tmp/tmp7n9bulrl.py /usr/lib/python3.9/site-packages/textile/core.py:730: SyntaxWarning: "is not" with a literal. Did you mean "!="? /usr/lib/python3.9/site-packages/textile/core.py:730: SyntaxWarning: "is" with a literal. Did you mean "=="? /usr/lib/python3.9/site-packages/textile/core.py:753: SyntaxWarning: "is" with a literal. Did you mean "=="? /usr/lib/python3.9/site-packages/textile/core.py:768: SyntaxWarning: "is" with a literal. Did you mean "=="? /usr/lib/python3.9/site-packages/textile/core.py:1423: SyntaxWarning: "is" with a literal. Did you mean "=="? removing /tmp/tmp7n9bulrl.py running install_egg_info running egg_info writing textile.egg-info/PKG-INFO writing dependency_links to textile.egg-info/dependency_links.txt writing entry points to textile.egg-info/entry_points.txt writing requirements to textile.egg-info/requires.txt writing top-level names to textile.egg-info/top_level.txt reading manifest file 'textile.egg-info/SOURCES.txt' reading manifest template 'MANIFEST.in' adding license file 'LICENSE.txt' writing manifest file 'textile.egg-info/SOURCES.txt' Copying textile.egg-info to /builddir/build/BUILDROOT/python-textile-3.0.4-5.el9.x86_64/usr/lib/python3.9/site-packages/textile-3.0.4-py3.9.egg-info running install_scripts Installing pytextile script to /builddir/build/BUILDROOT/python-textile-3.0.4-5.el9.x86_64/usr/bin + rm -rfv /builddir/build/BUILDROOT/python-textile-3.0.4-5.el9.x86_64/usr/bin/__pycache__ + for f in README CHANGELOG + PYTHONPATH=/builddir/build/BUILDROOT/python-textile-3.0.4-5.el9.x86_64/usr/lib/python3.9/site-packages + PATH=/builddir/build/BUILDROOT/python-textile-3.0.4-5.el9.x86_64/usr/bin:/usr/bin:/bin:/usr/sbin:/sbin:/usr/local/sbin + pytextile + for f in README CHANGELOG + PYTHONPATH=/builddir/build/BUILDROOT/python-textile-3.0.4-5.el9.x86_64/usr/lib/python3.9/site-packages + PATH=/builddir/build/BUILDROOT/python-textile-3.0.4-5.el9.x86_64/usr/bin:/usr/bin:/bin:/usr/sbin:/sbin:/usr/local/sbin + pytextile + find /builddir/build/BUILDROOT/python-textile-3.0.4-5.el9.x86_64/usr/lib/python3.9/site-packages -name '*.py' -exec sed -i -e '1{/^#!/d}' '{}' ';' + /usr/bin/find-debuginfo -j4 --strict-build-id -m -i --build-id-seed 3.0.4-5.el9 --unique-debug-suffix -3.0.4-5.el9.x86_64 --unique-debug-src-base python-textile-3.0.4-5.el9.x86_64 --run-dwz --dwz-low-mem-die-limit 10000000 --dwz-max-die-limit 110000000 --remove-section .gnu.build.attributes -S debugsourcefiles.list /builddir/build/BUILD/textile-3.0.4 find: 'debug': No such file or directory + /usr/lib/rpm/check-buildroot + /usr/lib/rpm/redhat/brp-ldconfig + /usr/lib/rpm/brp-compress + /usr/lib/rpm/redhat/brp-strip-lto /usr/bin/strip + /usr/lib/rpm/brp-strip-static-archive /usr/bin/strip + /usr/lib/rpm/redhat/brp-python-bytecompile '' 1 0 Bytecompiling .py files below /builddir/build/BUILDROOT/python-textile-3.0.4-5.el9.x86_64/usr/lib/python3.9 using python3.9 /usr/lib/python3.9/site-packages/textile/core.py:730: SyntaxWarning: "is not" with a literal. Did you mean "!="? /usr/lib/python3.9/site-packages/textile/core.py:730: SyntaxWarning: "is" with a literal. Did you mean "=="? /usr/lib/python3.9/site-packages/textile/core.py:753: SyntaxWarning: "is" with a literal. Did you mean "=="? /usr/lib/python3.9/site-packages/textile/core.py:768: SyntaxWarning: "is" with a literal. Did you mean "=="? /usr/lib/python3.9/site-packages/textile/core.py:1423: SyntaxWarning: "is" with a literal. Did you mean "=="? /usr/lib/python3.9/site-packages/textile/core.py:730: SyntaxWarning: "is not" with a literal. Did you mean "!="? /usr/lib/python3.9/site-packages/textile/core.py:730: SyntaxWarning: "is" with a literal. Did you mean "=="? /usr/lib/python3.9/site-packages/textile/core.py:753: SyntaxWarning: "is" with a literal. Did you mean "=="? /usr/lib/python3.9/site-packages/textile/core.py:768: SyntaxWarning: "is" with a literal. Did you mean "=="? /usr/lib/python3.9/site-packages/textile/core.py:1423: SyntaxWarning: "is" with a literal. Did you mean "=="? + /usr/lib/rpm/brp-python-hardlink + /usr/lib/rpm/redhat/brp-mangle-shebangs Executing(%check): /bin/sh -e /var/tmp/rpm-tmp.PtS1jQ + umask 022 + cd /builddir/build/BUILD + cd textile-3.0.4 + /usr/bin/python3 ./setup.py test running pytest running egg_info writing textile.egg-info/PKG-INFO writing dependency_links to textile.egg-info/dependency_links.txt writing entry points to textile.egg-info/entry_points.txt writing requirements to textile.egg-info/requires.txt writing top-level names to textile.egg-info/top_level.txt reading manifest file 'textile.egg-info/SOURCES.txt' reading manifest template 'MANIFEST.in' adding license file 'LICENSE.txt' writing manifest file 'textile.egg-info/SOURCES.txt' running build_ext ============================= test session starts ============================== platform linux -- Python 3.9.21, pytest-6.2.2, py-1.10.0, pluggy-0.13.1 rootdir: /builddir/build/BUILD/textile-3.0.4, configfile: pytest.ini, testpaths: tests plugins: cov-4.0.0 collected 206 items tests/test_attributes.py . [ 0%] tests/test_block.py ...... [ 3%] tests/test_cli.py .. [ 4%] tests/test_footnoteRef.py . [ 4%] tests/test_getRefs.py . [ 5%] tests/test_getimagesize.py F [ 5%] tests/test_github_issues.py ........F................. [ 18%] tests/test_glyphs.py . [ 18%] tests/test_image.py . [ 19%] tests/test_imagesize.py F [ 19%] tests/test_lists.py . [ 20%] tests/test_retrieve.py . [ 20%] tests/test_span.py . [ 21%] tests/test_subclassing.py . [ 21%] tests/test_table.py . [ 22%] tests/test_textile.py .......F.FF........ [ 31%] tests/test_textilefactory.py . [ 32%] tests/test_urls.py ... [ 33%] tests/test_utils.py .... [ 35%] tests/test_values.py ........................................F.......F.. [ 60%] ......................................F......F.......................... [ 95%] .......... [100%]/builddir/build/BUILD/textile-3.0.4/textile/core.py:730: SyntaxWarning: "is not" with a literal. Did you mean "!="? while balanced is not 0 or i is 0: # pragma: no branch /builddir/build/BUILD/textile-3.0.4/textile/core.py:730: SyntaxWarning: "is" with a literal. Did you mean "=="? while balanced is not 0 or i is 0: # pragma: no branch /builddir/build/BUILD/textile-3.0.4/textile/core.py:753: SyntaxWarning: "is" with a literal. Did you mean "=="? if i is 0: /builddir/build/BUILD/textile-3.0.4/textile/core.py:768: SyntaxWarning: "is" with a literal. Did you mean "=="? if (possibility is '' or possibility.endswith(' ')): /builddir/build/BUILD/textile-3.0.4/textile/core.py:1423: SyntaxWarning: "is" with a literal. Did you mean "=="? if url is '': /builddir/build/BUILD/textile-3.0.4/textile/core.py:730: SyntaxWarning: "is not" with a literal. Did you mean "!="? while balanced is not 0 or i is 0: # pragma: no branch /builddir/build/BUILD/textile-3.0.4/textile/core.py:730: SyntaxWarning: "is" with a literal. Did you mean "=="? while balanced is not 0 or i is 0: # pragma: no branch /builddir/build/BUILD/textile-3.0.4/textile/core.py:753: SyntaxWarning: "is" with a literal. Did you mean "=="? if i is 0: /builddir/build/BUILD/textile-3.0.4/textile/core.py:768: SyntaxWarning: "is" with a literal. Did you mean "=="? if (possibility is '' or possibility.endswith(' ')): /builddir/build/BUILD/textile-3.0.4/textile/core.py:1423: SyntaxWarning: "is" with a literal. Did you mean "=="? if url is '': =================================== FAILURES =================================== ________________________________ test_imagesize ________________________________ def test_imagesize(): > assert getimagesize("http://www.google.com/intl/en_ALL/images/logo.gif") == (276, 110) E AssertionError: assert '' == (276, 110) E + where '' = getimagesize('http://www.google.com/intl/en_ALL/images/logo.gif') tests/test_getimagesize.py:7: AssertionError _____________________________ test_github_issue_30 _____________________________ def test_github_issue_30(): text ='"Tëxtíle (Tëxtíle)":http://lala.com' result = textile.textile(text) expect = '\t

Tëxtíle

' > assert result == expect E assert '\t

' == '\t

' E -

Tëxtíle

E +

Tëxtíle

tests/test_github_issues.py:87: AssertionError ________________________________ test_imagesize ________________________________ def test_imagesize(): imgurl = 'http://www.google.com/intl/en_ALL/images/srpr/logo1w.png' result = textile.tools.imagesize.getimagesize(imgurl) try: import PIL expect = (275, 95) > assert result == expect E AssertionError: assert '' == (275, 95) tests/test_imagesize.py:10: AssertionError ________________________________ test_imagesize ________________________________ def test_imagesize(): PIL = pytest.importorskip('PIL') test = "!http://www.google.com/intl/en_ALL/images/srpr/logo1w.png!" result = '\t

' expect = textile.Textile(get_sizes=True).parse(test) > assert result == expect E assert '\t

' == '\t

' E -

E +

E ? ++++++++++++ ++++++++++++ tests/test_textile.py:129: AssertionError ____________________________ test_endnotes_complex _____________________________ def test_endnotes_complex(): test = """Tim Berners-Lee is one of the pioneer voices in favour of Net Neutrality[#netneutral] and has expressed the view that ISPs should supply "connectivity with no strings attached"[#netneutral!] [#tbl_quote]\n\nBerners-Lee admitted that the forward slashes ("//") in a web address were actually unnecessary. He told the newspaper that he could easily have designed URLs not to have the forward slashes. "... it seemed like a good idea at the time,"[#slashes]\n\nnote#netneutral. "Web creator rejects net tracking":http://news.bbc.co.uk/2/hi/technology/7613201.stm. BBC. 15 September 2008\n\nnote#tbl_quote. "Web inventor's warning on spy software":http://www.telegraph.co.uk/news/uknews/1581938/Web-inventor%27s-warning-on-spy-software.html. The Daily Telegraph (London). 25 May 2008\n\nnote#slashes. "Berners-Lee 'sorry' for slashes":http://news.bbc.co.uk/1/hi/technology/8306631.stm. BBC. 14 October 2009\n\nnotelist.""" > html = textile.textile(test) tests/test_textile.py:140: _ _ _ _ _ _ _ _ _ _ _ _ _ _ _ _ _ _ _ _ _ _ _ _ _ _ _ _ _ _ _ _ _ _ _ _ _ _ _ _ textile/core.py:1447: in textile return Textile(html_type=html_type).parse(text) textile/core.py:246: in parse text = self.placeNoteLists(text) textile/core.py:1274: in placeNoteLists text = text_re.sub(self.fNoteLists, text) textile/core.py:1288: in fNoteLists links = self.makeBackrefLink(info, g_links, start_char) textile/core.py:1331: in makeBackrefLink i_entity = decode_high(i_) _ _ _ _ _ _ _ _ _ _ _ _ _ _ _ _ _ _ _ _ _ _ _ _ _ _ _ _ _ _ _ _ _ _ _ _ _ _ _ _ text = 'a' def decode_high(text): """Decode encoded HTML entities.""" h = HTMLParser() text = '&#{0};'.format(text) > return h.unescape(text) E AttributeError: 'HTMLParser' object has no attribute 'unescape' textile/utils.py:24: AttributeError _______________________ test_endnotes_unreferenced_note ________________________ def test_endnotes_unreferenced_note(): test = """Scientists say[#lavader] the moon is quite small. But I, for one, don't believe them. Others claim it to be made of cheese[#aardman]. If this proves true I suspect we are in for troubled times[#apollo13] as people argue over their "share" of the moon's cheese. In the end, its limited size[#lavader] may prove problematic.\n\nnote#lavader(noteclass). "Proof of the small moon hypothesis":http://antwrp.gsfc.nasa.gov/apod/ap080801.html. Copyright(c) Laurent Laveder\n\nnote#aardman(#noteid). "Proof of a cheese moon":http://www.imdb.com/title/tt0104361\n\nnote#apollo13. After all, things do go "wrong":http://en.wikipedia.org/wiki/Apollo_13#The_oxygen_tank_incident.\n\nnotelist{padding:1em; margin:1em; border-bottom:1px solid gray}.\n\nnotelist{padding:1em; margin:1em; border-bottom:1px solid gray}:§^.\n\nnotelist{padding:1em; margin:1em; border-bottom:1px solid gray}:‡""" > html = textile.textile(test) tests/test_textile.py:147: _ _ _ _ _ _ _ _ _ _ _ _ _ _ _ _ _ _ _ _ _ _ _ _ _ _ _ _ _ _ _ _ _ _ _ _ _ _ _ _ textile/core.py:1447: in textile return Textile(html_type=html_type).parse(text) textile/core.py:246: in parse text = self.placeNoteLists(text) textile/core.py:1274: in placeNoteLists text = text_re.sub(self.fNoteLists, text) textile/core.py:1288: in fNoteLists links = self.makeBackrefLink(info, g_links, start_char) textile/core.py:1331: in makeBackrefLink i_entity = decode_high(i_) _ _ _ _ _ _ _ _ _ _ _ _ _ _ _ _ _ _ _ _ _ _ _ _ _ _ _ _ _ _ _ _ _ _ _ _ _ _ _ _ text = 'a' def decode_high(text): """Decode encoded HTML entities.""" h = HTMLParser() text = '&#{0};'.format(text) > return h.unescape(text) E AttributeError: 'HTMLParser' object has no attribute 'unescape' textile/utils.py:24: AttributeError _ test_KnownValuesXHTML[h3()>[no]{color:red}. Bingo-\t

Bingo

] _ input = 'h3()>[no]{color:red}. Bingo' expected_output = '\t

Bingo

' @pytest.mark.parametrize("input, expected_output", xhtml_known_values) def test_KnownValuesXHTML(input, expected_output): # XHTML output = textile.textile(input, html_type='xhtml') > assert output == expected_output E assert '\t

Bingo

' == '\t

Bingo

' E -

Bingo

E ? ---------- E +

Bingo

E ? ++++++++++ tests/test_values.py:316: AssertionError _ test_KnownValuesXHTML[I searched "a search engine (Google)":http://google.com.-\t

I searched a search engine.

] _ input = 'I searched "a search engine (Google)":http://google.com.' expected_output = '\t

I searched a search engine.

' @pytest.mark.parametrize("input, expected_output", xhtml_known_values) def test_KnownValuesXHTML(input, expected_output): # XHTML output = textile.textile(input, html_type='xhtml') > assert output == expected_output E assert '\t

I searc...gine.

' == '\t

I searc...gine.

' E -

I searched a search engine.

E ? --------------- E +

I searched a search engine.

E ? +++++++++++++++ tests/test_values.py:316: AssertionError _ test_KnownValuesXHTML[table(#dvds){border-collapse:collapse}. Great films on DVD employing Textile summary, caption, thead, tfoot, two tbody elements and colgroups\n|={font-size:140%;margin-bottom:15px}. DVDs with two Textiled tbody elements\n|:\\3. 100 |{background:#ddd}|250||50|300|\n|^(header).\n|_. Title |_. Starring |_. Director |_. Writer |_. Notes |\n|~(footer).\n|\\5=. This is the tfoot, centred |\n|-(toplist){background:#c5f7f6}.\n| _The Usual Suspects_ | Benicio Del Toro, Gabriel Byrne, Stephen Baldwin, Kevin Spacey | Bryan Singer | Chris McQaurrie | One of the finest films ever made |\n| _Se7en_ | Morgan Freeman, Brad Pitt, Kevin Spacey | David Fincher | Andrew Kevin Walker | Great psychological thriller |\n| _Primer_ | David Sullivan, Shane Carruth | Shane Carruth | Shane Carruth | Amazing insight into trust and human psychology
rather than science fiction. Terrific! |\n| _District 9_ | Sharlto Copley, Jason Cope | Neill Blomkamp | Neill Blomkamp, Terri Tatchell | Social commentary layered on thick,\nbut boy is it done well |\n|-(medlist){background:#e7e895;}.\n| _Arlington Road_ | Tim Robbins, Jeff Bridges | Mark Pellington | Ehren Kruger | Awesome study in neighbourly relations |\n| _Phone Booth_ | Colin Farrell, Kiefer Sutherland, Forest Whitaker | Joel Schumacher | Larry Cohen | Edge-of-the-seat stuff in this\nshort but brilliantly executed thriller |-\t\n\t\n\t\n\t\n\t\n\t\n\t\n\t\n\t\n\t\n\t\t\n\t\t\t\n\t\t\t\n\t\t\t\n\t\t\t\n\t\t\t\n\t\t\n\t\n\t\n\t\t\n\t\t\t\n\t\t\n\t\n\t\n\t\t\n\t\t\t\n\t\t\t\n\t\t\t\n\t\t\t\n\t\t\t\n\t\t\n\t\t\n\t\t\t\n\t\t\t\n\t\t\t\n\t\t\t\n\t\t\t\n\t\t\n\t\t\n\t\t\t\n\t\t\t\n\t\t\t\n\t\t\t\n\t\t\t\n\t\t\n\t\t\n\t\t\t\n\t\t\t\n\t\t\t\n\t\t\t\n\t\t\t\n\t\t\n\t\n\t\n\t\t\n\t\t\t\n\t\t\t\n\t\t\t\n\t\t\t\n\t\t\t\n\t\t\n\t\t\n\t\t\t\n\t\t\t\n\t\t\t\n\t\t\t\n\t\t\t\n\t\t\n\t\n\t
DVDs with two Textiled tbody elements
Title Starring Director Writer Notes
This is the tfoot, centred
The Usual Suspects Benicio Del Toro, Gabriel Byrne, Stephen Baldwin, Kevin Spacey Bryan Singer Chris McQaurrie One of the finest films ever made
Se7en Morgan Freeman, Brad Pitt, Kevin Spacey David Fincher Andrew Kevin Walker Great psychological thriller
Primer David Sullivan, Shane Carruth Shane Carruth Shane Carruth Amazing insight into trust and human psychology
\nrather than science fiction. Terrific!
District 9 Sharlto Copley, Jason Cope Neill Blomkamp Neill Blomkamp, Terri Tatchell Social commentary layered on thick,
\nbut boy is it done well
Arlington Road Tim Robbins, Jeff Bridges Mark Pellington Ehren Kruger Awesome study in neighbourly relations
Phone Booth Colin Farrell, Kiefer Sutherland, Forest Whitaker Joel Schumacher Larry Cohen Edge-of-the-seat stuff in this
\nshort but brilliantly executed thriller
] _ input = 'table(#dvds){border-collapse:collapse}. Great films on DVD employing Textile summary, caption, thead, tfoot, two tbod...t Whitaker | Joel Schumacher | Larry Cohen | Edge-of-the-seat stuff in this\nshort but brilliantly executed thriller |' expected_output = '\t assert output == expected_output E assert '\t
\n\t
' == '\t\n\t
' E Skipping 477 identical trailing characters in diff, use -v to show E - E ? ---------- E +
E ? ++++++++++ E
DVDs with two Textiled ... E E ...Full output truncated (58 lines hidden), use '-vv' to show tests/test_values.py:316: AssertionError _ test_KnownValuesXHTML[h4. A more complicated table\n\ntable(tableclass#tableid){color:blue}.\n|_. table |_. more |_. badass |\n|\\3. Horizontal span of 3|\n(firstrow). |first|HAL(open the pod bay doors)|1|\n|some|{color:green}. styled|content|\n|/2. spans 2 rows|this is|quite a|\n| deep test | don't you think?|\n(lastrow). |fifth|I'm a lumberjack|5|\n|sixth| _*bold italics*_ |6|-\t

A more complicated table

\n\n\t\n\t\t\n\t\t\t\n\t\t\t\n\t\t\t\n\t\t\n\t\t\n\t\t\t\n\t\t\n\t\t\n\t\t\t\n\t\t\t\n\t\t\t\n\t\t\n\t\t\n\t\t\t\n\t\t\t\n\t\t\t\n\t\t\n\t\t\n\t\t\t\n\t\t\t\n\t\t\t\n\t\t\n\t\t\n\t\t\t\n\t\t\t\n\t\t\n\t\t\n\t\t\t\n\t\t\t\n\t\t\t\n\t\t\n\t\t\n\t\t\t\n\t\t\t\n\t\t\t\n\t\t\n\t
table more badass
Horizontal span of 3
firstHAL1
somestyledcontent
spans 2 rowsthis isquite a
deep test don’t you think?
fifthI’m a lumberjack5
sixth bold italics 6
] _ input = "h4. A more complicated table\n\ntable(tableclass#tableid){color:blue}.\n|_. table |_. more |_. badass |\n|\\3. Horizo...this is|quite a|\n| deep test | don't you think?|\n(lastrow). |fifth|I'm a lumberjack|5|\n|sixth| _*bold italics*_ |6|" expected_output = '\t

A more complicated table

\n\n\t\n\t\t\n\t\t\...\t\t\t\n\t\t\t\n\t\t\t\n\t\t\n\t
sixth bold italics 6
' @pytest.mark.parametrize("input, expected_output", xhtml_known_values) def test_KnownValuesXHTML(input, expected_output): # XHTML output = textile.textile(input, html_type='xhtml') > assert output == expected_output E assert '\t

A more...>\n\t

' == '\t

A more...>\n\t' E Skipping 34 identical leading characters in diff, use -v to show E Skipping 748 identical trailing characters in diff, use -v to show E E E - E +
E tests/test_values.py:316: AssertionError =============================== warnings summary =============================== textile/core.py:49 /builddir/build/BUILD/textile-3.0.4/textile/core.py:49: DeprecationWarning: invalid escape sequence \d btag = ('bq', 'bc', 'notextile', 'pre', 'h[1-6]', 'fn\d+', 'p', '###') textile/core.py:355 /builddir/build/BUILD/textile-3.0.4/textile/core.py:355: DeprecationWarning: invalid escape sequence \* nm = re.match("^(?P[#\*;:]+)(_|[\d]+)?{0}" textile/core.py:846 /builddir/build/BUILD/textile-3.0.4/textile/core.py:846: DeprecationWarning: invalid escape sequence \] m = re.search('(?P^.*\])(?P\[.*?)$', url, flags=re.U) textile/core.py:1272 /builddir/build/BUILD/textile-3.0.4/textile/core.py:1272: DeprecationWarning: invalid escape sequence \: text_re = re.compile('

notelist({0})(?:\:([\w|{1}]))?([\^!]?)(\+?)' textile/core.py:1273 /builddir/build/BUILD/textile-3.0.4/textile/core.py:1273: DeprecationWarning: invalid escape sequence \. '\.?[\s]*

'.format(cls_re_s, syms_re_s), re.U) textile/core.py:730 /builddir/build/BUILD/textile-3.0.4/textile/core.py:730: SyntaxWarning: "is not" with a literal. Did you mean "!="? while balanced is not 0 or i is 0: # pragma: no branch textile/core.py:730 /builddir/build/BUILD/textile-3.0.4/textile/core.py:730: SyntaxWarning: "is" with a literal. Did you mean "=="? while balanced is not 0 or i is 0: # pragma: no branch textile/core.py:753 /builddir/build/BUILD/textile-3.0.4/textile/core.py:753: SyntaxWarning: "is" with a literal. Did you mean "=="? if i is 0: textile/core.py:768 /builddir/build/BUILD/textile-3.0.4/textile/core.py:768: SyntaxWarning: "is" with a literal. Did you mean "=="? if (possibility is '' or possibility.endswith(' ')): textile/core.py:1423 /builddir/build/BUILD/textile-3.0.4/textile/core.py:1423: SyntaxWarning: "is" with a literal. Did you mean "=="? if url is '': tests/test_textile.py::test_sanitize /usr/lib/python3.9/site-packages/html5lib/filters/sanitizer.py:29: DeprecationWarning: html5lib's sanitizer is deprecated; see https://github.com/html5lib/html5lib-python/issues/443 and please let us know if Bleach is unsuitable for your needs warnings.warn(_deprecation_msg, DeprecationWarning) tests/test_textile.py::test_sanitize tests/test_textile.py::test_sanitize tests/test_textile.py::test_sanitize /usr/lib/python3.9/site-packages/html5lib/filters/sanitizer.py:771: DeprecationWarning: html5lib's sanitizer is deprecated; see https://github.com/html5lib/html5lib-python/issues/443 and please let us know if Bleach is unsuitable for your needs warnings.warn(_deprecation_msg, DeprecationWarning) -- Docs: https://docs.pytest.org/en/stable/warnings.html ---------- coverage: platform linux, python 3.9.21-final-0 ----------- Name Stmts Miss Branch BrPart Cover Missing ------------------------------------------------------------------------- textile/__init__.py 7 0 0 0 100% textile/__main__.py 20 0 2 0 100% textile/core.py 734 12 298 6 98% 40-41, 450->452, 990, 1021, 1131, 1138, 1332-1338 textile/objects/__init__.py 3 0 0 0 100% textile/objects/block.py 80 2 30 0 98% 7-8 textile/objects/table.py 155 3 65 0 99% 13-14, 161 textile/regex_strings.py 22 4 2 0 75% 21-26 textile/textilefactory.py 24 0 12 0 100% textile/tools/__init__.py 0 0 0 0 100% textile/tools/imagesize.py 20 10 4 0 42% 11-12, 16-17, 23-28 textile/tools/sanitizer.py 5 0 0 0 100% textile/utils.py 142 4 66 2 96% 6-7, 54, 65 textile/version.py 1 0 0 0 100% ------------------------------------------------------------------------- TOTAL 1213 35 479 8 97% Coverage HTML written to dir htmlcov =========================== short test summary info ============================ FAILED tests/test_getimagesize.py::test_imagesize - AssertionError: assert ''... FAILED tests/test_github_issues.py::test_github_issue_30 - assert '\t

[no]{color:red}. Bingo-\t

Bingo

] FAILED tests/test_values.py::test_KnownValuesXHTML[I searched "a search engine (Google)":http://google.com.-\t

I searched a search engine.

] FAILED tests/test_values.py::test_KnownValuesXHTML[table(#dvds){border-collapse:collapse}. Great films on DVD employing Textile summary, caption, thead, tfoot, two tbody elements and colgroups\n|={font-size:140%;margin-bottom:15px}. DVDs with two Textiled tbody elements\n|:\\3. 100 |{background:#ddd}|250||50|300|\n|^(header).\n|_. Title |_. Starring |_. Director |_. Writer |_. Notes |\n|~(footer).\n|\\5=. This is the tfoot, centred |\n|-(toplist){background:#c5f7f6}.\n| _The Usual Suspects_ | Benicio Del Toro, Gabriel Byrne, Stephen Baldwin, Kevin Spacey | Bryan Singer | Chris McQaurrie | One of the finest films ever made |\n| _Se7en_ | Morgan Freeman, Brad Pitt, Kevin Spacey | David Fincher | Andrew Kevin Walker | Great psychological thriller |\n| _Primer_ | David Sullivan, Shane Carruth | Shane Carruth | Shane Carruth | Amazing insight into trust and human psychology
rather than science fiction. Terrific! |\n| _District 9_ | Sharlto Copley, Jason Cope | Neill Blomkamp | Neill Blomkamp, Terri Tatchell | Social commentary layered on thick,\nbut boy is it done well |\n|-(medlist){background:#e7e895;}.\n| _Arlington Road_ | Tim Robbins, Jeff Bridges | Mark Pellington | Ehren Kruger | Awesome study in neighbourly relations |\n| _Phone Booth_ | Colin Farrell, Kiefer Sutherland, Forest Whitaker | Joel Schumacher | Larry Cohen | Edge-of-the-seat stuff in this\nshort but brilliantly executed thriller |-\t
\n\t\n\t\n\t\n\t\n\t\n\t\n\t\n\t\n\t\n\t\t\n\t\t\t\n\t\t\t\n\t\t\t\n\t\t\t\n\t\t\t\n\t\t\n\t\n\t\n\t\t\n\t\t\t\n\t\t\n\t\n\t\n\t\t\n\t\t\t\n\t\t\t\n\t\t\t\n\t\t\t\n\t\t\t\n\t\t\n\t\t\n\t\t\t\n\t\t\t\n\t\t\t\n\t\t\t\n\t\t\t\n\t\t\n\t\t\n\t\t\t\n\t\t\t\n\t\t\t\n\t\t\t\n\t\t\t\n\t\t\n\t\t\n\t\t\t\n\t\t\t\n\t\t\t\n\t\t\t\n\t\t\t\n\t\t\n\t\n\t\n\t\t\n\t\t\t\n\t\t\t\n\t\t\t\n\t\t\t\n\t\t\t\n\t\t\n\t\t\n\t\t\t\n\t\t\t\n\t\t\t\n\t\t\t\n\t\t\t\n\t\t\n\t\n\t
DVDs with two Textiled tbody elements
Title Starring Director Writer Notes
This is the tfoot, centred
The Usual Suspects Benicio Del Toro, Gabriel Byrne, Stephen Baldwin, Kevin Spacey Bryan Singer Chris McQaurrie One of the finest films ever made
Se7en Morgan Freeman, Brad Pitt, Kevin Spacey David Fincher Andrew Kevin Walker Great psychological thriller
Primer David Sullivan, Shane Carruth Shane Carruth Shane Carruth Amazing insight into trust and human psychology
\nrather than science fiction. Terrific!
District 9 Sharlto Copley, Jason Cope Neill Blomkamp Neill Blomkamp, Terri Tatchell Social commentary layered on thick,
\nbut boy is it done well
Arlington Road Tim Robbins, Jeff Bridges Mark Pellington Ehren Kruger Awesome study in neighbourly relations
Phone Booth Colin Farrell, Kiefer Sutherland, Forest Whitaker Joel Schumacher Larry Cohen Edge-of-the-seat stuff in this
\nshort but brilliantly executed thriller
] FAILED tests/test_values.py::test_KnownValuesXHTML[h4. A more complicated table\n\ntable(tableclass#tableid){color:blue}.\n|_. table |_. more |_. badass |\n|\\3. Horizontal span of 3|\n(firstrow). |first|HAL(open the pod bay doors)|1|\n|some|{color:green}. styled|content|\n|/2. spans 2 rows|this is|quite a|\n| deep test | don't you think?|\n(lastrow). |fifth|I'm a lumberjack|5|\n|sixth| _*bold italics*_ |6|-\t

A more complicated table

\n\n\t\n\t\t\n\t\t\t\n\t\t\t\n\t\t\t\n\t\t\n\t\t\n\t\t\t\n\t\t\n\t\t\n\t\t\t\n\t\t\t\n\t\t\t\n\t\t\n\t\t\n\t\t\t\n\t\t\t\n\t\t\t\n\t\t\n\t\t\n\t\t\t\n\t\t\t\n\t\t\t\n\t\t\n\t\t\n\t\t\t\n\t\t\t\n\t\t\n\t\t\n\t\t\t\n\t\t\t\n\t\t\t\n\t\t\n\t\t\n\t\t\t\n\t\t\t\n\t\t\t\n\t\t\n\t
table more badass
Horizontal span of 3
firstHAL1
somestyledcontent
spans 2 rowsthis isquite a
deep test don’t you think?
fifthI’m a lumberjack5
sixth bold italics 6
] ================= 10 failed, 196 passed, 14 warnings in 1.86s ================== + : + RPM_EC=0 ++ jobs -p + exit 0 Processing files: python3-textile-3.0.4-5.el9.noarch Executing(%doc): /bin/sh -e /var/tmp/rpm-tmp.gwhe8H + umask 022 + cd /builddir/build/BUILD + cd textile-3.0.4 + DOCDIR=/builddir/build/BUILDROOT/python-textile-3.0.4-5.el9.x86_64/usr/share/doc/python3-textile + export LC_ALL=C + LC_ALL=C + export DOCDIR + /usr/bin/mkdir -p /builddir/build/BUILDROOT/python-textile-3.0.4-5.el9.x86_64/usr/share/doc/python3-textile + cp -pr README.html README.textile /builddir/build/BUILDROOT/python-textile-3.0.4-5.el9.x86_64/usr/share/doc/python3-textile + cp -pr CONTRIBUTORS.txt /builddir/build/BUILDROOT/python-textile-3.0.4-5.el9.x86_64/usr/share/doc/python3-textile + cp -pr CHANGELOG.html CHANGELOG.textile /builddir/build/BUILDROOT/python-textile-3.0.4-5.el9.x86_64/usr/share/doc/python3-textile + RPM_EC=0 ++ jobs -p + exit 0 Executing(%license): /bin/sh -e /var/tmp/rpm-tmp.gSuPz9 + umask 022 + cd /builddir/build/BUILD + cd textile-3.0.4 + LICENSEDIR=/builddir/build/BUILDROOT/python-textile-3.0.4-5.el9.x86_64/usr/share/licenses/python3-textile + export LC_ALL=C + LC_ALL=C + export LICENSEDIR + /usr/bin/mkdir -p /builddir/build/BUILDROOT/python-textile-3.0.4-5.el9.x86_64/usr/share/licenses/python3-textile + cp -pr LICENSE.txt /builddir/build/BUILDROOT/python-textile-3.0.4-5.el9.x86_64/usr/share/licenses/python3-textile + RPM_EC=0 ++ jobs -p + exit 0 Provides: python-textile = 3.0.4-5.el9 python3-textile = 3.0.4-5.el9 python3.9-textile = 3.0.4-5.el9 python3.9dist(textile) = 3.0.4 python3dist(textile) = 3.0.4 Requires(rpmlib): rpmlib(CompressedFileNames) <= 3.0.4-1 rpmlib(FileDigests) <= 4.6.0-1 rpmlib(PartialHardlinkSets) <= 4.0.4-1 rpmlib(PayloadFilesHavePrefix) <= 4.0-1 Requires: /usr/bin/python3 python(abi) = 3.9 python3.9dist(html5lib) >= 0.999999999 python3.9dist(setuptools) python3.9dist(six) Obsoletes: python-textile < 3.0.4-5.el9 python39-textile < 3.0.4-5.el9 Checking for unpackaged file(s): /usr/lib/rpm/check-files /builddir/build/BUILDROOT/python-textile-3.0.4-5.el9.x86_64 Wrote: /builddir/build/RPMS/python3-textile-3.0.4-5.el9.noarch.rpm Executing(%clean): /bin/sh -e /var/tmp/rpm-tmp.aRGpK2 + umask 022 + cd /builddir/build/BUILD + cd textile-3.0.4 + /usr/bin/rm -rf /builddir/build/BUILDROOT/python-textile-3.0.4-5.el9.x86_64 + RPM_EC=0 ++ jobs -p + exit 0 Finish: rpmbuild python-textile-3.0.4-5.el9.src.rpm Finish: build phase for python-textile-3.0.4-5.el9.src.rpm INFO: chroot_scan: 3 files copied to /var/lib/copr-rpmbuild/results/chroot_scan INFO: /var/lib/mock/rhel+epel-9-x86_64-1743686669.797466/root/var/log/dnf.log /var/lib/mock/rhel+epel-9-x86_64-1743686669.797466/root/var/log/dnf.librepo.log /var/lib/mock/rhel+epel-9-x86_64-1743686669.797466/root/var/log/dnf.rpm.log INFO: chroot_scan: creating tarball /var/lib/copr-rpmbuild/results/chroot_scan.tar.gz /bin/tar: Removing leading `/' from member names INFO: Done(/var/lib/copr-rpmbuild/results/python-textile-3.0.4-5.el9.src.rpm) Config(child) 0 minutes 9 seconds INFO: Results and/or logs in: /var/lib/copr-rpmbuild/results INFO: Cleaning up build root ('cleanup_on_success=True') Start: clean chroot INFO: unmounting tmpfs. Finish: clean chroot Finish: run Running RPMResults tool Package info: { "packages": [ { "name": "python-textile", "epoch": null, "version": "3.0.4", "release": "5.el9", "arch": "src" }, { "name": "python3-textile", "epoch": null, "version": "3.0.4", "release": "5.el9", "arch": "noarch" } ] } RPMResults finished