Warning: Permanently added '169.59.189.129' (ED25519) to the list of known hosts.

You can reproduce this build on your computer by running:

  sudo dnf install copr-rpmbuild
  /usr/bin/copr-rpmbuild --verbose --drop-resultdir --task-url https://copr.fedorainfracloud.org/backend/get-build-task/6940927-fedora-rawhide-s390x --chroot fedora-rawhide-s390x


Version: 0.70
PID: 6078
Logging PID: 6079
Task:
{'appstream': False,
 'background': True,
 'build_id': 6940927,
 'buildroot_pkgs': [],
 'chroot': 'fedora-rawhide-s390x',
 'enable_net': False,
 'fedora_review': False,
 'git_hash': '2c7c7c8ce4d125fddef2a18d5869f106d1c2bd01',
 'git_repo': 'https://copr-dist-git.fedorainfracloud.org/git/psimovec/scipy-1.10.0/APLpy',
 'isolation': 'default',
 'memory_reqs': 2048,
 'package_name': 'APLpy',
 'package_version': '2.0.3-25',
 'project_dirname': 'scipy-1.10.0',
 'project_name': 'scipy-1.10.0',
 'project_owner': 'psimovec',
 'repo_priority': None,
 'repos': [{'baseurl': 'https://download.copr.fedorainfracloud.org/results/psimovec/scipy-1.10.0/fedora-rawhide-s390x/',
            'id': 'copr_base',
            'name': 'Copr repository',
            'priority': None},
           {'baseurl': 'http://kojipkgs.fedoraproject.org/repos/rawhide/latest/$basearch/',
            'id': 'http_kojipkgs_fedoraproject_org_repos_rawhide_latest_basearch',
            'name': 'Additional repo http_kojipkgs_fedoraproject_org_repos_rawhide_latest_basearch'}],
 'sandbox': 'psimovec/scipy-1.10.0--https://src.fedoraproject.org/user/releng',
 'source_json': {},
 'source_type': None,
 'submitter': 'https://src.fedoraproject.org/user/releng',
 'tags': [],
 'task_id': '6940927-fedora-rawhide-s390x',
 'timeout': 18000,
 'uses_devel_repo': False,
 'with_opts': [],
 'without_opts': []}

Running: git clone https://copr-dist-git.fedorainfracloud.org/git/psimovec/scipy-1.10.0/APLpy /var/lib/copr-rpmbuild/workspace/workdir-j7evlf0c/APLpy --depth 500 --no-single-branch --recursive

cmd: ['git', 'clone', 'https://copr-dist-git.fedorainfracloud.org/git/psimovec/scipy-1.10.0/APLpy', '/var/lib/copr-rpmbuild/workspace/workdir-j7evlf0c/APLpy', '--depth', '500', '--no-single-branch', '--recursive']
cwd: .
rc: 0
stdout: 
stderr: Cloning into '/var/lib/copr-rpmbuild/workspace/workdir-j7evlf0c/APLpy'...

Running: git checkout 2c7c7c8ce4d125fddef2a18d5869f106d1c2bd01 --

cmd: ['git', 'checkout', '2c7c7c8ce4d125fddef2a18d5869f106d1c2bd01', '--']
cwd: /var/lib/copr-rpmbuild/workspace/workdir-j7evlf0c/APLpy
rc: 0
stdout: 
stderr: Note: switching to '2c7c7c8ce4d125fddef2a18d5869f106d1c2bd01'.

You are in 'detached HEAD' state. You can look around, make experimental
changes and commit them, and you can discard any commits you make in this
state without impacting any branches by switching back to a branch.

If you want to create a new branch to retain commits you create, you may
do so (now or later) by using -c with the switch command. Example:

  git switch -c <new-branch-name>

Or undo this operation with:

  git switch -

Turn off this advice by setting config variable advice.detachedHead to false

HEAD is now at 2c7c7c8 automatic import of APLpy

Running: copr-distgit-client sources
/usr/bin/tail: /var/lib/copr-rpmbuild/main.log: file truncated
Running (timeout=18000): unbuffer mock --spec /var/lib/copr-rpmbuild/workspace/workdir-j7evlf0c/APLpy/APLpy.spec --sources /var/lib/copr-rpmbuild/workspace/workdir-j7evlf0c/APLpy --resultdir /var/lib/copr-rpmbuild/results --uniqueext 1705966360.259598 -r /var/lib/copr-rpmbuild/results/configs/child.cfg
INFO: mock.py version 5.4 starting (python version = 3.11.3, NVR = mock-5.4-1.fc38), args: /usr/libexec/mock/mock --spec /var/lib/copr-rpmbuild/workspace/workdir-j7evlf0c/APLpy/APLpy.spec --sources /var/lib/copr-rpmbuild/workspace/workdir-j7evlf0c/APLpy --resultdir /var/lib/copr-rpmbuild/results --uniqueext 1705966360.259598 -r /var/lib/copr-rpmbuild/results/configs/child.cfg
Start(bootstrap): init plugins
INFO: tmpfs initialized
INFO: selinux enabled
INFO: chroot_scan: initialized
INFO: compress_logs: initialized
Finish(bootstrap): init plugins
Start: init plugins
INFO: tmpfs initialized
INFO: selinux enabled
INFO: chroot_scan: initialized
INFO: compress_logs: initialized
Finish: init plugins
INFO: Signal handler active
Start: run
INFO: Start(/var/lib/copr-rpmbuild/workspace/workdir-j7evlf0c/APLpy/APLpy.spec)  Config(fedora-rawhide-s390x)
Start: clean chroot
Finish: clean chroot
Mock Version: 5.4
INFO: Mock Version: 5.4
Start(bootstrap): chroot init
INFO: mounting tmpfs at /var/lib/mock/fedora-rawhide-s390x-bootstrap-1705966360.259598/root.
INFO: calling preinit hooks
INFO: enabled root cache
INFO: enabled package manager cache
Start(bootstrap): cleaning package manager metadata
Finish(bootstrap): cleaning package manager metadata
INFO: Guessed host environment type: unknown
INFO: Using bootstrap image: registry.fedoraproject.org/fedora:rawhide
INFO: Pulling image: registry.fedoraproject.org/fedora:rawhide
INFO: Copy content of container registry.fedoraproject.org/fedora:rawhide to /var/lib/mock/fedora-rawhide-s390x-bootstrap-1705966360.259598/root
INFO: Checking that registry.fedoraproject.org/fedora:rawhide image matches host's architecture
INFO: mounting registry.fedoraproject.org/fedora:rawhide with podman image mount
INFO: image registry.fedoraproject.org/fedora:rawhide as /var/lib/containers/storage/overlay/cc51b4ee8d4e610a0d255c95bef496de1b1dbb5d0ffe04062b202dbef179df3a/merged
INFO: umounting image registry.fedoraproject.org/fedora:rawhide (/var/lib/containers/storage/overlay/cc51b4ee8d4e610a0d255c95bef496de1b1dbb5d0ffe04062b202dbef179df3a/merged) with podman image umount
INFO: Using 'dnf' instead of 'dnf5' for bootstrap chroot
INFO: Package manager dnf detected and used (fallback)
INFO: Bootstrap image not marked ready
Start(bootstrap): installing dnf5 tooling
No matches found for the following disable plugin patterns: local, spacewalk, versionlock
Copr repository                                 353 kB/s | 1.8 MB     00:05    
Additional repo http_kojipkgs_fedoraproject_org  13 MB/s |  68 MB     00:05    
fedora                                           22 MB/s |  64 MB     00:02    
Last metadata expiration check: 0:00:05 ago on Mon Jan 22 23:33:25 2024.
Dependencies resolved.
=========================================================================================================
 Package        Arch   Version       Repository                                                      Size
=========================================================================================================
Installing:
 dnf5           s390x  5.1.11-1.fc40 http_kojipkgs_fedoraproject_org_repos_rawhide_latest_basearch  542 k
 dnf5-plugins   s390x  5.1.11-1.fc40 http_kojipkgs_fedoraproject_org_repos_rawhide_latest_basearch  328 k
Installing dependencies:
 fmt            s390x  10.2.1-1.fc40 http_kojipkgs_fedoraproject_org_repos_rawhide_latest_basearch  129 k
 libdnf5        s390x  5.1.11-1.fc40 http_kojipkgs_fedoraproject_org_repos_rawhide_latest_basearch  927 k
 libdnf5-cli    s390x  5.1.11-1.fc40 http_kojipkgs_fedoraproject_org_repos_rawhide_latest_basearch  225 k
 sdbus-cpp      s390x  1.4.0-1.fc40  http_kojipkgs_fedoraproject_org_repos_rawhide_latest_basearch  103 k

Transaction Summary
=========================================================================================================
Install  6 Packages

Total download size: 2.2 M
Installed size: 6.1 M
Downloading Packages:
(1/6): dnf5-plugins-5.1.11-1.fc40.s390x.rpm     7.1 MB/s | 328 kB     00:00    
(2/6): fmt-10.2.1-1.fc40.s390x.rpm              2.5 MB/s | 129 kB     00:00    
(3/6): libdnf5-5.1.11-1.fc40.s390x.rpm          107 MB/s | 927 kB     00:00    
(4/6): libdnf5-cli-5.1.11-1.fc40.s390x.rpm       38 MB/s | 225 kB     00:00    
(5/6): sdbus-cpp-1.4.0-1.fc40.s390x.rpm          16 MB/s | 103 kB     00:00    
(6/6): dnf5-5.1.11-1.fc40.s390x.rpm             8.3 MB/s | 542 kB     00:00    
--------------------------------------------------------------------------------
Total                                            34 MB/s | 2.2 MB     00:00     
Running transaction check
Transaction check succeeded.
Running transaction test
Transaction test succeeded.
Running transaction
  Preparing        :                                                        1/1 
  Installing       : fmt-10.2.1-1.fc40.s390x                                1/6 
  Installing       : libdnf5-5.1.11-1.fc40.s390x                            2/6 
  Installing       : libdnf5-cli-5.1.11-1.fc40.s390x                        3/6 
  Installing       : dnf5-5.1.11-1.fc40.s390x                               4/6 
  Installing       : sdbus-cpp-1.4.0-1.fc40.s390x                           5/6 
  Installing       : dnf5-plugins-5.1.11-1.fc40.s390x                       6/6 
  Running scriptlet: dnf5-plugins-5.1.11-1.fc40.s390x                       6/6 

Installed:
  dnf5-5.1.11-1.fc40.s390x               dnf5-plugins-5.1.11-1.fc40.s390x       
  fmt-10.2.1-1.fc40.s390x                libdnf5-5.1.11-1.fc40.s390x            
  libdnf5-cli-5.1.11-1.fc40.s390x        sdbus-cpp-1.4.0-1.fc40.s390x           

Complete!
INFO: Switching package manager from dnf to the dnf5 (direct choice)
Finish(bootstrap): installing dnf5 tooling
Start(bootstrap): creating root cache
Finish(bootstrap): creating root cache
Finish(bootstrap): chroot init
Start: chroot init
INFO: mounting tmpfs at /var/lib/mock/fedora-rawhide-s390x-1705966360.259598/root.
INFO: calling preinit hooks
INFO: enabled root cache
INFO: enabled package manager cache
Start: cleaning package manager metadata
Finish: cleaning package manager metadata
INFO: enabled HW Info plugin
INFO: Package manager dnf5 detected and used (direct choice)
INFO: Buildroot is handled by package management downloaded with a bootstrap image:
  rpm-4.19.1-2.fc40.s390x
  rpm-sequoia-1.5.0-2.fc40.s390x
  python3-dnf-4.18.2-1.fc40.noarch
  yum-4.18.2-1.fc40.noarch
  dnf5-5.1.11-1.fc40.s390x
  dnf5-plugins-5.1.11-1.fc40.s390x
Start: installing minimal buildroot with dnf5
Updating and loading repositories:
 fedora                                 100% |  12.0 MiB/s |  18.8 MiB |  00m02s
 Copr repository                        100% | 854.3 KiB/s | 351.1 KiB |  00m00s
 Additional repo http_kojipkgs_fedorapr 100% | 121.9 MiB/s |  16.1 MiB |  00m00s
Repositories loaded.
Package                           Arch   Version                    Repository                                                         Size
Installing group/module packages:                                                                                                          
 bash                             s390x  5.2.26-1.fc40              http_kojipkgs_fedoraproject_org_repos_rawhide_latest_basearch   8.3 MiB
 bzip2                            s390x  1.0.8-16.fc39              http_kojipkgs_fedoraproject_org_repos_rawhide_latest_basearch  99.2 KiB
 coreutils                        s390x  9.4-3.fc40                 http_kojipkgs_fedoraproject_org_repos_rawhide_latest_basearch   6.2 MiB
 cpio                             s390x  2.14-5.fc40                http_kojipkgs_fedoraproject_org_repos_rawhide_latest_basearch   1.0 MiB
 diffutils                        s390x  3.10-3.fc39                http_kojipkgs_fedoraproject_org_repos_rawhide_latest_basearch   1.6 MiB
 fedora-release-common            noarch 40-0.29                    http_kojipkgs_fedoraproject_org_repos_rawhide_latest_basearch  19.1 KiB
 findutils                        s390x  1:4.9.0-6.fc40             http_kojipkgs_fedoraproject_org_repos_rawhide_latest_basearch   1.5 MiB
 gawk                             s390x  5.3.0-1.fc40               http_kojipkgs_fedoraproject_org_repos_rawhide_latest_basearch   1.8 MiB
 glibc-minimal-langpack           s390x  2.38.9000-33.fc40          http_kojipkgs_fedoraproject_org_repos_rawhide_latest_basearch   0.0   B
 grep                             s390x  3.11-5.fc40                http_kojipkgs_fedoraproject_org_repos_rawhide_latest_basearch   1.0 MiB
 gzip                             s390x  1.12-6.fc39                http_kojipkgs_fedoraproject_org_repos_rawhide_latest_basearch 383.7 KiB
 info                             s390x  7.1-1.fc40                 http_kojipkgs_fedoraproject_org_repos_rawhide_latest_basearch 405.1 KiB
 patch                            s390x  2.7.6-22.fc39              http_kojipkgs_fedoraproject_org_repos_rawhide_latest_basearch 274.3 KiB
 redhat-rpm-config                noarch 280-1.fc40                 http_kojipkgs_fedoraproject_org_repos_rawhide_latest_basearch 183.2 KiB
 rpm-build                        s390x  4.19.1-2.fc40              http_kojipkgs_fedoraproject_org_repos_rawhide_latest_basearch 180.2 KiB
 sed                              s390x  4.8-14.fc39                http_kojipkgs_fedoraproject_org_repos_rawhide_latest_basearch 809.6 KiB
 shadow-utils                     s390x  2:4.14.0-2.fc40            http_kojipkgs_fedoraproject_org_repos_rawhide_latest_basearch   4.0 MiB
 tar                              s390x  2:1.35-2.fc40              http_kojipkgs_fedoraproject_org_repos_rawhide_latest_basearch   3.0 MiB
 unzip                            s390x  6.0-62.fc39                http_kojipkgs_fedoraproject_org_repos_rawhide_latest_basearch 414.1 KiB
 util-linux                       s390x  2.39.3-2.fc40              http_kojipkgs_fedoraproject_org_repos_rawhide_latest_basearch   3.5 MiB
 which                            s390x  2.21-40.fc39               http_kojipkgs_fedoraproject_org_repos_rawhide_latest_basearch  83.9 KiB
 xz                               s390x  5.4.5-1.fc40               http_kojipkgs_fedoraproject_org_repos_rawhide_latest_basearch   2.0 MiB
Installing dependencies:                                                                                                                   
 alternatives                     s390x  1.26-1.fc40                http_kojipkgs_fedoraproject_org_repos_rawhide_latest_basearch  66.1 KiB
 ansible-srpm-macros              noarch 1-12.fc40                  http_kojipkgs_fedoraproject_org_repos_rawhide_latest_basearch  35.7 KiB
 audit-libs                       s390x  4.0-1.fc40                 http_kojipkgs_fedoraproject_org_repos_rawhide_latest_basearch 326.8 KiB
 authselect                       s390x  1.5.0-1.fc40               http_kojipkgs_fedoraproject_org_repos_rawhide_latest_basearch 156.3 KiB
 authselect-libs                  s390x  1.5.0-1.fc40               http_kojipkgs_fedoraproject_org_repos_rawhide_latest_basearch 989.2 KiB
 basesystem                       noarch 11-18.fc39                 http_kojipkgs_fedoraproject_org_repos_rawhide_latest_basearch   0.0   B
 binutils                         s390x  2.41-30.fc40               http_kojipkgs_fedoraproject_org_repos_rawhide_latest_basearch  25.9 MiB
 binutils-gold                    s390x  2.41-30.fc40               http_kojipkgs_fedoraproject_org_repos_rawhide_latest_basearch   2.9 MiB
 bzip2-libs                       s390x  1.0.8-16.fc39              http_kojipkgs_fedoraproject_org_repos_rawhide_latest_basearch  88.5 KiB
 ca-certificates                  noarch 2023.2.62_v7.0.401-4.fc40  http_kojipkgs_fedoraproject_org_repos_rawhide_latest_basearch   2.3 MiB
 coreutils-common                 s390x  9.4-3.fc40                 http_kojipkgs_fedoraproject_org_repos_rawhide_latest_basearch  11.4 MiB
 cracklib                         s390x  2.9.11-2.fc39              http_kojipkgs_fedoraproject_org_repos_rawhide_latest_basearch 250.0 KiB
 crypto-policies                  noarch 20231204-1.git1e3a2e4.fc40 http_kojipkgs_fedoraproject_org_repos_rawhide_latest_basearch 149.3 KiB
 curl                             s390x  8.5.0-1.fc40               http_kojipkgs_fedoraproject_org_repos_rawhide_latest_basearch 826.2 KiB
 cyrus-sasl-lib                   s390x  2.1.28-17.fc40             http_kojipkgs_fedoraproject_org_repos_rawhide_latest_basearch   2.4 MiB
 debugedit                        s390x  5.0-12.fc40                http_kojipkgs_fedoraproject_org_repos_rawhide_latest_basearch 202.5 KiB
 dwz                              s390x  0.15-3.fc39                http_kojipkgs_fedoraproject_org_repos_rawhide_latest_basearch 314.6 KiB
 ed                               s390x  1.20-1.fc40                http_kojipkgs_fedoraproject_org_repos_rawhide_latest_basearch 150.2 KiB
 efi-srpm-macros                  noarch 5-9.fc39                   http_kojipkgs_fedoraproject_org_repos_rawhide_latest_basearch  40.1 KiB
 elfutils                         s390x  0.190-4.fc40               http_kojipkgs_fedoraproject_org_repos_rawhide_latest_basearch   2.9 MiB
 elfutils-debuginfod-client       s390x  0.190-4.fc40               http_kojipkgs_fedoraproject_org_repos_rawhide_latest_basearch  64.4 KiB
 elfutils-default-yama-scope      noarch 0.190-4.fc40               http_kojipkgs_fedoraproject_org_repos_rawhide_latest_basearch   1.8 KiB
 elfutils-libelf                  s390x  0.190-4.fc40               http_kojipkgs_fedoraproject_org_repos_rawhide_latest_basearch   1.0 MiB
 elfutils-libs                    s390x  0.190-4.fc40               http_kojipkgs_fedoraproject_org_repos_rawhide_latest_basearch 734.1 KiB
 fedora-gpg-keys                  noarch 40-0.2                     http_kojipkgs_fedoraproject_org_repos_rawhide_latest_basearch 123.2 KiB
 fedora-release                   noarch 40-0.29                    http_kojipkgs_fedoraproject_org_repos_rawhide_latest_basearch   0.0   B
 fedora-release-identity-basic    noarch 40-0.29                    http_kojipkgs_fedoraproject_org_repos_rawhide_latest_basearch 694.0   B
 fedora-repos                     noarch 40-0.2                     http_kojipkgs_fedoraproject_org_repos_rawhide_latest_basearch   4.9 KiB
 fedora-repos-rawhide             noarch 40-0.2                     http_kojipkgs_fedoraproject_org_repos_rawhide_latest_basearch   2.2 KiB
 file                             s390x  5.45-1.fc40                http_kojipkgs_fedoraproject_org_repos_rawhide_latest_basearch 103.3 KiB
 file-libs                        s390x  5.45-1.fc40                http_kojipkgs_fedoraproject_org_repos_rawhide_latest_basearch   9.9 MiB
 filesystem                       s390x  3.18-6.fc39                http_kojipkgs_fedoraproject_org_repos_rawhide_latest_basearch 106.0   B
 fonts-srpm-macros                noarch 1:2.0.5-12.fc39            http_kojipkgs_fedoraproject_org_repos_rawhide_latest_basearch  55.3 KiB
 forge-srpm-macros                noarch 0.2.0-1.fc40               http_kojipkgs_fedoraproject_org_repos_rawhide_latest_basearch  37.4 KiB
 fpc-srpm-macros                  noarch 1.3-8.fc39                 http_kojipkgs_fedoraproject_org_repos_rawhide_latest_basearch 144.0   B
 gdb-minimal                      s390x  14.1-4.fc40                http_kojipkgs_fedoraproject_org_repos_rawhide_latest_basearch  12.5 MiB
 gdbm                             s390x  1:1.23-4.fc39              http_kojipkgs_fedoraproject_org_repos_rawhide_latest_basearch 483.9 KiB
 gdbm-libs                        s390x  1:1.23-4.fc39              http_kojipkgs_fedoraproject_org_repos_rawhide_latest_basearch 133.4 KiB
 ghc-srpm-macros                  noarch 1.6.1-3.fc40               http_kojipkgs_fedoraproject_org_repos_rawhide_latest_basearch 369.0   B
 glibc                            s390x  2.38.9000-33.fc40          http_kojipkgs_fedoraproject_org_repos_rawhide_latest_basearch   5.4 MiB
 glibc-common                     s390x  2.38.9000-33.fc40          http_kojipkgs_fedoraproject_org_repos_rawhide_latest_basearch   1.1 MiB
 glibc-gconv-extra                s390x  2.38.9000-33.fc40          http_kojipkgs_fedoraproject_org_repos_rawhide_latest_basearch   7.7 MiB
 gmp                              s390x  1:6.2.1-5.fc39             http_kojipkgs_fedoraproject_org_repos_rawhide_latest_basearch 765.1 KiB
 gnat-srpm-macros                 noarch 6-3.fc39                   http_kojipkgs_fedoraproject_org_repos_rawhide_latest_basearch   1.0 KiB
 go-srpm-macros                   noarch 3.3.1-1.fc40               http_kojipkgs_fedoraproject_org_repos_rawhide_latest_basearch  60.6 KiB
 jansson                          s390x  2.13.1-7.fc39              http_kojipkgs_fedoraproject_org_repos_rawhide_latest_basearch  92.1 KiB
 kernel-srpm-macros               noarch 1.0-20.fc39                http_kojipkgs_fedoraproject_org_repos_rawhide_latest_basearch   1.9 KiB
 keyutils-libs                    s390x  1.6.3-1.fc40               http_kojipkgs_fedoraproject_org_repos_rawhide_latest_basearch  54.2 KiB
 krb5-libs                        s390x  1.21.2-3.fc40              http_kojipkgs_fedoraproject_org_repos_rawhide_latest_basearch   2.4 MiB
 libacl                           s390x  2.3.1-11.fc40              http_kojipkgs_fedoraproject_org_repos_rawhide_latest_basearch  39.8 KiB
 libarchive                       s390x  3.7.2-1.fc40               http_kojipkgs_fedoraproject_org_repos_rawhide_latest_basearch   1.0 MiB
 libattr                          s390x  2.5.2-1.fc40               http_kojipkgs_fedoraproject_org_repos_rawhide_latest_basearch  28.3 KiB
 libblkid                         s390x  2.39.3-2.fc40              http_kojipkgs_fedoraproject_org_repos_rawhide_latest_basearch 256.9 KiB
 libbrotli                        s390x  1.1.0-1.fc40               http_kojipkgs_fedoraproject_org_repos_rawhide_latest_basearch 917.1 KiB
 libcap                           s390x  2.69-1.fc40                http_kojipkgs_fedoraproject_org_repos_rawhide_latest_basearch 231.1 KiB
 libcap-ng                        s390x  0.8.4-2.fc40               http_kojipkgs_fedoraproject_org_repos_rawhide_latest_basearch  76.7 KiB
 libcom_err                       s390x  1.47.0-2.fc39              http_kojipkgs_fedoraproject_org_repos_rawhide_latest_basearch  67.0 KiB
 libcurl                          s390x  8.5.0-1.fc40               http_kojipkgs_fedoraproject_org_repos_rawhide_latest_basearch 816.5 KiB
 libeconf                         s390x  0.5.2-1.fc40               http_kojipkgs_fedoraproject_org_repos_rawhide_latest_basearch  55.8 KiB
 libevent                         s390x  2.1.12-9.fc39              http_kojipkgs_fedoraproject_org_repos_rawhide_latest_basearch 938.7 KiB
 libfdisk                         s390x  2.39.3-2.fc40              http_kojipkgs_fedoraproject_org_repos_rawhide_latest_basearch 390.9 KiB
 libffi                           s390x  3.4.4-5.fc40               http_kojipkgs_fedoraproject_org_repos_rawhide_latest_basearch  65.1 KiB
 libgcc                           s390x  14.0.1-0.2.fc40            http_kojipkgs_fedoraproject_org_repos_rawhide_latest_basearch 173.2 KiB
 libgomp                          s390x  14.0.1-0.2.fc40            http_kojipkgs_fedoraproject_org_repos_rawhide_latest_basearch 527.6 KiB
 libidn2                          s390x  2.3.4-3.fc39               http_kojipkgs_fedoraproject_org_repos_rawhide_latest_basearch 322.9 KiB
 libmount                         s390x  2.39.3-2.fc40              http_kojipkgs_fedoraproject_org_repos_rawhide_latest_basearch 368.1 KiB
 libnghttp2                       s390x  1.59.0-1.fc40              http_kojipkgs_fedoraproject_org_repos_rawhide_latest_basearch 173.9 KiB
 libnsl2                          s390x  2.0.0-6.fc39               http_kojipkgs_fedoraproject_org_repos_rawhide_latest_basearch  61.7 KiB
 libpkgconf                       s390x  1.9.5-2.fc39               http_kojipkgs_fedoraproject_org_repos_rawhide_latest_basearch  85.8 KiB
 libpsl                           s390x  0.21.5-1.fc40              http_kojipkgs_fedoraproject_org_repos_rawhide_latest_basearch  80.3 KiB
 libpwquality                     s390x  1.4.5-6.fc39               http_kojipkgs_fedoraproject_org_repos_rawhide_latest_basearch 420.9 KiB
 libselinux                       s390x  3.6-2.fc40                 http_kojipkgs_fedoraproject_org_repos_rawhide_latest_basearch 188.9 KiB
 libsemanage                      s390x  3.6-1.fc40                 http_kojipkgs_fedoraproject_org_repos_rawhide_latest_basearch 301.3 KiB
 libsepol                         s390x  3.6-1.fc40                 http_kojipkgs_fedoraproject_org_repos_rawhide_latest_basearch 842.2 KiB
 libsmartcols                     s390x  2.39.3-2.fc40              http_kojipkgs_fedoraproject_org_repos_rawhide_latest_basearch 152.0 KiB
 libssh                           s390x  0.10.6-2.fc40              http_kojipkgs_fedoraproject_org_repos_rawhide_latest_basearch 529.0 KiB
 libssh-config                    noarch 0.10.6-2.fc40              http_kojipkgs_fedoraproject_org_repos_rawhide_latest_basearch 277.0   B
 libstdc++                        s390x  14.0.1-0.2.fc40            http_kojipkgs_fedoraproject_org_repos_rawhide_latest_basearch   3.1 MiB
 libtasn1                         s390x  4.19.0-3.fc39              http_kojipkgs_fedoraproject_org_repos_rawhide_latest_basearch 187.5 KiB
 libtirpc                         s390x  1.3.4-1.rc1.fc40           http_kojipkgs_fedoraproject_org_repos_rawhide_latest_basearch 214.6 KiB
 libunistring                     s390x  1.1-5.fc40                 http_kojipkgs_fedoraproject_org_repos_rawhide_latest_basearch   1.8 MiB
 libutempter                      s390x  1.2.1-10.fc39              http_kojipkgs_fedoraproject_org_repos_rawhide_latest_basearch  57.3 KiB
 libuuid                          s390x  2.39.3-2.fc40              http_kojipkgs_fedoraproject_org_repos_rawhide_latest_basearch  37.3 KiB
 libverto                         s390x  0.3.2-6.fc39               http_kojipkgs_fedoraproject_org_repos_rawhide_latest_basearch  29.2 KiB
 libxcrypt                        s390x  4.4.36-4.fc40              http_kojipkgs_fedoraproject_org_repos_rawhide_latest_basearch 274.7 KiB
 libxml2                          s390x  2.12.4-1.fc40              http_kojipkgs_fedoraproject_org_repos_rawhide_latest_basearch   1.9 MiB
 libzstd                          s390x  1.5.5-4.fc39               http_kojipkgs_fedoraproject_org_repos_rawhide_latest_basearch 859.8 KiB
 lua-libs                         s390x  5.4.6-3.fc39               http_kojipkgs_fedoraproject_org_repos_rawhide_latest_basearch 324.9 KiB
 lua-srpm-macros                  noarch 1-9.fc39                   http_kojipkgs_fedoraproject_org_repos_rawhide_latest_basearch   1.3 KiB
 lz4-libs                         s390x  1.9.4-4.fc39               http_kojipkgs_fedoraproject_org_repos_rawhide_latest_basearch 169.2 KiB
 mpfr                             s390x  4.2.1-1.fc40               http_kojipkgs_fedoraproject_org_repos_rawhide_latest_basearch 698.8 KiB
 ncurses-base                     noarch 6.4-9.20240113.fc40        http_kojipkgs_fedoraproject_org_repos_rawhide_latest_basearch 326.2 KiB
 ncurses-libs                     s390x  6.4-9.20240113.fc40        http_kojipkgs_fedoraproject_org_repos_rawhide_latest_basearch   1.1 MiB
 ocaml-srpm-macros                noarch 9-1.fc40                   http_kojipkgs_fedoraproject_org_repos_rawhide_latest_basearch   1.9 KiB
 openblas-srpm-macros             noarch 2-14.fc39                  http_kojipkgs_fedoraproject_org_repos_rawhide_latest_basearch 104.0   B
 openldap                         s390x  2.6.6-1.fc39               http_kojipkgs_fedoraproject_org_repos_rawhide_latest_basearch 669.0 KiB
 openssl-libs                     s390x  1:3.1.4-1.fc40             http_kojipkgs_fedoraproject_org_repos_rawhide_latest_basearch   5.6 MiB
 p11-kit                          s390x  0.25.3-1.fc40              http_kojipkgs_fedoraproject_org_repos_rawhide_latest_basearch   2.5 MiB
 p11-kit-trust                    s390x  0.25.3-1.fc40              http_kojipkgs_fedoraproject_org_repos_rawhide_latest_basearch 467.2 KiB
 package-notes-srpm-macros        noarch 0.5-9.fc39                 http_kojipkgs_fedoraproject_org_repos_rawhide_latest_basearch   1.6 KiB
 pam                              s390x  1.5.3-9.fc40               http_kojipkgs_fedoraproject_org_repos_rawhide_latest_basearch   1.7 MiB
 pam-libs                         s390x  1.5.3-9.fc40               http_kojipkgs_fedoraproject_org_repos_rawhide_latest_basearch 134.4 KiB
 pcre2                            s390x  10.42-2.fc40               http_kojipkgs_fedoraproject_org_repos_rawhide_latest_basearch 657.2 KiB
 pcre2-syntax                     noarch 10.42-2.fc40               http_kojipkgs_fedoraproject_org_repos_rawhide_latest_basearch 235.1 KiB
 perl-srpm-macros                 noarch 1-51.fc39                  http_kojipkgs_fedoraproject_org_repos_rawhide_latest_basearch 861.0   B
 pkgconf                          s390x  1.9.5-2.fc39               http_kojipkgs_fedoraproject_org_repos_rawhide_latest_basearch  83.6 KiB
 pkgconf-m4                       noarch 1.9.5-2.fc39               http_kojipkgs_fedoraproject_org_repos_rawhide_latest_basearch  13.9 KiB
 pkgconf-pkg-config               s390x  1.9.5-2.fc39               http_kojipkgs_fedoraproject_org_repos_rawhide_latest_basearch 988.0   B
 popt                             s390x  1.19-3.fc39                http_kojipkgs_fedoraproject_org_repos_rawhide_latest_basearch 144.6 KiB
 publicsuffix-list-dafsa          noarch 20240107-1.fc40            http_kojipkgs_fedoraproject_org_repos_rawhide_latest_basearch  67.5 KiB
 pyproject-srpm-macros            noarch 1.11.0-1.fc40              http_kojipkgs_fedoraproject_org_repos_rawhide_latest_basearch   1.5 KiB
 python-srpm-macros               noarch 3.12-5.fc40                http_kojipkgs_fedoraproject_org_repos_rawhide_latest_basearch  50.1 KiB
 qt5-srpm-macros                  noarch 5.15.12-1.fc40             http_kojipkgs_fedoraproject_org_repos_rawhide_latest_basearch 492.0   B
 qt6-srpm-macros                  noarch 6.6.1-3.fc40               http_kojipkgs_fedoraproject_org_repos_rawhide_latest_basearch 456.0   B
 readline                         s390x  8.2-7.fc40                 http_kojipkgs_fedoraproject_org_repos_rawhide_latest_basearch 556.8 KiB
 rpm                              s390x  4.19.1-2.fc40              http_kojipkgs_fedoraproject_org_repos_rawhide_latest_basearch   3.0 MiB
 rpm-build-libs                   s390x  4.19.1-2.fc40              http_kojipkgs_fedoraproject_org_repos_rawhide_latest_basearch 206.2 KiB
 rpm-libs                         s390x  4.19.1-2.fc40              http_kojipkgs_fedoraproject_org_repos_rawhide_latest_basearch 809.6 KiB
 rpm-sequoia                      s390x  1.5.0-2.fc40               http_kojipkgs_fedoraproject_org_repos_rawhide_latest_basearch   3.0 MiB
 rust-srpm-macros                 noarch 25.2-2.fc40                http_kojipkgs_fedoraproject_org_repos_rawhide_latest_basearch   5.1 KiB
 setup                            noarch 2.14.5-1.fc40              http_kojipkgs_fedoraproject_org_repos_rawhide_latest_basearch 720.4 KiB
 sqlite-libs                      s390x  3.45.0-1.fc40              http_kojipkgs_fedoraproject_org_repos_rawhide_latest_basearch   1.6 MiB
 systemd-libs                     s390x  255.2-2.fc40               http_kojipkgs_fedoraproject_org_repos_rawhide_latest_basearch   2.0 MiB
 util-linux-core                  s390x  2.39.3-2.fc40              http_kojipkgs_fedoraproject_org_repos_rawhide_latest_basearch   1.4 MiB
 xxhash-libs                      s390x  0.8.2-1.fc39               http_kojipkgs_fedoraproject_org_repos_rawhide_latest_basearch  68.0 KiB
 xz-libs                          s390x  5.4.5-1.fc40               http_kojipkgs_fedoraproject_org_repos_rawhide_latest_basearch 221.6 KiB
 zig-srpm-macros                  noarch 1-1.fc40                   http_kojipkgs_fedoraproject_org_repos_rawhide_latest_basearch   1.1 KiB
 zip                              s390x  3.0-39.fc40                http_kojipkgs_fedoraproject_org_repos_rawhide_latest_basearch 754.3 KiB
 zlib-ng-compat                   s390x  2.1.6-1.fc40               http_kojipkgs_fedoraproject_org_repos_rawhide_latest_basearch 117.4 KiB
 zstd                             s390x  1.5.5-4.fc39               http_kojipkgs_fedoraproject_org_repos_rawhide_latest_basearch   1.8 MiB
Installing groups:                                                                                                                         
 Buildsystem building group                                                                                                                

Transaction Summary:
 Installing:      152 packages

Total size of inbound packages is 52 MiB. Need to download 52 MiB.
After this operation 179 MiB will be used (install 179 MiB, remove 0 B).
[  1/152] bzip2-0:1.0.8-16.fc39.s390x   100% |   1.7 MiB/s |  53.2 KiB |  00m00s
[  2/152] coreutils-0:9.4-3.fc40.s390x  100% |  29.9 MiB/s |   1.2 MiB |  00m00s
[  3/152] cpio-0:2.14-5.fc40.s390x      100% |  26.9 MiB/s | 275.9 KiB |  00m00s
[  4/152] fedora-release-common-0:40-0. 100% |   6.7 MiB/s |  20.5 KiB |  00m00s
[  5/152] diffutils-0:3.10-3.fc39.s390x 100% |  77.8 MiB/s | 398.2 KiB |  00m00s
[  6/152] findutils-1:4.9.0-6.fc40.s390 100% |  79.4 MiB/s | 487.8 KiB |  00m00s
[  7/152] gawk-0:5.3.0-1.fc40.s390x     100% | 155.6 MiB/s |   1.1 MiB |  00m00s
[  8/152] grep-0:3.11-5.fc40.s390x      100% |  71.8 MiB/s | 294.1 KiB |  00m00s
[  9/152] glibc-minimal-langpack-0:2.38 100% |  15.5 MiB/s |  95.3 KiB |  00m00s
[ 10/152] gzip-0:1.12-6.fc39.s390x      100% |  32.5 MiB/s | 166.3 KiB |  00m00s
[ 11/152] info-0:7.1-1.fc40.s390x       100% |  38.1 MiB/s | 194.9 KiB |  00m00s
[ 12/152] redhat-rpm-config-0:280-1.fc4 100% |  18.4 MiB/s |  75.2 KiB |  00m00s
[ 13/152] patch-0:2.7.6-22.fc39.s390x   100% |  26.1 MiB/s | 133.8 KiB |  00m00s
[ 14/152] rpm-build-0:4.19.1-2.fc40.s39 100% |  17.4 MiB/s |  71.4 KiB |  00m00s
[ 15/152] sed-0:4.8-14.fc39.s390x       100% |  58.6 MiB/s | 300.3 KiB |  00m00s
[ 16/152] tar-2:1.35-2.fc40.s390x       100% |  93.8 MiB/s | 864.7 KiB |  00m00s
[ 17/152] bash-0:5.2.26-1.fc40.s390x    100% |  19.9 MiB/s |   1.8 MiB |  00m00s
[ 18/152] shadow-utils-2:4.14.0-2.fc40. 100% |  75.8 MiB/s |   1.2 MiB |  00m00s
[ 19/152] which-0:2.21-40.fc39.s390x    100% |   8.4 MiB/s |  43.2 KiB |  00m00s
[ 20/152] unzip-0:6.0-62.fc39.s390x     100% |  15.8 MiB/s | 193.9 KiB |  00m00s
[ 21/152] xz-0:5.4.5-1.fc40.s390x       100% |  65.0 MiB/s | 532.1 KiB |  00m00s
[ 22/152] glibc-0:2.38.9000-33.fc40.s39 100% | 126.1 MiB/s |   1.9 MiB |  00m00s
[ 23/152] xz-libs-0:5.4.5-1.fc40.s390x  100% |  18.6 MiB/s | 114.2 KiB |  00m00s
[ 24/152] util-linux-0:2.39.3-2.fc40.s3 100% |  40.0 MiB/s |   1.1 MiB |  00m00s
[ 25/152] audit-libs-0:4.0-1.fc40.s390x 100% |  20.3 MiB/s | 125.0 KiB |  00m00s
[ 26/152] authselect-libs-0:1.5.0-1.fc4 100% |  37.9 MiB/s | 233.0 KiB |  00m00s
[ 27/152] libblkid-0:2.39.3-2.fc40.s390 100% |  14.7 MiB/s | 120.5 KiB |  00m00s
[ 28/152] libfdisk-0:2.39.3-2.fc40.s390 100% |  32.4 MiB/s | 165.8 KiB |  00m00s
[ 29/152] libcap-ng-0:0.8.4-2.fc40.s390 100% |   5.3 MiB/s |  32.9 KiB |  00m00s
[ 30/152] libselinux-0:3.6-2.fc40.s390x 100% |  22.5 MiB/s |  92.2 KiB |  00m00s
[ 31/152] libmount-0:2.39.3-2.fc40.s390 100% |  30.9 MiB/s | 158.4 KiB |  00m00s
[ 32/152] libsmartcols-0:2.39.3-2.fc40. 100% |  13.7 MiB/s |  69.9 KiB |  00m00s
[ 33/152] libuuid-0:2.39.3-2.fc40.s390x 100% |   9.3 MiB/s |  28.6 KiB |  00m00s
[ 34/152] libutempter-0:1.2.1-10.fc39.s 100% |   6.3 MiB/s |  26.0 KiB |  00m00s
[ 35/152] pam-libs-0:1.5.3-9.fc40.s390x 100% |  14.4 MiB/s |  59.0 KiB |  00m00s
[ 36/152] ncurses-libs-0:6.4-9.20240113 100% |  39.3 MiB/s | 362.1 KiB |  00m00s
[ 37/152] pam-0:1.5.3-9.fc40.s390x      100% |  84.7 MiB/s | 520.4 KiB |  00m00s
[ 38/152] readline-0:8.2-7.fc40.s390x   100% |  32.1 MiB/s | 230.0 KiB |  00m00s
[ 39/152] systemd-libs-0:255.2-2.fc40.s 100% |  86.7 MiB/s | 710.1 KiB |  00m00s
[ 40/152] util-linux-core-0:2.39.3-2.fc 100% |  53.9 MiB/s | 496.6 KiB |  00m00s
[ 41/152] bzip2-libs-0:1.0.8-16.fc39.s3 100% |  15.1 MiB/s |  46.4 KiB |  00m00s
[ 42/152] zlib-ng-compat-0:2.1.6-1.fc40 100% |  12.9 MiB/s |  65.8 KiB |  00m00s
[ 43/152] libacl-0:2.3.1-11.fc40.s390x  100% |   6.0 MiB/s |  24.8 KiB |  00m00s
[ 44/152] libgcc-0:14.0.1-0.2.fc40.s390 100% |  22.3 MiB/s |  68.4 KiB |  00m00s
[ 45/152] libcap-0:2.69-1.fc40.s390x    100% |  16.5 MiB/s |  84.7 KiB |  00m00s
[ 46/152] libattr-0:2.5.2-1.fc40.s390x  100% |   5.9 MiB/s |  18.3 KiB |  00m00s
[ 47/152] libzstd-0:1.5.5-4.fc39.s390x  100% |  47.8 MiB/s | 342.4 KiB |  00m00s
[ 48/152] lz4-libs-0:1.9.4-4.fc39.s390x 100% |  19.7 MiB/s |  80.9 KiB |  00m00s
[ 49/152] libeconf-0:0.5.2-1.fc40.s390x 100% |  10.4 MiB/s |  32.0 KiB |  00m00s
[ 50/152] libsemanage-0:3.6-1.fc40.s390 100% |  38.6 MiB/s | 118.6 KiB |  00m00s
[ 51/152] libxcrypt-0:4.4.36-4.fc40.s39 100% |  24.1 MiB/s | 123.5 KiB |  00m00s
[ 52/152] setup-0:2.14.5-1.fc40.noarch  100% |  24.1 MiB/s | 148.1 KiB |  00m00s
[ 53/152] debugedit-0:5.0-12.fc40.s390x 100% |  15.9 MiB/s |  81.5 KiB |  00m00s
[ 54/152] elfutils-0:0.190-4.fc40.s390x 100% |  55.7 MiB/s | 570.7 KiB |  00m00s
[ 55/152] elfutils-libelf-0:0.190-4.fc4 100% |  19.5 MiB/s | 199.8 KiB |  00m00s
[ 56/152] file-0:5.45-1.fc40.s390x      100% |   8.0 MiB/s |  49.1 KiB |  00m00s
[ 57/152] pkgconf-pkg-config-0:1.9.5-2. 100% |   1.3 MiB/s |   9.6 KiB |  00m00s
[ 58/152] popt-0:1.19-3.fc39.s390x      100% |  12.2 MiB/s |  62.2 KiB |  00m00s
[ 59/152] binutils-0:2.41-30.fc40.s390x 100% | 169.6 MiB/s |   5.9 MiB |  00m00s
[ 60/152] rpm-0:4.19.1-2.fc40.s390x     100% |  41.5 MiB/s | 509.4 KiB |  00m00s
[ 61/152] rpm-build-libs-0:4.19.1-2.fc4 100% |  11.9 MiB/s |  97.2 KiB |  00m00s
[ 62/152] rpm-libs-0:4.19.1-2.fc40.s390 100% |  63.2 MiB/s | 323.7 KiB |  00m00s
[ 63/152] libarchive-0:3.7.2-1.fc40.s39 100% |  85.9 MiB/s | 440.0 KiB |  00m00s
[ 64/152] zstd-0:1.5.5-4.fc39.s390x     100% |  70.5 MiB/s | 505.7 KiB |  00m00s
[ 65/152] ansible-srpm-macros-0:1-12.fc 100% |   4.1 MiB/s |  20.9 KiB |  00m00s
[ 66/152] dwz-0:0.15-3.fc39.s390x       100% |  35.1 MiB/s | 143.6 KiB |  00m00s
[ 67/152] efi-srpm-macros-0:5-9.fc39.no 100% |   7.2 MiB/s |  22.2 KiB |  00m00s
[ 68/152] fonts-srpm-macros-1:2.0.5-12. 100% |   8.6 MiB/s |  26.5 KiB |  00m00s
[ 69/152] glibc-gconv-extra-0:2.38.9000 100% |  97.8 MiB/s |   1.7 MiB |  00m00s
[ 70/152] fpc-srpm-macros-0:1.3-8.fc39. 100% |   2.4 MiB/s |   7.4 KiB |  00m00s
[ 71/152] forge-srpm-macros-0:0.2.0-1.f 100% |   4.5 MiB/s |  18.5 KiB |  00m00s
[ 72/152] ghc-srpm-macros-0:1.6.1-3.fc4 100% |   2.6 MiB/s |   8.1 KiB |  00m00s
[ 73/152] gnat-srpm-macros-0:6-3.fc39.n 100% |   2.9 MiB/s |   8.8 KiB |  00m00s
[ 74/152] go-srpm-macros-0:3.3.1-1.fc40 100% |   6.8 MiB/s |  27.7 KiB |  00m00s
[ 75/152] lua-srpm-macros-0:1-9.fc39.no 100% |   2.8 MiB/s |   8.6 KiB |  00m00s
[ 76/152] kernel-srpm-macros-0:1.0-20.f 100% |   2.6 MiB/s |  10.5 KiB |  00m00s
[ 77/152] ocaml-srpm-macros-0:9-1.fc40. 100% |   2.9 MiB/s |   9.0 KiB |  00m00s
[ 78/152] openblas-srpm-macros-0:2-14.f 100% |   2.5 MiB/s |   7.5 KiB |  00m00s
[ 79/152] package-notes-srpm-macros-0:0 100% |   3.6 MiB/s |  11.2 KiB |  00m00s
[ 80/152] perl-srpm-macros-0:1-51.fc39. 100% |   2.0 MiB/s |   8.0 KiB |  00m00s
[ 81/152] python-srpm-macros-0:3.12-5.f 100% |   8.1 MiB/s |  24.9 KiB |  00m00s
[ 82/152] pyproject-srpm-macros-0:1.11. 100% |   4.8 MiB/s |  14.8 KiB |  00m00s
[ 83/152] qt5-srpm-macros-0:5.15.12-1.f 100% |   1.6 MiB/s |   8.4 KiB |  00m00s
[ 84/152] rust-srpm-macros-0:25.2-2.fc4 100% |   4.2 MiB/s |  13.0 KiB |  00m00s
[ 85/152] qt6-srpm-macros-0:6.6.1-3.fc4 100% |   2.9 MiB/s |   8.8 KiB |  00m00s
[ 86/152] zig-srpm-macros-0:1-1.fc40.no 100% |   1.9 MiB/s |   8.0 KiB |  00m00s
[ 87/152] zip-0:3.0-39.fc40.s390x       100% |  69.0 MiB/s | 282.8 KiB |  00m00s
[ 88/152] pkgconf-0:1.9.5-2.fc39.s390x  100% |  10.4 MiB/s |  42.6 KiB |  00m00s
[ 89/152] pkgconf-m4-0:1.9.5-2.fc39.noa 100% |   3.4 MiB/s |  13.9 KiB |  00m00s
[ 90/152] libpkgconf-0:1.9.5-2.fc39.s39 100% |  12.4 MiB/s |  38.1 KiB |  00m00s
[ 91/152] ed-0:1.20-1.fc40.s390x        100% |  16.3 MiB/s |  83.5 KiB |  00m00s
[ 92/152] gdbm-1:1.23-4.fc39.s390x      100% |  37.0 MiB/s | 151.4 KiB |  00m00s
[ 93/152] authselect-0:1.5.0-1.fc40.s39 100% |  35.0 MiB/s | 143.4 KiB |  00m00s
[ 94/152] gdbm-libs-1:1.23-4.fc39.s390x 100% |  14.1 MiB/s |  58.0 KiB |  00m00s
[ 95/152] libpwquality-0:1.4.5-6.fc39.s 100% |  35.6 MiB/s | 109.3 KiB |  00m00s
[ 96/152] libnsl2-0:2.0.0-6.fc39.s390x  100% |   7.2 MiB/s |  29.6 KiB |  00m00s
[ 97/152] libtirpc-0:1.3.4-1.rc1.fc40.s 100% |  23.5 MiB/s |  96.1 KiB |  00m00s
[ 98/152] ca-certificates-0:2023.2.62_v 100% |  93.6 MiB/s | 862.6 KiB |  00m00s
[ 99/152] crypto-policies-0:20231204-1. 100% |  11.2 MiB/s |  68.7 KiB |  00m00s
[100/152] openssl-libs-1:3.1.4-1.fc40.s 100% | 156.0 MiB/s |   1.9 MiB |  00m00s
[101/152] ncurses-base-0:6.4-9.20240113 100% |  15.5 MiB/s |  63.5 KiB |  00m00s
[102/152] libcom_err-0:1.47.0-2.fc39.s3 100% |   6.3 MiB/s |  26.0 KiB |  00m00s
[103/152] krb5-libs-0:1.21.2-3.fc40.s39 100% |  95.3 MiB/s | 780.5 KiB |  00m00s
[104/152] cracklib-0:2.9.11-2.fc39.s390 100% |  13.6 MiB/s |  83.5 KiB |  00m00s
[105/152] libsepol-0:3.6-1.fc40.s390x   100% |  28.1 MiB/s | 345.7 KiB |  00m00s
[106/152] pcre2-0:10.42-2.fc40.s390x    100% |  24.4 MiB/s | 250.0 KiB |  00m00s
[107/152] keyutils-libs-0:1.6.3-1.fc40. 100% |  10.2 MiB/s |  31.3 KiB |  00m00s
[108/152] libverto-0:0.3.2-6.fc39.s390x 100% |   4.1 MiB/s |  20.8 KiB |  00m00s
[109/152] libxml2-0:2.12.4-1.fc40.s390x 100% |  76.5 MiB/s | 704.9 KiB |  00m00s
[110/152] basesystem-0:11-18.fc39.noarc 100% |   1.8 MiB/s |   7.2 KiB |  00m00s
[111/152] gmp-1:6.2.1-5.fc39.s390x      100% |  45.3 MiB/s | 324.5 KiB |  00m00s
[112/152] glibc-common-0:2.38.9000-33.f 100% |  25.6 MiB/s | 393.3 KiB |  00m00s
[113/152] filesystem-0:3.18-6.fc39.s390 100% |  97.1 MiB/s |   1.1 MiB |  00m00s
[114/152] fedora-repos-0:40-0.2.noarch  100% |   2.3 MiB/s |   9.3 KiB |  00m00s
[115/152] mpfr-0:4.2.1-1.fc40.s390x     100% |  32.2 MiB/s | 297.2 KiB |  00m00s
[116/152] file-libs-0:5.45-1.fc40.s390x 100% |  75.1 MiB/s | 768.8 KiB |  00m00s
[117/152] elfutils-libs-0:0.190-4.fc40. 100% |  38.5 MiB/s | 275.7 KiB |  00m00s
[118/152] coreutils-common-0:9.4-3.fc40 100% | 177.1 MiB/s |   2.1 MiB |  00m00s
[119/152] libstdc++-0:14.0.1-0.2.fc40.s 100% |  63.3 MiB/s | 973.0 KiB |  00m00s
[120/152] p11-kit-0:0.25.3-1.fc40.s390x 100% |  46.0 MiB/s | 518.6 KiB |  00m00s
[121/152] alternatives-0:1.26-1.fc40.s3 100% |   6.6 MiB/s |  40.6 KiB |  00m00s
[122/152] p11-kit-trust-0:0.25.3-1.fc40 100% |  13.9 MiB/s | 142.1 KiB |  00m00s
[123/152] binutils-gold-0:2.41-30.fc40. 100% |  97.2 MiB/s | 995.8 KiB |  00m00s
[124/152] elfutils-debuginfod-client-0: 100% |   9.3 MiB/s |  38.2 KiB |  00m00s
[125/152] jansson-0:2.13.1-7.fc39.s390x 100% |  10.8 MiB/s |  44.1 KiB |  00m00s
[126/152] lua-libs-0:5.4.6-3.fc39.s390x 100% |  34.6 MiB/s | 141.7 KiB |  00m00s
[127/152] rpm-sequoia-0:1.5.0-2.fc40.s3 100% | 108.9 MiB/s |   1.0 MiB |  00m00s
[128/152] sqlite-libs-0:3.45.0-1.fc40.s 100% |  53.1 MiB/s | 761.0 KiB |  00m00s
[129/152] libgomp-0:14.0.1-0.2.fc40.s39 100% |  24.9 MiB/s | 331.9 KiB |  00m00s
[130/152] pcre2-syntax-0:10.42-2.fc40.n 100% |  14.0 MiB/s | 143.1 KiB |  00m00s
[131/152] libffi-0:3.4.4-5.fc40.s390x   100% |  11.5 MiB/s |  35.4 KiB |  00m00s
[132/152] fedora-gpg-keys-0:40-0.2.noar 100% |  29.1 MiB/s | 119.4 KiB |  00m00s
[133/152] libtasn1-0:4.19.0-3.fc39.s390 100% |  12.6 MiB/s |  77.2 KiB |  00m00s
[134/152] fedora-repos-rawhide-0:40-0.2 100% |   2.2 MiB/s |   8.9 KiB |  00m00s
[135/152] fedora-release-0:40-0.29.noar 100% |   3.3 MiB/s |  10.0 KiB |  00m00s
[136/152] elfutils-default-yama-scope-0 100% |   3.1 MiB/s |  12.8 KiB |  00m00s
[137/152] xxhash-libs-0:0.8.2-1.fc39.s3 100% |  12.0 MiB/s |  36.8 KiB |  00m00s
[138/152] fedora-release-identity-basic 100% |   2.6 MiB/s |  10.8 KiB |  00m00s
[139/152] curl-0:8.5.0-1.fc40.s390x     100% |  28.0 MiB/s | 372.2 KiB |  00m00s
[140/152] libcurl-0:8.5.0-1.fc40.s390x  100% |  44.2 MiB/s | 362.4 KiB |  00m00s
[141/152] libbrotli-0:1.1.0-1.fc40.s390 100% |  52.8 MiB/s | 378.5 KiB |  00m00s
[142/152] gdb-minimal-0:14.1-4.fc40.s39 100% | 161.2 MiB/s |   4.2 MiB |  00m00s
[143/152] libidn2-0:2.3.4-3.fc39.s390x  100% |  21.7 MiB/s | 111.3 KiB |  00m00s
[144/152] libnghttp2-0:1.59.0-1.fc40.s3 100% |  12.9 MiB/s |  79.2 KiB |  00m00s
[145/152] libpsl-0:0.21.5-1.fc40.s390x  100% |  15.6 MiB/s |  63.7 KiB |  00m00s
[146/152] libssh-0:0.10.6-2.fc40.s390x  100% |  40.9 MiB/s | 209.3 KiB |  00m00s
[147/152] openldap-0:2.6.6-1.fc39.s390x 100% |  51.2 MiB/s | 262.0 KiB |  00m00s
[148/152] libevent-0:2.1.12-9.fc39.s390 100% |  50.7 MiB/s | 259.6 KiB |  00m00s
[149/152] libssh-config-0:0.10.6-2.fc40 100% |   2.2 MiB/s |   9.1 KiB |  00m00s
[150/152] cyrus-sasl-lib-0:2.1.28-17.fc 100% |  80.1 MiB/s | 820.3 KiB |  00m00s
[151/152] publicsuffix-list-dafsa-0:202 100% |  18.9 MiB/s |  58.0 KiB |  00m00s
[152/152] libunistring-0:1.1-5.fc40.s39 100% |  90.6 MiB/s | 556.3 KiB |  00m00s
--------------------------------------------------------------------------------
[152/152] Total                         100% | 119.9 MiB/s |  52.0 MiB |  00m00s
Running transaction
[  1/154] Verify package files          100% | 817.0   B/s | 152.0   B |  00m00s
>>> Running pre-transaction scriptlet: filesystem-0:3.18-6.fc39.s390x
>>> Stop pre-transaction scriptlet: filesystem-0:3.18-6.fc39.s390x
[  2/154] Prepare transaction           100% |   3.0 KiB/s | 152.0   B |  00m00s
[  3/154] Installing libgcc-0:14.0.1-0. 100% | 170.8 MiB/s | 174.9 KiB |  00m00s
>>> Running post-install scriptlet: libgcc-0:14.0.1-0.2.fc40.s390x
>>> Stop post-install scriptlet: libgcc-0:14.0.1-0.2.fc40.s390x
[  4/154] Installing crypto-policies-0: 100% |  35.5 MiB/s | 181.7 KiB |  00m00s
>>> Running post-install scriptlet: crypto-policies-0:20231204-1.git1e3a2e4.fc40
>>> Stop post-install scriptlet: crypto-policies-0:20231204-1.git1e3a2e4.fc40.no
[  5/154] Installing fedora-release-ide 100% |   0.0   B/s | 952.0   B |  00m00s
[  6/154] Installing fedora-gpg-keys-0: 100% |  40.9 MiB/s | 167.6 KiB |  00m00s
[  7/154] Installing fedora-repos-rawhi 100% |   0.0   B/s |   2.4 KiB |  00m00s
[  8/154] Installing fedora-repos-0:40- 100% |   0.0   B/s |   5.7 KiB |  00m00s
[  9/154] Installing fedora-release-com 100% |  22.6 MiB/s |  23.2 KiB |  00m00s
[ 10/154] Installing fedora-release-0:4 100% |   0.0   B/s | 124.0   B |  00m00s
[ 11/154] Installing setup-0:2.14.5-1.f 100% |  50.6 MiB/s | 725.8 KiB |  00m00s
>>> Running post-install scriptlet: setup-0:2.14.5-1.fc40.noarch
>>> Stop post-install scriptlet: setup-0:2.14.5-1.fc40.noarch
[ 12/154] Installing filesystem-0:3.18- 100% |   2.6 MiB/s | 212.4 KiB |  00m00s
[ 13/154] Installing basesystem-0:11-18 100% |   0.0   B/s | 124.0   B |  00m00s
[ 14/154] Installing publicsuffix-list- 100% |   0.0   B/s |  68.3 KiB |  00m00s
[ 15/154] Installing libssh-config-0:0. 100% |   0.0   B/s | 816.0   B |  00m00s
[ 16/154] Installing pcre2-syntax-0:10. 100% | 232.0 MiB/s | 237.6 KiB |  00m00s
[ 17/154] Installing coreutils-common-0 100% | 286.6 MiB/s |  11.5 MiB |  00m00s
[ 18/154] Installing ncurses-base-0:6.4 100% |  68.7 MiB/s | 351.6 KiB |  00m00s
[ 19/154] Installing glibc-minimal-lang 100% |   0.0   B/s | 124.0   B |  00m00s
[ 20/154] Installing ncurses-libs-0:6.4 100% | 177.1 MiB/s |   1.1 MiB |  00m00s
>>> Running pre-install scriptlet: glibc-0:2.38.9000-33.fc40.s390x
>>> Stop pre-install scriptlet: glibc-0:2.38.9000-33.fc40.s390x
[ 21/154] Installing glibc-0:2.38.9000- 100% | 180.6 MiB/s |   5.4 MiB |  00m00s
>>> Running post-install scriptlet: glibc-0:2.38.9000-33.fc40.s390x
>>> Stop post-install scriptlet: glibc-0:2.38.9000-33.fc40.s390x
[ 22/154] Installing bash-0:5.2.26-1.fc 100% | 278.6 MiB/s |   8.4 MiB |  00m00s
>>> Running post-install scriptlet: bash-0:5.2.26-1.fc40.s390x
>>> Stop post-install scriptlet: bash-0:5.2.26-1.fc40.s390x
[ 23/154] Installing glibc-common-0:2.3 100% | 158.3 MiB/s |   1.1 MiB |  00m00s
[ 24/154] Installing glibc-gconv-extra- 100% | 199.8 MiB/s |   7.8 MiB |  00m00s
>>> Running post-install scriptlet: glibc-gconv-extra-0:2.38.9000-33.fc40.s390x
>>> Stop post-install scriptlet: glibc-gconv-extra-0:2.38.9000-33.fc40.s390x
[ 25/154] Installing zlib-ng-compat-0:2 100% | 115.4 MiB/s | 118.2 KiB |  00m00s
[ 26/154] Installing xz-libs-0:5.4.5-1. 100% | 217.5 MiB/s | 222.7 KiB |  00m00s
[ 27/154] Installing bzip2-libs-0:1.0.8 100% |  87.5 MiB/s |  89.6 KiB |  00m00s
[ 28/154] Installing libuuid-0:2.39.3-2 100% |   0.0   B/s |  38.6 KiB |  00m00s
[ 29/154] Installing readline-0:8.2-7.f 100% | 272.9 MiB/s | 558.9 KiB |  00m00s
[ 30/154] Installing libzstd-0:1.5.5-4. 100% | 280.3 MiB/s | 861.1 KiB |  00m00s
[ 31/154] Installing elfutils-libelf-0: 100% | 249.3 MiB/s |   1.0 MiB |  00m00s
[ 32/154] Installing popt-0:1.19-3.fc39 100% |  73.9 MiB/s | 151.3 KiB |  00m00s
[ 33/154] Installing libstdc++-0:14.0.1 100% | 260.2 MiB/s |   3.1 MiB |  00m00s
[ 34/154] Installing libblkid-0:2.39.3- 100% | 251.8 MiB/s | 257.8 KiB |  00m00s
[ 35/154] Installing libattr-0:2.5.2-1. 100% |   0.0   B/s |  29.3 KiB |  00m00s
[ 36/154] Installing libacl-0:2.3.1-11. 100% |   0.0   B/s |  40.6 KiB |  00m00s
[ 37/154] Installing libxcrypt-0:4.4.36 100% | 270.9 MiB/s | 277.4 KiB |  00m00s
[ 38/154] Installing gmp-1:6.2.1-5.fc39 100% | 187.3 MiB/s | 767.4 KiB |  00m00s
[ 39/154] Installing lz4-libs-0:1.9.4-4 100% | 166.3 MiB/s | 170.3 KiB |  00m00s
[ 40/154] Installing libeconf-0:0.5.2-1 100% |  56.1 MiB/s |  57.5 KiB |  00m00s
[ 41/154] Installing gdbm-libs-1:1.23-4 100% | 132.0 MiB/s | 135.1 KiB |  00m00s
[ 42/154] Installing mpfr-0:4.2.1-1.fc4 100% | 228.0 MiB/s | 700.3 KiB |  00m00s
[ 43/154] Installing gawk-0:5.3.0-1.fc4 100% | 258.6 MiB/s |   1.8 MiB |  00m00s
[ 44/154] Installing dwz-0:0.15-3.fc39. 100% | 308.5 MiB/s | 315.9 KiB |  00m00s
[ 45/154] Installing unzip-0:6.0-62.fc3 100% | 203.9 MiB/s | 417.6 KiB |  00m00s
[ 46/154] Installing file-libs-0:5.45-1 100% | 473.6 MiB/s |   9.9 MiB |  00m00s
[ 47/154] Installing file-0:5.45-1.fc40 100% | 102.3 MiB/s | 104.8 KiB |  00m00s
[ 48/154] Installing libcap-ng-0:0.8.4- 100% |  76.7 MiB/s |  78.5 KiB |  00m00s
[ 49/154] Installing audit-libs-0:4.0-1 100% | 160.6 MiB/s | 328.9 KiB |  00m00s
[ 50/154] Installing pam-libs-0:1.5.3-9 100% | 133.5 MiB/s | 136.7 KiB |  00m00s
[ 51/154] Installing libcap-0:2.69-1.fc 100% | 115.1 MiB/s | 235.8 KiB |  00m00s
[ 52/154] Installing systemd-libs-0:255 100% | 246.5 MiB/s |   2.0 MiB |  00m00s
[ 53/154] Installing libsmartcols-0:2.3 100% | 149.6 MiB/s | 153.2 KiB |  00m00s
[ 54/154] Installing libcom_err-0:1.47. 100% |   0.0   B/s |  68.1 KiB |  00m00s
[ 55/154] Installing libsepol-0:3.6-1.f 100% | 274.5 MiB/s | 843.2 KiB |  00m00s
[ 56/154] Installing pcre2-0:10.42-2.fc 100% | 214.4 MiB/s | 658.6 KiB |  00m00s
[ 57/154] Installing libselinux-0:3.6-2 100% | 185.7 MiB/s | 190.1 KiB |  00m00s
[ 58/154] Installing sed-0:4.8-14.fc39. 100% | 199.6 MiB/s | 817.6 KiB |  00m00s
[ 59/154] Installing grep-0:3.11-5.fc40 100% | 202.9 MiB/s |   1.0 MiB |  00m00s
[ 60/154] Installing findutils-1:4.9.0- 100% | 212.7 MiB/s |   1.5 MiB |  00m00s
[ 61/154] Installing xz-0:5.4.5-1.fc40. 100% | 222.3 MiB/s |   2.0 MiB |  00m00s
[ 62/154] Installing libmount-0:2.39.3- 100% | 180.3 MiB/s | 369.3 KiB |  00m00s
[ 63/154] Installing alternatives-0:1.2 100% |  66.2 MiB/s |  67.8 KiB |  00m00s
[ 64/154] Installing jansson-0:2.13.1-7 100% |  91.3 MiB/s |  93.5 KiB |  00m00s
[ 65/154] Installing lua-libs-0:5.4.6-3 100% | 318.4 MiB/s | 326.1 KiB |  00m00s
[ 66/154] Installing libtasn1-0:4.19.0- 100% | 184.9 MiB/s | 189.3 KiB |  00m00s
[ 67/154] Installing libunistring-0:1.1 100% | 252.8 MiB/s |   1.8 MiB |  00m00s
[ 68/154] Installing libidn2-0:2.3.4-3. 100% | 107.0 MiB/s | 328.8 KiB |  00m00s
[ 69/154] Installing libpsl-0:0.21.5-1. 100% |  79.5 MiB/s |  81.4 KiB |  00m00s
[ 70/154] Installing util-linux-core-0: 100% | 197.9 MiB/s |   1.4 MiB |  00m00s
[ 71/154] Installing tar-2:1.35-2.fc40. 100% | 250.7 MiB/s |   3.0 MiB |  00m00s
[ 72/154] Installing libsemanage-0:3.6- 100% | 148.0 MiB/s | 303.1 KiB |  00m00s
[ 73/154] Installing shadow-utils-2:4.1 100% | 136.7 MiB/s |   4.1 MiB |  00m00s
>>> Running pre-install scriptlet: libutempter-0:1.2.1-10.fc39.s390x
>>> Stop pre-install scriptlet: libutempter-0:1.2.1-10.fc39.s390x
[ 74/154] Installing libutempter-0:1.2. 100% |  57.9 MiB/s |  59.3 KiB |  00m00s
[ 75/154] Installing zip-0:3.0-39.fc40. 100% | 246.8 MiB/s | 758.2 KiB |  00m00s
[ 76/154] Installing gdbm-1:1.23-4.fc39 100% | 159.1 MiB/s | 488.8 KiB |  00m00s
[ 77/154] Installing cyrus-sasl-lib-0:2 100% | 216.2 MiB/s |   2.4 MiB |  00m00s
[ 78/154] Installing zstd-0:1.5.5-4.fc3 100% | 298.4 MiB/s |   1.8 MiB |  00m00s
[ 79/154] Installing libfdisk-0:2.39.3- 100% | 191.4 MiB/s | 392.0 KiB |  00m00s
[ 80/154] Installing bzip2-0:1.0.8-16.f 100% | 101.3 MiB/s | 103.7 KiB |  00m00s
[ 81/154] Installing libxml2-0:2.12.4-1 100% | 267.8 MiB/s |   1.9 MiB |  00m00s
[ 82/154] Installing sqlite-libs-0:3.45 100% | 262.2 MiB/s |   1.6 MiB |  00m00s
[ 83/154] Installing ed-0:1.20-1.fc40.s 100% | 148.9 MiB/s | 152.5 KiB |  00m00s
[ 84/154] Installing patch-0:2.7.6-22.f 100% | 134.7 MiB/s | 275.8 KiB |  00m00s
[ 85/154] Installing elfutils-default-y 100% | 510.7 KiB/s |   2.0 KiB |  00m00s
>>> Running post-install scriptlet: elfutils-default-yama-scope-0:0.190-4.fc40.n
>>> Stop post-install scriptlet: elfutils-default-yama-scope-0:0.190-4.fc40.noar
[ 86/154] Installing cpio-0:2.14-5.fc40 100% | 209.2 MiB/s |   1.0 MiB |  00m00s
[ 87/154] Installing diffutils-0:3.10-3 100% | 227.0 MiB/s |   1.6 MiB |  00m00s
[ 88/154] Installing libpkgconf-0:1.9.5 100% |  84.9 MiB/s |  86.9 KiB |  00m00s
[ 89/154] Installing pkgconf-0:1.9.5-2. 100% |  84.1 MiB/s |  86.1 KiB |  00m00s
[ 90/154] Installing keyutils-libs-0:1. 100% |  54.3 MiB/s |  55.6 KiB |  00m00s
[ 91/154] Installing libverto-0:0.3.2-6 100% |   0.0   B/s |  31.1 KiB |  00m00s
[ 92/154] Installing libgomp-0:14.0.1-0 100% | 258.3 MiB/s | 529.0 KiB |  00m00s
[ 93/154] Installing libffi-0:3.4.4-5.f 100% |  65.0 MiB/s |  66.5 KiB |  00m00s
[ 94/154] Installing p11-kit-0:0.25.3-1 100% | 226.4 MiB/s |   2.5 MiB |  00m00s
[ 95/154] Installing p11-kit-trust-0:0. 100% |  76.3 MiB/s | 469.0 KiB |  00m00s
>>> Running post-install scriptlet: p11-kit-trust-0:0.25.3-1.fc40.s390x
>>> Stop post-install scriptlet: p11-kit-trust-0:0.25.3-1.fc40.s390x
[ 96/154] Installing openssl-libs-1:3.1 100% | 256.5 MiB/s |   5.6 MiB |  00m00s
[ 97/154] Installing coreutils-0:9.4-3. 100% | 248.6 MiB/s |   6.2 MiB |  00m00s
>>> Running pre-install scriptlet: ca-certificates-0:2023.2.62_v7.0.401-4.fc40.n
>>> Stop pre-install scriptlet: ca-certificates-0:2023.2.62_v7.0.401-4.fc40.noar
[ 98/154] Installing ca-certificates-0: 100% |   2.3 MiB/s |   2.3 MiB |  00m01s
>>> Running post-install scriptlet: ca-certificates-0:2023.2.62_v7.0.401-4.fc40.
>>> Stop post-install scriptlet: ca-certificates-0:2023.2.62_v7.0.401-4.fc40.noa
[ 99/154] Installing krb5-libs-0:1.21.2 100% | 222.9 MiB/s |   2.5 MiB |  00m00s
[100/154] Installing libtirpc-0:1.3.4-1 100% | 211.3 MiB/s | 216.3 KiB |  00m00s
[101/154] Installing gzip-0:1.12-6.fc39 100% | 190.1 MiB/s | 389.3 KiB |  00m00s
>>> Running pre-install scriptlet: authselect-libs-0:1.5.0-1.fc40.s390x
>>> Stop pre-install scriptlet: authselect-libs-0:1.5.0-1.fc40.s390x
[102/154] Installing authselect-libs-0: 100% | 196.1 MiB/s |   1.0 MiB |  00m00s
[103/154] Installing authselect-0:1.5.0 100% |  78.4 MiB/s | 160.6 KiB |  00m00s
[104/154] Installing cracklib-0:2.9.11- 100% |  85.1 MiB/s | 261.4 KiB |  00m00s
[105/154] Installing libpwquality-0:1.4 100% | 105.8 MiB/s | 433.2 KiB |  00m00s
[106/154] Installing libnsl2-0:2.0.0-6. 100% |  61.4 MiB/s |  62.8 KiB |  00m00s
[107/154] Installing pam-0:1.5.3-9.fc40 100% | 137.7 MiB/s |   1.8 MiB |  00m00s
[108/154] Installing libssh-0:0.10.6-2. 100% | 259.3 MiB/s | 531.1 KiB |  00m00s
[109/154] Installing libarchive-0:3.7.2 100% | 247.2 MiB/s |   1.0 MiB |  00m00s
[110/154] Installing rpm-sequoia-0:1.5. 100% | 301.1 MiB/s |   3.0 MiB |  00m00s
[111/154] Installing rpm-libs-0:4.19.1- 100% | 264.0 MiB/s | 811.1 KiB |  00m00s
[112/154] Installing libevent-0:2.1.12- 100% | 306.8 MiB/s | 942.5 KiB |  00m00s
[113/154] Installing openldap-0:2.6.6-1 100% | 219.0 MiB/s | 672.8 KiB |  00m00s
[114/154] Installing xxhash-libs-0:0.8. 100% |  67.8 MiB/s |  69.4 KiB |  00m00s
[115/154] Installing libbrotli-0:1.1.0- 100% | 224.5 MiB/s | 919.4 KiB |  00m00s
[116/154] Installing libnghttp2-0:1.59. 100% | 171.0 MiB/s | 175.1 KiB |  00m00s
[117/154] Installing libcurl-0:8.5.0-1. 100% | 199.6 MiB/s | 817.6 KiB |  00m00s
[118/154] Installing elfutils-debuginfo 100% |  64.9 MiB/s |  66.4 KiB |  00m00s
[119/154] Installing elfutils-libs-0:0. 100% | 239.6 MiB/s | 735.9 KiB |  00m00s
[120/154] Installing binutils-gold-0:2. 100% | 178.4 MiB/s |   2.9 MiB |  00m00s
>>> Running post-install scriptlet: binutils-gold-0:2.41-30.fc40.s390x
>>> Stop post-install scriptlet: binutils-gold-0:2.41-30.fc40.s390x
[121/154] Installing binutils-0:2.41-30 100% | 298.2 MiB/s |  25.9 MiB |  00m00s
>>> Running post-install scriptlet: binutils-0:2.41-30.fc40.s390x
>>> Stop post-install scriptlet: binutils-0:2.41-30.fc40.s390x
[122/154] Installing elfutils-0:0.190-4 100% | 325.7 MiB/s |   2.9 MiB |  00m00s
[123/154] Installing gdb-minimal-0:14.1 100% | 291.3 MiB/s |  12.5 MiB |  00m00s
[124/154] Installing debugedit-0:5.0-12 100% | 200.4 MiB/s | 205.2 KiB |  00m00s
[125/154] Installing rpm-build-libs-0:4 100% | 202.2 MiB/s | 207.0 KiB |  00m00s
[126/154] Installing curl-0:8.5.0-1.fc4 100% |  80.9 MiB/s | 828.5 KiB |  00m00s
>>> Running pre-install scriptlet: rpm-0:4.19.1-2.fc40.s390x
>>> Stop pre-install scriptlet: rpm-0:4.19.1-2.fc40.s390x
[127/154] Installing rpm-0:4.19.1-2.fc4 100% | 149.9 MiB/s |   2.4 MiB |  00m00s
[128/154] Installing efi-srpm-macros-0: 100% |   0.0   B/s |  41.2 KiB |  00m00s
[129/154] Installing lua-srpm-macros-0: 100% |   0.0   B/s |   1.9 KiB |  00m00s
[130/154] Installing zig-srpm-macros-0: 100% |   0.0   B/s |   1.7 KiB |  00m00s
[131/154] Installing pkgconf-m4-0:1.9.5 100% |   0.0   B/s |  14.3 KiB |  00m00s
[132/154] Installing pkgconf-pkg-config 100% |   0.0   B/s |   1.8 KiB |  00m00s
[133/154] Installing rust-srpm-macros-0 100% |   0.0   B/s |   5.8 KiB |  00m00s
[134/154] Installing qt6-srpm-macros-0: 100% |   0.0   B/s | 732.0   B |  00m00s
[135/154] Installing qt5-srpm-macros-0: 100% |   0.0   B/s | 768.0   B |  00m00s
[136/154] Installing perl-srpm-macros-0 100% |   0.0   B/s |   1.1 KiB |  00m00s
[137/154] Installing package-notes-srpm 100% |   0.0   B/s |   2.0 KiB |  00m00s
[138/154] Installing openblas-srpm-macr 100% |   0.0   B/s | 384.0   B |  00m00s
[139/154] Installing ocaml-srpm-macros- 100% |   0.0   B/s |   2.2 KiB |  00m00s
[140/154] Installing kernel-srpm-macros 100% |   0.0   B/s |   2.3 KiB |  00m00s
[141/154] Installing gnat-srpm-macros-0 100% |   0.0   B/s |   1.3 KiB |  00m00s
[142/154] Installing ghc-srpm-macros-0: 100% |   0.0   B/s | 648.0   B |  00m00s
[143/154] Installing fpc-srpm-macros-0: 100% |   0.0   B/s | 420.0   B |  00m00s
[144/154] Installing ansible-srpm-macro 100% |   0.0   B/s |  36.2 KiB |  00m00s
[145/154] Installing fonts-srpm-macros- 100% |  55.1 MiB/s |  56.5 KiB |  00m00s
[146/154] Installing forge-srpm-macros- 100% |   0.0   B/s |  38.6 KiB |  00m00s
[147/154] Installing go-srpm-macros-0:3 100% |   0.0   B/s |  61.6 KiB |  00m00s
[148/154] Installing python-srpm-macros 100% |  50.1 MiB/s |  51.3 KiB |  00m00s
[149/154] Installing redhat-rpm-config- 100% |  92.6 MiB/s | 189.6 KiB |  00m00s
[150/154] Installing rpm-build-0:4.19.1 100% |  91.9 MiB/s | 188.3 KiB |  00m00s
[151/154] Installing pyproject-srpm-mac 100% |   2.0 MiB/s |   2.1 KiB |  00m00s
[152/154] Installing util-linux-0:2.39. 100% | 178.0 MiB/s |   3.6 MiB |  00m00s
[153/154] Installing which-0:2.21-40.fc 100% |  84.1 MiB/s |  86.1 KiB |  00m00s
[154/154] Installing info-0:7.1-1.fc40. 100% | 327.0 KiB/s | 405.5 KiB |  00m01s
>>> Running post-transaction scriptlet: filesystem-0:3.18-6.fc39.s390x
>>> Stop post-transaction scriptlet: filesystem-0:3.18-6.fc39.s390x
>>> Running post-transaction scriptlet: ca-certificates-0:2023.2.62_v7.0.401-4.f
>>> Stop post-transaction scriptlet: ca-certificates-0:2023.2.62_v7.0.401-4.fc40
>>> Running post-transaction scriptlet: authselect-libs-0:1.5.0-1.fc40.s390x
>>> Stop post-transaction scriptlet: authselect-libs-0:1.5.0-1.fc40.s390x
>>> Running post-transaction scriptlet: rpm-0:4.19.1-2.fc40.s390x
>>> Stop post-transaction scriptlet: rpm-0:4.19.1-2.fc40.s390x
>>> Running trigger-install scriptlet: glibc-common-0:2.38.9000-33.fc40.s390x
>>> Stop trigger-install scriptlet: glibc-common-0:2.38.9000-33.fc40.s390x
>>> Running trigger-install scriptlet: info-0:7.1-1.fc40.s390x
>>> Stop trigger-install scriptlet: info-0:7.1-1.fc40.s390x
Warning: skipped PGP checks for 152 package(s).
Finish: installing minimal buildroot with dnf5
Start: creating root cache
Finish: creating root cache
Finish: chroot init
INFO: Installed packages:
INFO: alternatives-1.26-1.fc40.s390x
ansible-srpm-macros-1-12.fc40.noarch
audit-libs-4.0-1.fc40.s390x
authselect-1.5.0-1.fc40.s390x
authselect-libs-1.5.0-1.fc40.s390x
basesystem-11-18.fc39.noarch
bash-5.2.26-1.fc40.s390x
binutils-2.41-30.fc40.s390x
binutils-gold-2.41-30.fc40.s390x
bzip2-1.0.8-16.fc39.s390x
bzip2-libs-1.0.8-16.fc39.s390x
ca-certificates-2023.2.62_v7.0.401-4.fc40.noarch
coreutils-9.4-3.fc40.s390x
coreutils-common-9.4-3.fc40.s390x
cpio-2.14-5.fc40.s390x
cracklib-2.9.11-2.fc39.s390x
crypto-policies-20231204-1.git1e3a2e4.fc40.noarch
curl-8.5.0-1.fc40.s390x
cyrus-sasl-lib-2.1.28-17.fc40.s390x
debugedit-5.0-12.fc40.s390x
diffutils-3.10-3.fc39.s390x
dwz-0.15-3.fc39.s390x
ed-1.20-1.fc40.s390x
efi-srpm-macros-5-9.fc39.noarch
elfutils-0.190-4.fc40.s390x
elfutils-debuginfod-client-0.190-4.fc40.s390x
elfutils-default-yama-scope-0.190-4.fc40.noarch
elfutils-libelf-0.190-4.fc40.s390x
elfutils-libs-0.190-4.fc40.s390x
fedora-gpg-keys-40-0.2.noarch
fedora-release-40-0.29.noarch
fedora-release-common-40-0.29.noarch
fedora-release-identity-basic-40-0.29.noarch
fedora-repos-40-0.2.noarch
fedora-repos-rawhide-40-0.2.noarch
file-5.45-1.fc40.s390x
file-libs-5.45-1.fc40.s390x
filesystem-3.18-6.fc39.s390x
findutils-4.9.0-6.fc40.s390x
fonts-srpm-macros-2.0.5-12.fc39.noarch
forge-srpm-macros-0.2.0-1.fc40.noarch
fpc-srpm-macros-1.3-8.fc39.noarch
gawk-5.3.0-1.fc40.s390x
gdb-minimal-14.1-4.fc40.s390x
gdbm-1.23-4.fc39.s390x
gdbm-libs-1.23-4.fc39.s390x
ghc-srpm-macros-1.6.1-3.fc40.noarch
glibc-2.38.9000-33.fc40.s390x
glibc-common-2.38.9000-33.fc40.s390x
glibc-gconv-extra-2.38.9000-33.fc40.s390x
glibc-minimal-langpack-2.38.9000-33.fc40.s390x
gmp-6.2.1-5.fc39.s390x
gnat-srpm-macros-6-3.fc39.noarch
go-srpm-macros-3.3.1-1.fc40.noarch
grep-3.11-5.fc40.s390x
gzip-1.12-6.fc39.s390x
info-7.1-1.fc40.s390x
jansson-2.13.1-7.fc39.s390x
kernel-srpm-macros-1.0-20.fc39.noarch
keyutils-libs-1.6.3-1.fc40.s390x
krb5-libs-1.21.2-3.fc40.s390x
libacl-2.3.1-11.fc40.s390x
libarchive-3.7.2-1.fc40.s390x
libattr-2.5.2-1.fc40.s390x
libblkid-2.39.3-2.fc40.s390x
libbrotli-1.1.0-1.fc40.s390x
libcap-2.69-1.fc40.s390x
libcap-ng-0.8.4-2.fc40.s390x
libcom_err-1.47.0-2.fc39.s390x
libcurl-8.5.0-1.fc40.s390x
libeconf-0.5.2-1.fc40.s390x
libevent-2.1.12-9.fc39.s390x
libfdisk-2.39.3-2.fc40.s390x
libffi-3.4.4-5.fc40.s390x
libgcc-14.0.1-0.2.fc40.s390x
libgomp-14.0.1-0.2.fc40.s390x
libidn2-2.3.4-3.fc39.s390x
libmount-2.39.3-2.fc40.s390x
libnghttp2-1.59.0-1.fc40.s390x
libnsl2-2.0.0-6.fc39.s390x
libpkgconf-1.9.5-2.fc39.s390x
libpsl-0.21.5-1.fc40.s390x
libpwquality-1.4.5-6.fc39.s390x
libselinux-3.6-2.fc40.s390x
libsemanage-3.6-1.fc40.s390x
libsepol-3.6-1.fc40.s390x
libsmartcols-2.39.3-2.fc40.s390x
libssh-0.10.6-2.fc40.s390x
libssh-config-0.10.6-2.fc40.noarch
libstdc++-14.0.1-0.2.fc40.s390x
libtasn1-4.19.0-3.fc39.s390x
libtirpc-1.3.4-1.rc1.fc40.s390x
libunistring-1.1-5.fc40.s390x
libutempter-1.2.1-10.fc39.s390x
libuuid-2.39.3-2.fc40.s390x
libverto-0.3.2-6.fc39.s390x
libxcrypt-4.4.36-4.fc40.s390x
libxml2-2.12.4-1.fc40.s390x
libzstd-1.5.5-4.fc39.s390x
lua-libs-5.4.6-3.fc39.s390x
lua-srpm-macros-1-9.fc39.noarch
lz4-libs-1.9.4-4.fc39.s390x
mpfr-4.2.1-1.fc40.s390x
ncurses-base-6.4-9.20240113.fc40.noarch
ncurses-libs-6.4-9.20240113.fc40.s390x
ocaml-srpm-macros-9-1.fc40.noarch
openblas-srpm-macros-2-14.fc39.noarch
openldap-2.6.6-1.fc39.s390x
openssl-libs-3.1.4-1.fc40.s390x
p11-kit-0.25.3-1.fc40.s390x
p11-kit-trust-0.25.3-1.fc40.s390x
package-notes-srpm-macros-0.5-9.fc39.noarch
pam-1.5.3-9.fc40.s390x
pam-libs-1.5.3-9.fc40.s390x
patch-2.7.6-22.fc39.s390x
pcre2-10.42-2.fc40.s390x
pcre2-syntax-10.42-2.fc40.noarch
perl-srpm-macros-1-51.fc39.noarch
pkgconf-1.9.5-2.fc39.s390x
pkgconf-m4-1.9.5-2.fc39.noarch
pkgconf-pkg-config-1.9.5-2.fc39.s390x
popt-1.19-3.fc39.s390x
publicsuffix-list-dafsa-20240107-1.fc40.noarch
pyproject-srpm-macros-1.11.0-1.fc40.noarch
python-srpm-macros-3.12-5.fc40.noarch
qt5-srpm-macros-5.15.12-1.fc40.noarch
qt6-srpm-macros-6.6.1-3.fc40.noarch
readline-8.2-7.fc40.s390x
redhat-rpm-config-280-1.fc40.noarch
rpm-4.19.1-2.fc40.s390x
rpm-build-4.19.1-2.fc40.s390x
rpm-build-libs-4.19.1-2.fc40.s390x
rpm-libs-4.19.1-2.fc40.s390x
rpm-sequoia-1.5.0-2.fc40.s390x
rust-srpm-macros-25.2-2.fc40.noarch
sed-4.8-14.fc39.s390x
setup-2.14.5-1.fc40.noarch
shadow-utils-4.14.0-2.fc40.s390x
sqlite-libs-3.45.0-1.fc40.s390x
systemd-libs-255.2-2.fc40.s390x
tar-1.35-2.fc40.s390x
unzip-6.0-62.fc39.s390x
util-linux-2.39.3-2.fc40.s390x
util-linux-core-2.39.3-2.fc40.s390x
which-2.21-40.fc39.s390x
xxhash-libs-0.8.2-1.fc39.s390x
xz-5.4.5-1.fc40.s390x
xz-libs-5.4.5-1.fc40.s390x
zig-srpm-macros-1-1.fc40.noarch
zip-3.0-39.fc40.s390x
zlib-ng-compat-2.1.6-1.fc40.s390x
zstd-1.5.5-4.fc39.s390x
Start: buildsrpm
Start: rpmbuild -bs
Building target platforms: s390x
Building for target s390x
setting SOURCE_DATE_EPOCH=1705881600
Wrote: /builddir/build/SRPMS/APLpy-2.0.3-25.fc40.src.rpm
Finish: rpmbuild -bs
INFO: chroot_scan: 1 files copied to /var/lib/copr-rpmbuild/results/chroot_scan
INFO: /var/lib/mock/fedora-rawhide-s390x-1705966360.259598/root/var/log/dnf5.log
Finish: buildsrpm
INFO: Done(/var/lib/copr-rpmbuild/workspace/workdir-j7evlf0c/APLpy/APLpy.spec) Config(child) 1 minutes 41 seconds
INFO: Results and/or logs in: /var/lib/copr-rpmbuild/results
INFO: Cleaning up build root ('cleanup_on_success=True')
Start: clean chroot
INFO: unmounting tmpfs.
Finish: clean chroot
INFO: Start(/var/lib/copr-rpmbuild/results/APLpy-2.0.3-25.fc40.src.rpm)  Config(fedora-rawhide-s390x)
Start(bootstrap): chroot init
INFO: mounting tmpfs at /var/lib/mock/fedora-rawhide-s390x-bootstrap-1705966360.259598/root.
INFO: reusing tmpfs at /var/lib/mock/fedora-rawhide-s390x-bootstrap-1705966360.259598/root.
INFO: calling preinit hooks
INFO: enabled root cache
INFO: enabled package manager cache
Start(bootstrap): cleaning package manager metadata
Finish(bootstrap): cleaning package manager metadata
Finish(bootstrap): chroot init
Start: chroot init
INFO: mounting tmpfs at /var/lib/mock/fedora-rawhide-s390x-1705966360.259598/root.
INFO: calling preinit hooks
INFO: enabled root cache
Start: unpacking root cache
Finish: unpacking root cache
INFO: enabled package manager cache
Start: cleaning package manager metadata
Finish: cleaning package manager metadata
INFO: enabled HW Info plugin
INFO: Buildroot is handled by package management downloaded with a bootstrap image:
  rpm-4.19.1-2.fc40.s390x
  rpm-sequoia-1.5.0-2.fc40.s390x
  python3-dnf-4.18.2-1.fc40.noarch
  yum-4.18.2-1.fc40.noarch
  dnf5-5.1.11-1.fc40.s390x
  dnf5-plugins-5.1.11-1.fc40.s390x
Finish: chroot init
Start: build phase for APLpy-2.0.3-25.fc40.src.rpm
Start: build setup for APLpy-2.0.3-25.fc40.src.rpm
Building target platforms: s390x
Building for target s390x
setting SOURCE_DATE_EPOCH=1705881600
Wrote: /builddir/build/SRPMS/APLpy-2.0.3-25.fc40.src.rpm
Updating and loading repositories:
 Additional repo http_kojipkgs_fedorapr 100% | 117.8 KiB/s |   4.1 KiB |  00m00s
 fedora                                 100% | 128.3 KiB/s |   4.5 KiB |  00m00s
 Copr repository                        100% |  74.3 KiB/s |   2.2 KiB |  00m00s
Repositories loaded.
Package                        Arch   Version                   Repository                                                         Size
Installing:                                                                                                                            
 python3-astropy               s390x  5.3.2-2.fc40              http_kojipkgs_fedoraproject_org_repos_rawhide_latest_basearch  47.3 MiB
 python3-devel                 s390x  3.12.1-2.fc40             http_kojipkgs_fedoraproject_org_repos_rawhide_latest_basearch   1.2 MiB
 python3-matplotlib            s390x  3.8.1-1.fc40              http_kojipkgs_fedoraproject_org_repos_rawhide_latest_basearch  20.2 MiB
 python3-numpy                 s390x  1:1.26.2-2.fc40           http_kojipkgs_fedoraproject_org_repos_rawhide_latest_basearch  42.0 MiB
 python3-pillow                s390x  10.2.0-1.fc40             http_kojipkgs_fedoraproject_org_repos_rawhide_latest_basearch   3.3 MiB
 python3-pytest                noarch 7.4.3-1.fc40              http_kojipkgs_fedoraproject_org_repos_rawhide_latest_basearch  15.0 MiB
 python3-pytest-astropy-header noarch 0.2.2-1.fc40              http_kojipkgs_fedoraproject_org_repos_rawhide_latest_basearch  31.6 KiB
 python3-reproject             s390x  0.13.0-2.fc40             http_kojipkgs_fedoraproject_org_repos_rawhide_latest_basearch   3.1 MiB
 python3-setuptools            noarch 68.2.2-1.fc40             http_kojipkgs_fedoraproject_org_repos_rawhide_latest_basearch   7.1 MiB
Installing dependencies:                                                                                                               
 abattis-cantarell-vf-fonts    noarch 0.301-10.fc39             http_kojipkgs_fedoraproject_org_repos_rawhide_latest_basearch 192.3 KiB
 blosc                         s390x  1.21.5-2.fc40             http_kojipkgs_fedoraproject_org_repos_rawhide_latest_basearch 105.6 KiB
 cairo                         s390x  1.18.0-1.fc40             http_kojipkgs_fedoraproject_org_repos_rawhide_latest_basearch   1.8 MiB
 default-fonts-core-sans       noarch 4.0-9.fc40                http_kojipkgs_fedoraproject_org_repos_rawhide_latest_basearch  11.9 KiB
 dejavu-sans-fonts             noarch 2.37-21.fc40              http_kojipkgs_fedoraproject_org_repos_rawhide_latest_basearch   5.5 MiB
 erfa                          s390x  2.0.1-1.fc40              http_kojipkgs_fedoraproject_org_repos_rawhide_latest_basearch 407.7 KiB
 expat                         s390x  2.5.0-3.fc39              http_kojipkgs_fedoraproject_org_repos_rawhide_latest_basearch 302.4 KiB
 flexiblas                     s390x  3.4.1-1.fc40              http_kojipkgs_fedoraproject_org_repos_rawhide_latest_basearch  46.7 KiB
 flexiblas-netlib              s390x  3.4.1-1.fc40              http_kojipkgs_fedoraproject_org_repos_rawhide_latest_basearch  11.7 MiB
 flexiblas-openblas-openmp     s390x  3.4.1-1.fc40              http_kojipkgs_fedoraproject_org_repos_rawhide_latest_basearch  39.2 KiB
 fontconfig                    s390x  2.15.0-1.fc40             http_kojipkgs_fedoraproject_org_repos_rawhide_latest_basearch 796.9 KiB
 fonts-filesystem              noarch 1:2.0.5-12.fc39           http_kojipkgs_fedoraproject_org_repos_rawhide_latest_basearch   0.0   B
 freetype                      s390x  2.13.2-1.fc40             http_kojipkgs_fedoraproject_org_repos_rawhide_latest_basearch 927.0 KiB
 fribidi                       s390x  1.0.13-2.fc39             http_kojipkgs_fedoraproject_org_repos_rawhide_latest_basearch 372.8 KiB
 glib2                         s390x  2.79.0-6.fc40             http_kojipkgs_fedoraproject_org_repos_rawhide_latest_basearch  14.7 MiB
 gnutls                        s390x  3.8.2-2.fc40              http_kojipkgs_fedoraproject_org_repos_rawhide_latest_basearch   3.1 MiB
 google-noto-fonts-common      noarch 20230801-4.fc40           http_kojipkgs_fedoraproject_org_repos_rawhide_latest_basearch  17.4 KiB
 google-noto-sans-vf-fonts     noarch 20230801-4.fc40           http_kojipkgs_fedoraproject_org_repos_rawhide_latest_basearch   1.2 MiB
 graphite2                     s390x  1.3.14-14.fc40            copr_base                                                     207.4 KiB
 harfbuzz                      s390x  8.3.0-2.fc40              http_kojipkgs_fedoraproject_org_repos_rawhide_latest_basearch   2.6 MiB
 jbigkit-libs                  s390x  2.1-27.fc40               http_kojipkgs_fedoraproject_org_repos_rawhide_latest_basearch 121.2 KiB
 lcms2                         s390x  2.16-2.fc40               http_kojipkgs_fedoraproject_org_repos_rawhide_latest_basearch 456.7 KiB
 libX11                        s390x  1.8.7-1.fc40              http_kojipkgs_fedoraproject_org_repos_rawhide_latest_basearch   1.4 MiB
 libX11-common                 noarch 1.8.7-1.fc40              http_kojipkgs_fedoraproject_org_repos_rawhide_latest_basearch   1.1 MiB
 libXau                        s390x  1.0.11-4.fc40             http_kojipkgs_fedoraproject_org_repos_rawhide_latest_basearch  66.6 KiB
 libXext                       s390x  1.3.5-5.fc40              http_kojipkgs_fedoraproject_org_repos_rawhide_latest_basearch  97.7 KiB
 libXft                        s390x  2.3.8-4.fc40              http_kojipkgs_fedoraproject_org_repos_rawhide_latest_basearch 172.3 KiB
 libXrender                    s390x  0.9.11-4.fc40             http_kojipkgs_fedoraproject_org_repos_rawhide_latest_basearch  53.9 KiB
 libb2                         s390x  0.98.1-9.fc39             http_kojipkgs_fedoraproject_org_repos_rawhide_latest_basearch  41.9 KiB
 libgfortran                   s390x  14.0.1-0.2.fc40           http_kojipkgs_fedoraproject_org_repos_rawhide_latest_basearch   2.2 MiB
 libimagequant                 s390x  4.0.3-2.fc40              http_kojipkgs_fedoraproject_org_repos_rawhide_latest_basearch 869.7 KiB
 libjpeg-turbo                 s390x  2.1.4-3.fc39              http_kojipkgs_fedoraproject_org_repos_rawhide_latest_basearch 507.4 KiB
 liblerc                       s390x  4.0.0-4.fc39              http_kojipkgs_fedoraproject_org_repos_rawhide_latest_basearch 269.2 KiB
 libpng                        s390x  2:1.6.40-1.fc40           http_kojipkgs_fedoraproject_org_repos_rawhide_latest_basearch 253.6 KiB
 libqhull_r                    s390x  1:8.0.2-2.fc40            http_kojipkgs_fedoraproject_org_repos_rawhide_latest_basearch 487.2 KiB
 libraqm                       s390x  0.8.0-5.fc39              http_kojipkgs_fedoraproject_org_repos_rawhide_latest_basearch  28.4 KiB
 libtiff                       s390x  4.5.0-3.fc40              http_kojipkgs_fedoraproject_org_repos_rawhide_latest_basearch   1.2 MiB
 libwebp                       s390x  1.3.2-2.fc40              http_kojipkgs_fedoraproject_org_repos_rawhide_latest_basearch 649.5 KiB
 libxcb                        s390x  1.16-2.fc40               http_kojipkgs_fedoraproject_org_repos_rawhide_latest_basearch   1.2 MiB
 libxslt                       s390x  1.1.39-1.fc40             http_kojipkgs_fedoraproject_org_repos_rawhide_latest_basearch 493.1 KiB
 libyaml                       s390x  0.2.5-12.fc39             http_kojipkgs_fedoraproject_org_repos_rawhide_latest_basearch 131.0 KiB
 mpdecimal                     s390x  2.5.1-7.fc39              http_kojipkgs_fedoraproject_org_repos_rawhide_latest_basearch 228.7 KiB
 nettle                        s390x  3.9.1-2.fc39              http_kojipkgs_fedoraproject_org_repos_rawhide_latest_basearch 846.2 KiB
 openblas                      s390x  0.3.26-1.fc40             http_kojipkgs_fedoraproject_org_repos_rawhide_latest_basearch  96.0 KiB
 openblas-openmp               s390x  0.3.26-1.fc40             http_kojipkgs_fedoraproject_org_repos_rawhide_latest_basearch  15.2 MiB
 openjpeg2                     s390x  2.5.0-5.fc40              http_kojipkgs_fedoraproject_org_repos_rawhide_latest_basearch 441.0 KiB
 pixman                        s390x  0.43.0-1.fc40             http_kojipkgs_fedoraproject_org_repos_rawhide_latest_basearch 544.4 KiB
 pyproject-rpm-macros          noarch 1.11.0-1.fc40             http_kojipkgs_fedoraproject_org_repos_rawhide_latest_basearch  98.5 KiB
 python-pip-wheel              noarch 23.3.1-3.fc40             http_kojipkgs_fedoraproject_org_repos_rawhide_latest_basearch   1.5 MiB
 python-rpm-macros             noarch 3.12-5.fc40               http_kojipkgs_fedoraproject_org_repos_rawhide_latest_basearch  22.1 KiB
 python3                       s390x  3.12.1-2.fc40             http_kojipkgs_fedoraproject_org_repos_rawhide_latest_basearch  31.6 KiB
 python3-appdirs               noarch 1.4.4-11.fc39             http_kojipkgs_fedoraproject_org_repos_rawhide_latest_basearch  68.9 KiB
 python3-asciitree             noarch 0.3.3-26.fc39             http_kojipkgs_fedoraproject_org_repos_rawhide_latest_basearch  20.3 KiB
 python3-astropy-healpix       s390x  1.0.2-2.fc40              copr_base                                                     432.1 KiB
 python3-brotli                s390x  1.1.0-1.fc40              http_kojipkgs_fedoraproject_org_repos_rawhide_latest_basearch 916.0 KiB
 python3-cairo                 s390x  1.25.1-1.fc40             http_kojipkgs_fedoraproject_org_repos_rawhide_latest_basearch 520.2 KiB
 python3-charset-normalizer    noarch 3.3.2-1.fc40              http_kojipkgs_fedoraproject_org_repos_rawhide_latest_basearch 312.7 KiB
 python3-click                 noarch 8.1.7-1.fc40              http_kojipkgs_fedoraproject_org_repos_rawhide_latest_basearch   1.1 MiB
 python3-cloudpickle           noarch 3.0.0-3.fc40              http_kojipkgs_fedoraproject_org_repos_rawhide_latest_basearch 124.1 KiB
 python3-configobj             noarch 5.0.8-6.fc40              http_kojipkgs_fedoraproject_org_repos_rawhide_latest_basearch 408.5 KiB
 python3-contourpy             s390x  1.2.0-1.fc40              http_kojipkgs_fedoraproject_org_repos_rawhide_latest_basearch 772.7 KiB
 python3-cycler                noarch 0.11.0-9.fc39             http_kojipkgs_fedoraproject_org_repos_rawhide_latest_basearch  38.1 KiB
 python3-dask                  noarch 2024.1.0-2.fc40~bootstrap http_kojipkgs_fedoraproject_org_repos_rawhide_latest_basearch  16.8 MiB
 python3-dask+array            s390x  2024.1.0-2.fc40~bootstrap http_kojipkgs_fedoraproject_org_repos_rawhide_latest_basearch   6.9 KiB
 python3-dateutil              noarch 1:2.8.2-11.fc40           http_kojipkgs_fedoraproject_org_repos_rawhide_latest_basearch 877.8 KiB
 python3-fasteners             noarch 0.19-2.fc40               http_kojipkgs_fedoraproject_org_repos_rawhide_latest_basearch 116.3 KiB
 python3-fonttools             s390x  4.47.2-3.fc40             copr_base                                                      18.0 MiB
 python3-fs                    noarch 2.4.16-5.fc39             http_kojipkgs_fedoraproject_org_repos_rawhide_latest_basearch   1.3 MiB
 python3-fsspec                noarch 2023.12.2-1.fc40          http_kojipkgs_fedoraproject_org_repos_rawhide_latest_basearch   1.6 MiB
 python3-idna                  noarch 3.6-1.fc40                http_kojipkgs_fedoraproject_org_repos_rawhide_latest_basearch 502.3 KiB
 python3-importlib-metadata    noarch 6.9.0-1.fc40              http_kojipkgs_fedoraproject_org_repos_rawhide_latest_basearch 197.3 KiB
 python3-iniconfig             noarch 1.1.1-14.fc39             http_kojipkgs_fedoraproject_org_repos_rawhide_latest_basearch  20.5 KiB
 python3-kiwisolver            s390x  1.4.5-1.fc40              http_kojipkgs_fedoraproject_org_repos_rawhide_latest_basearch 165.2 KiB
 python3-libs                  s390x  3.12.1-2.fc40             http_kojipkgs_fedoraproject_org_repos_rawhide_latest_basearch  41.8 MiB
 python3-locket                noarch 1.0.0-6.fc39              http_kojipkgs_fedoraproject_org_repos_rawhide_latest_basearch  20.6 KiB
 python3-lxml                  s390x  4.9.4-1.fc40              http_kojipkgs_fedoraproject_org_repos_rawhide_latest_basearch   5.5 MiB
 python3-matplotlib-data       noarch 3.8.1-1.fc40              http_kojipkgs_fedoraproject_org_repos_rawhide_latest_basearch 740.9 KiB
 python3-matplotlib-data-fonts noarch 3.8.1-1.fc40              http_kojipkgs_fedoraproject_org_repos_rawhide_latest_basearch   7.9 MiB
 python3-matplotlib-tk         s390x  3.8.1-1.fc40              http_kojipkgs_fedoraproject_org_repos_rawhide_latest_basearch 119.3 KiB
 python3-numcodecs             s390x  0.12.1-1.fc40             http_kojipkgs_fedoraproject_org_repos_rawhide_latest_basearch   1.6 MiB
 python3-numpy-f2py            s390x  1:1.26.2-2.fc40           http_kojipkgs_fedoraproject_org_repos_rawhide_latest_basearch   2.6 MiB
 python3-olefile               noarch 0.47-1.fc40               http_kojipkgs_fedoraproject_org_repos_rawhide_latest_basearch 343.2 KiB
 python3-packaging             noarch 23.2-2.fc40               http_kojipkgs_fedoraproject_org_repos_rawhide_latest_basearch 421.1 KiB
 python3-partd                 noarch 1.4.1-1.fc40              http_kojipkgs_fedoraproject_org_repos_rawhide_latest_basearch 162.2 KiB
 python3-pillow-tk             s390x  10.2.0-1.fc40             http_kojipkgs_fedoraproject_org_repos_rawhide_latest_basearch  54.2 KiB
 python3-pluggy                noarch 1.3.0-1.fc40              http_kojipkgs_fedoraproject_org_repos_rawhide_latest_basearch 184.0 KiB
 python3-ply                   noarch 3.11-20.fc39              http_kojipkgs_fedoraproject_org_repos_rawhide_latest_basearch 561.0 KiB
 python3-pooch                 noarch 1.5.2-12.fc39             http_kojipkgs_fedoraproject_org_repos_rawhide_latest_basearch 547.8 KiB
 python3-pyerfa                s390x  2.0.1.1-1.fc40            http_kojipkgs_fedoraproject_org_repos_rawhide_latest_basearch   2.4 MiB
 python3-pyparsing             noarch 3.1.1-1.fc40              http_kojipkgs_fedoraproject_org_repos_rawhide_latest_basearch   1.0 MiB
 python3-pyyaml                s390x  6.0.1-11.fc39             http_kojipkgs_fedoraproject_org_repos_rawhide_latest_basearch 786.9 KiB
 python3-requests              noarch 2.31.0-1.fc40             http_kojipkgs_fedoraproject_org_repos_rawhide_latest_basearch 462.4 KiB
 python3-rpm-generators        noarch 14-8.fc40                 http_kojipkgs_fedoraproject_org_repos_rawhide_latest_basearch  82.3 KiB
 python3-rpm-macros            noarch 3.12-5.fc40               http_kojipkgs_fedoraproject_org_repos_rawhide_latest_basearch   6.4 KiB
 python3-scipy                 s390x  1.11.3-3.fc40             http_kojipkgs_fedoraproject_org_repos_rawhide_latest_basearch  64.0 MiB
 python3-six                   noarch 1.16.0-12.fc39            http_kojipkgs_fedoraproject_org_repos_rawhide_latest_basearch 117.7 KiB
 python3-tkinter               s390x  3.12.1-2.fc40             http_kojipkgs_fedoraproject_org_repos_rawhide_latest_basearch   2.2 MiB
 python3-toolz                 noarch 0.12.0-4.fc39             http_kojipkgs_fedoraproject_org_repos_rawhide_latest_basearch 607.4 KiB
 python3-urllib3               noarch 1.26.18-1.fc40            http_kojipkgs_fedoraproject_org_repos_rawhide_latest_basearch 996.2 KiB
 python3-zarr                  noarch 2.16.1-1.fc40             http_kojipkgs_fedoraproject_org_repos_rawhide_latest_basearch   3.2 MiB
 python3-zipp                  noarch 3.17.0-1.fc40             http_kojipkgs_fedoraproject_org_repos_rawhide_latest_basearch  40.8 KiB
 snappy                        s390x  1.1.10-2.fc39             http_kojipkgs_fedoraproject_org_repos_rawhide_latest_basearch  71.0 KiB
 tcl                           s390x  1:8.6.13-1.fc40           http_kojipkgs_fedoraproject_org_repos_rawhide_latest_basearch   4.4 MiB
 tk                            s390x  1:8.6.13-2.fc40           http_kojipkgs_fedoraproject_org_repos_rawhide_latest_basearch   3.8 MiB
 tzdata                        noarch 2023d-2.fc40              http_kojipkgs_fedoraproject_org_repos_rawhide_latest_basearch   1.6 MiB
 wcslib                        s390x  7.12-3.fc39               http_kojipkgs_fedoraproject_org_repos_rawhide_latest_basearch   1.5 MiB
 xml-common                    noarch 0.6.3-62.fc40             http_kojipkgs_fedoraproject_org_repos_rawhide_latest_basearch  78.4 KiB

Transaction Summary:
 Installing:      116 packages

Total size of inbound packages is 94 MiB. Need to download 94 MiB.
After this operation 407 MiB will be used (install 407 MiB, remove 0 B).
[  1/116] python3-devel-0:3.12.1-2.fc40 100% |   7.9 MiB/s | 273.9 KiB |  00m00s
[  2/116] python3-matplotlib-0:3.8.1-1. 100% |  55.1 MiB/s |   4.2 MiB |  00m00s
[  3/116] python3-numpy-1:1.26.2-2.fc40 100% | 122.5 MiB/s |   6.9 MiB |  00m00s
[  4/116] python3-pillow-0:10.2.0-1.fc4 100% |  64.5 MiB/s | 924.0 KiB |  00m00s
[  5/116] python3-pytest-astropy-header 100% |   3.4 MiB/s |  21.1 KiB |  00m00s
[  6/116] python3-pytest-0:7.4.3-1.fc40 100% |  68.1 MiB/s |   1.8 MiB |  00m00s
[  7/116] python3-setuptools-0:68.2.2-1 100% | 127.9 MiB/s |   1.4 MiB |  00m00s
[  8/116] python3-0:3.12.1-2.fc40.s390x 100% |   5.2 MiB/s |  26.4 KiB |  00m00s
[  9/116] python3-astropy-0:5.3.2-2.fc4 100% |  59.7 MiB/s |   9.2 MiB |  00m00s
[ 10/116] python3-reproject-0:0.13.0-2. 100% |  16.9 MiB/s | 954.3 KiB |  00m00s
[ 11/116] python3-cloudpickle-0:3.0.0-3 100% |   1.4 MiB/s |  45.3 KiB |  00m00s
[ 12/116] python3-dask+array-0:2024.1.0 100% | 364.2 KiB/s |  12.4 KiB |  00m00s
[ 13/116] python3-fsspec-0:2023.12.2-1. 100% |  50.7 MiB/s | 363.8 KiB |  00m00s
[ 14/116] python3-scipy-0:1.11.3-3.fc40 100% | 257.8 MiB/s |  16.5 MiB |  00m00s
[ 15/116] python3-zarr-0:2.16.1-1.fc40. 100% |  56.3 MiB/s | 518.6 KiB |  00m00s
[ 16/116] python3-iniconfig-0:1.1.1-14. 100% |   4.4 MiB/s |  18.0 KiB |  00m00s
[ 17/116] python3-packaging-0:23.2-2.fc 100% |  28.2 MiB/s | 115.5 KiB |  00m00s
[ 18/116] python3-pluggy-0:1.3.0-1.fc40 100% |  12.2 MiB/s |  50.0 KiB |  00m00s
[ 19/116] freetype-0:2.13.2-1.fc40.s390 100% |  86.2 MiB/s | 441.2 KiB |  00m00s
[ 20/116] lcms2-0:2.16-2.fc40.s390x     100% |  46.4 MiB/s | 190.2 KiB |  00m00s
[ 21/116] libimagequant-0:4.0.3-2.fc40. 100% |  69.1 MiB/s | 353.9 KiB |  00m00s
[ 22/116] python3-dask-0:2024.1.0-2.fc4 100% |  24.0 MiB/s |   2.9 MiB |  00m00s
[ 23/116] libjpeg-turbo-0:2.1.4-3.fc39. 100% |  24.8 MiB/s | 177.8 KiB |  00m00s
[ 24/116] libraqm-0:0.8.0-5.fc39.s390x  100% |   5.1 MiB/s |  21.0 KiB |  00m00s
[ 25/116] libtiff-0:4.5.0-3.fc40.s390x  100% |  65.4 MiB/s | 335.0 KiB |  00m00s
[ 26/116] libwebp-0:1.3.2-2.fc40.s390x  100% |  41.7 MiB/s | 256.4 KiB |  00m00s
[ 27/116] libxcb-0:1.16-2.fc40.s390x    100% |  39.8 MiB/s | 244.5 KiB |  00m00s
[ 28/116] openjpeg2-0:2.5.0-5.fc40.s390 100% |  38.4 MiB/s | 196.6 KiB |  00m00s
[ 29/116] python3-olefile-0:0.47-1.fc40 100% |  17.8 MiB/s |  72.9 KiB |  00m00s
[ 30/116] dejavu-sans-fonts-0:2.37-21.f 100% | 110.5 MiB/s |   1.3 MiB |  00m00s
[ 31/116] flexiblas-netlib-0:3.4.1-1.fc 100% | 154.0 MiB/s |   3.7 MiB |  00m00s
[ 32/116] libqhull_r-1:8.0.2-2.fc40.s39 100% |  24.8 MiB/s | 203.4 KiB |  00m00s
[ 33/116] python3-cairo-0:1.25.1-1.fc40 100% |  20.8 MiB/s | 127.7 KiB |  00m00s
[ 34/116] python3-contourpy-0:1.2.0-1.f 100% |  35.2 MiB/s | 252.3 KiB |  00m00s
[ 35/116] python3-cycler-0:0.11.0-9.fc3 100% |   3.3 MiB/s |  20.6 KiB |  00m00s
[ 36/116] python3-dateutil-1:2.8.2-11.f 100% |  67.3 MiB/s | 344.6 KiB |  00m00s
[ 37/116] python3-kiwisolver-0:1.4.5-1. 100% |  13.4 MiB/s |  68.6 KiB |  00m00s
[ 38/116] python3-matplotlib-data-0:3.8 100% |  45.1 MiB/s | 507.5 KiB |  00m00s
[ 39/116] python3-matplotlib-tk-0:3.8.1 100% |   7.8 MiB/s |  47.6 KiB |  00m00s
[ 40/116] python3-pyparsing-0:3.1.1-1.f 100% |  28.3 MiB/s | 261.0 KiB |  00m00s
[ 41/116] python3-libs-0:3.12.1-2.fc40. 100% | 215.5 MiB/s |   8.8 MiB |  00m00s
[ 42/116] python3-six-0:1.16.0-12.fc39. 100% |   8.0 MiB/s |  40.9 KiB |  00m00s
[ 43/116] tzdata-0:2023d-2.fc40.noarch  100% |  70.6 MiB/s | 433.6 KiB |  00m00s
[ 44/116] python3-click-0:8.1.7-1.fc40. 100% |  27.7 MiB/s | 226.9 KiB |  00m00s
[ 45/116] python3-importlib-metadata-0: 100% |   7.6 MiB/s |  54.3 KiB |  00m00s
[ 46/116] python3-partd-0:1.4.1-1.fc40. 100% |   2.0 MiB/s |  54.0 KiB |  00m00s
[ 47/116] python3-pyyaml-0:6.0.1-11.fc3 100% |  24.0 MiB/s | 220.8 KiB |  00m00s
[ 48/116] python3-toolz-0:0.12.0-4.fc39 100% |  18.3 MiB/s | 149.7 KiB |  00m00s
[ 49/116] cairo-0:1.18.0-1.fc40.s390x   100% |  78.1 MiB/s | 719.9 KiB |  00m00s
[ 50/116] expat-0:2.5.0-3.fc39.s390x    100% |  22.2 MiB/s | 113.9 KiB |  00m00s
[ 51/116] python3-configobj-0:5.0.8-6.f 100% |  10.8 MiB/s |  77.8 KiB |  00m00s
[ 52/116] python3-ply-0:3.11-20.fc39.no 100% |  25.5 MiB/s | 130.4 KiB |  00m00s
[ 53/116] python3-pyerfa-0:2.0.1.1-1.fc 100% |  30.8 MiB/s | 252.3 KiB |  00m00s
[ 54/116] wcslib-0:7.12-3.fc39.s390x    100% |  22.3 MiB/s | 273.9 KiB |  00m00s
[ 55/116] libXau-0:1.0.11-4.fc40.s390x  100% |   6.1 MiB/s |  31.4 KiB |  00m00s
[ 56/116] jbigkit-libs-0:2.1-27.fc40.s3 100% |  10.8 MiB/s |  55.4 KiB |  00m00s
[ 57/116] liblerc-0:4.0.0-4.fc39.s390x  100% |  21.9 MiB/s | 111.9 KiB |  00m00s
[ 58/116] fribidi-0:1.0.13-2.fc39.s390x 100% |  18.2 MiB/s |  93.2 KiB |  00m00s
[ 59/116] harfbuzz-0:8.3.0-2.fc40.s390x 100% | 102.1 MiB/s |   1.0 MiB |  00m00s
[ 60/116] glib2-0:2.79.0-6.fc40.s390x   100% | 167.9 MiB/s |   3.0 MiB |  00m00s
[ 61/116] python3-astropy-healpix-0:1.0 100% | 214.3 KiB/s | 123.7 KiB |  00m01s
[ 62/116] gnutls-0:3.8.2-2.fc40.s390x   100% |  95.4 MiB/s |   1.0 MiB |  00m00s
[ 63/116] libpng-2:1.6.40-1.fc40.s390x  100% |   7.9 MiB/s | 129.7 KiB |  00m00s
[ 64/116] flexiblas-0:3.4.1-1.fc40.s390 100% |   2.7 MiB/s |  24.8 KiB |  00m00s
[ 65/116] flexiblas-openblas-openmp-0:3 100% |   2.9 MiB/s |  17.5 KiB |  00m00s
[ 66/116] graphite2-0:1.3.14-14.fc40.s3 100% | 706.4 KiB/s | 101.0 KiB |  00m00s
[ 67/116] libgfortran-0:14.0.1-0.2.fc40 100% |  73.6 MiB/s | 602.7 KiB |  00m00s
[ 68/116] fonts-filesystem-1:2.0.5-12.f 100% |   1.6 MiB/s |   8.2 KiB |  00m00s
[ 69/116] fontconfig-0:2.15.0-1.fc40.s3 100% |  51.6 MiB/s | 264.0 KiB |  00m00s
[ 70/116] libX11-0:1.8.7-1.fc40.s390x   100% |  93.3 MiB/s | 668.7 KiB |  00m00s
[ 71/116] libXext-0:1.3.5-5.fc40.s390x  100% |   7.8 MiB/s |  39.8 KiB |  00m00s
[ 72/116] libXrender-0:0.9.11-4.fc40.s3 100% |   6.8 MiB/s |  28.0 KiB |  00m00s
[ 73/116] python3-fonttools-0:4.47.2-3. 100% |   6.6 MiB/s |   2.8 MiB |  00m00s
[ 74/116] pixman-0:0.43.0-1.fc40.s390x  100% |  26.5 MiB/s | 217.1 KiB |  00m00s
[ 75/116] python3-brotli-0:1.1.0-1.fc40 100% |  53.0 MiB/s | 380.0 KiB |  00m00s
[ 76/116] python3-fs-0:2.4.16-5.fc39.no 100% |  53.1 MiB/s | 271.8 KiB |  00m00s
[ 77/116] python3-asciitree-0:0.3.3-26. 100% |   2.8 MiB/s |  17.3 KiB |  00m00s
[ 78/116] python3-fasteners-0:0.19-2.fc 100% |   6.1 MiB/s |  44.0 KiB |  00m00s
[ 79/116] python3-lxml-0:4.9.4-1.fc40.s 100% | 113.8 MiB/s |   1.5 MiB |  00m00s
[ 80/116] python3-numcodecs-0:0.12.1-1. 100% |  49.5 MiB/s | 405.8 KiB |  00m00s
[ 81/116] python3-pooch-0:1.5.2-12.fc39 100% |  27.6 MiB/s | 113.0 KiB |  00m00s
[ 82/116] python3-numpy-f2py-1:1.26.2-2 100% |  50.9 MiB/s | 468.9 KiB |  00m00s
[ 83/116] libyaml-0:0.2.5-12.fc39.s390x 100% |   7.6 MiB/s |  61.9 KiB |  00m00s
[ 84/116] erfa-0:2.0.1-1.fc40.s390x     100% |  17.5 MiB/s | 143.4 KiB |  00m00s
[ 85/116] python3-appdirs-0:1.4.4-11.fc 100% |   4.5 MiB/s |  22.9 KiB |  00m00s
[ 86/116] python3-requests-0:2.31.0-1.f 100% |  27.5 MiB/s | 140.9 KiB |  00m00s
[ 87/116] python3-pillow-tk-0:10.2.0-1. 100% |   5.7 MiB/s |  29.4 KiB |  00m00s
[ 88/116] python3-locket-0:1.0.0-6.fc39 100% |   2.5 MiB/s |  17.6 KiB |  00m00s
[ 89/116] blosc-0:1.21.5-2.fc40.s390x   100% |   6.9 MiB/s |  49.4 KiB |  00m00s
[ 90/116] python3-tkinter-0:3.12.1-2.fc 100% |  62.7 MiB/s | 385.3 KiB |  00m00s
[ 91/116] libxslt-0:1.1.39-1.fc40.s390x 100% |  36.8 MiB/s | 188.5 KiB |  00m00s
[ 92/116] libb2-0:0.98.1-9.fc39.s390x   100% |   5.2 MiB/s |  26.8 KiB |  00m00s
[ 93/116] mpdecimal-0:2.5.1-7.fc39.s390 100% |  16.3 MiB/s | 100.0 KiB |  00m00s
[ 94/116] python3-matplotlib-data-fonts 100% | 145.2 MiB/s |   2.3 MiB |  00m00s
[ 95/116] python3-zipp-0:3.17.0-1.fc40. 100% |   3.9 MiB/s |  24.1 KiB |  00m00s
[ 96/116] libX11-common-0:1.8.7-1.fc40. 100% |  28.2 MiB/s | 144.5 KiB |  00m00s
[ 97/116] python-pip-wheel-0:23.3.1-3.f 100% |  98.0 MiB/s |   1.5 MiB |  00m00s
[ 98/116] nettle-0:3.9.1-2.fc39.s390x   100% |  49.5 MiB/s | 455.8 KiB |  00m00s
[ 99/116] default-fonts-core-sans-0:4.0 100% |   5.0 MiB/s |  25.4 KiB |  00m00s
[100/116] xml-common-0:0.6.3-62.fc40.no 100% |   7.6 MiB/s |  31.0 KiB |  00m00s
[101/116] abattis-cantarell-vf-fonts-0: 100% |  29.4 MiB/s | 120.6 KiB |  00m00s
[102/116] google-noto-sans-vf-fonts-0:2 100% |  71.2 MiB/s | 583.4 KiB |  00m00s
[103/116] snappy-0:1.1.10-2.fc39.s390x  100% |   4.6 MiB/s |  37.9 KiB |  00m00s
[104/116] openblas-openmp-0:0.3.26-1.fc 100% | 197.7 MiB/s |   4.3 MiB |  00m00s
[105/116] tcl-1:8.6.13-1.fc40.s390x     100% |  61.7 MiB/s |   1.1 MiB |  00m00s
[106/116] tk-1:8.6.13-2.fc40.s390x      100% |  85.5 MiB/s |   1.6 MiB |  00m00s
[107/116] python3-idna-0:3.6-1.fc40.noa 100% |  19.7 MiB/s | 100.7 KiB |  00m00s
[108/116] python3-urllib3-0:1.26.18-1.f 100% |  61.9 MiB/s | 253.7 KiB |  00m00s
[109/116] python3-charset-normalizer-0: 100% |   6.9 MiB/s |  99.1 KiB |  00m00s
[110/116] google-noto-fonts-common-0:20 100% |   4.2 MiB/s |  17.3 KiB |  00m00s
[111/116] openblas-0:0.3.26-1.fc40.s390 100% |   7.5 MiB/s |  38.4 KiB |  00m00s
[112/116] libXft-0:2.3.8-4.fc40.s390x   100% |  18.5 MiB/s |  75.6 KiB |  00m00s
[113/116] pyproject-rpm-macros-0:1.11.0 100% |  10.3 MiB/s |  42.4 KiB |  00m00s
[114/116] python-rpm-macros-0:3.12-5.fc 100% |   4.7 MiB/s |  19.1 KiB |  00m00s
[115/116] python3-rpm-generators-0:14-8 100% |   7.3 MiB/s |  30.0 KiB |  00m00s
[116/116] python3-rpm-macros-0:3.12-5.f 100% |   2.7 MiB/s |  13.8 KiB |  00m00s
--------------------------------------------------------------------------------
[116/116] Total                         100% | 103.8 MiB/s |  94.2 MiB |  00m01s
Running transaction
[  1/118] Verify package files          100% | 375.0   B/s | 116.0   B |  00m00s
[  2/118] Prepare transaction           100% | 920.0   B/s | 116.0   B |  00m00s
[  3/118] Installing fonts-filesystem-1 100% |   0.0   B/s | 788.0   B |  00m00s
[  4/118] Installing python-rpm-macros- 100% |   0.0   B/s |  22.8 KiB |  00m00s
[  5/118] Installing libgfortran-0:14.0 100% | 310.2 MiB/s |   2.2 MiB |  00m00s
[  6/118] Installing python3-rpm-macros 100% |   0.0   B/s |   6.7 KiB |  00m00s
[  7/118] Installing python3-matplotlib 100% | 272.8 MiB/s |   7.9 MiB |  00m00s
[  8/118] Installing python3-matplotlib 100% | 185.1 MiB/s | 758.2 KiB |  00m00s
[  9/118] Installing tcl-1:8.6.13-1.fc4 100% | 244.2 MiB/s |   4.4 MiB |  00m00s
[ 10/118] Installing libpng-2:1.6.40-1. 100% | 248.9 MiB/s | 254.9 KiB |  00m00s
[ 11/118] Installing expat-0:2.5.0-3.fc 100% |  74.3 MiB/s | 304.5 KiB |  00m00s
[ 12/118] Installing tzdata-0:2023d-2.f 100% |  56.1 MiB/s |   1.9 MiB |  00m00s
[ 13/118] Installing libwebp-0:1.3.2-2. 100% | 212.8 MiB/s | 653.6 KiB |  00m00s
[ 14/118] Installing libjpeg-turbo-0:2. 100% | 248.6 MiB/s | 509.1 KiB |  00m00s
[ 15/118] Installing pyproject-rpm-macr 100% |  98.1 MiB/s | 100.5 KiB |  00m00s
[ 16/118] Installing dejavu-sans-fonts- 100% | 306.0 MiB/s |   5.5 MiB |  00m00s
[ 17/118] Installing abattis-cantarell- 100% | 189.5 MiB/s | 194.1 KiB |  00m00s
[ 18/118] Installing google-noto-fonts- 100% |   0.0   B/s |  18.1 KiB |  00m00s
[ 19/118] Installing google-noto-sans-v 100% | 205.2 MiB/s |   1.2 MiB |  00m00s
[ 20/118] Installing default-fonts-core 100% |  17.8 MiB/s |  18.2 KiB |  00m00s
[ 21/118] Installing openblas-0:0.3.26- 100% |  95.5 MiB/s |  97.8 KiB |  00m00s
[ 22/118] Installing openblas-openmp-0: 100% | 309.4 MiB/s |  15.2 MiB |  00m00s
[ 23/118] Installing flexiblas-0:3.4.1- 100% |   0.0   B/s |  47.9 KiB |  00m00s
[ 24/118] Installing flexiblas-openblas 100% |  39.1 MiB/s |  40.0 KiB |  00m00s
[ 25/118] Installing flexiblas-netlib-0 100% | 291.7 MiB/s |  11.7 MiB |  00m00s
[ 26/118] Installing snappy-0:1.1.10-2. 100% |  71.0 MiB/s |  72.7 KiB |  00m00s
[ 27/118] Installing blosc-0:1.21.5-2.f 100% |  17.6 MiB/s | 108.4 KiB |  00m00s
>>> Running pre-install scriptlet: xml-common-0:0.6.3-62.fc40.noarch
>>> Stop pre-install scriptlet: xml-common-0:0.6.3-62.fc40.noarch
[ 28/118] Installing xml-common-0:0.6.3 100% |  79.2 MiB/s |  81.1 KiB |  00m00s
[ 29/118] Installing nettle-0:3.9.1-2.f 100% | 207.4 MiB/s | 849.3 KiB |  00m00s
[ 30/118] Installing gnutls-0:3.8.2-2.f 100% | 258.2 MiB/s |   3.1 MiB |  00m00s
[ 31/118] Installing glib2-0:2.79.0-6.f 100% | 283.7 MiB/s |  14.8 MiB |  00m00s
[ 32/118] Installing libX11-common-0:1. 100% | 131.7 MiB/s |   1.2 MiB |  00m00s
[ 33/118] Installing python-pip-wheel-0 100% | 506.5 MiB/s |   1.5 MiB |  00m00s
[ 34/118] Installing mpdecimal-0:2.5.1- 100% | 112.2 MiB/s | 229.8 KiB |  00m00s
[ 35/118] Installing libb2-0:0.98.1-9.f 100% |  42.0 MiB/s |  43.0 KiB |  00m00s
[ 36/118] Installing libxslt-0:1.1.39-1 100% | 161.5 MiB/s | 496.1 KiB |  00m00s
[ 37/118] Installing erfa-0:2.0.1-1.fc4 100% | 199.8 MiB/s | 409.2 KiB |  00m00s
[ 38/118] Installing libyaml-0:0.2.5-12 100% | 129.2 MiB/s | 132.3 KiB |  00m00s
[ 39/118] Installing pixman-0:0.43.0-1. 100% | 177.6 MiB/s | 545.5 KiB |  00m00s
[ 40/118] Installing graphite2-0:1.3.14 100% | 204.6 MiB/s | 209.6 KiB |  00m00s
[ 41/118] Installing fribidi-0:1.0.13-2 100% | 183.2 MiB/s | 375.3 KiB |  00m00s
[ 42/118] Installing liblerc-0:4.0.0-4. 100% | 264.3 MiB/s | 270.7 KiB |  00m00s
[ 43/118] Installing jbigkit-libs-0:2.1 100% | 120.3 MiB/s | 123.2 KiB |  00m00s
[ 44/118] Installing libtiff-0:4.5.0-3. 100% | 243.4 MiB/s |   1.2 MiB |  00m00s
[ 45/118] Installing libXau-0:1.0.11-4. 100% |  66.5 MiB/s |  68.1 KiB |  00m00s
[ 46/118] Installing libxcb-0:1.16-2.fc 100% | 197.6 MiB/s |   1.2 MiB |  00m00s
[ 47/118] Installing libX11-0:1.8.7-1.f 100% | 274.0 MiB/s |   1.4 MiB |  00m00s
[ 48/118] Installing libXrender-0:0.9.1 100% |  53.8 MiB/s |  55.1 KiB |  00m00s
[ 49/118] Installing libXext-0:1.3.5-5. 100% |  96.6 MiB/s |  99.0 KiB |  00m00s
[ 50/118] Installing cairo-0:1.18.0-1.f 100% | 252.4 MiB/s |   1.8 MiB |  00m00s
[ 51/118] Installing harfbuzz-0:8.3.0-2 100% | 257.0 MiB/s |   2.6 MiB |  00m00s
[ 52/118] Installing freetype-0:2.13.2- 100% | 181.4 MiB/s | 928.7 KiB |  00m00s
[ 53/118] Installing fontconfig-0:2.15. 100% | 791.0 KiB/s | 815.5 KiB |  00m01s
>>> Running post-install scriptlet: fontconfig-0:2.15.0-1.fc40.s390x
>>> Stop post-install scriptlet: fontconfig-0:2.15.0-1.fc40.s390x
[ 54/118] Installing libXft-0:2.3.8-4.f 100% |  28.3 MiB/s | 173.8 KiB |  00m00s
>>> Running pre-install scriptlet: tk-1:8.6.13-2.fc40.s390x
>>> Stop pre-install scriptlet: tk-1:8.6.13-2.fc40.s390x
[ 55/118] Installing tk-1:8.6.13-2.fc40 100% | 167.7 MiB/s |   3.9 MiB |  00m00s
[ 56/118] Installing python3-libs-0:3.1 100% | 254.2 MiB/s |  42.2 MiB |  00m00s
[ 57/118] Installing python3-0:3.12.1-2 100% |  32.6 MiB/s |  33.4 KiB |  00m00s
[ 58/118] Installing python3-tkinter-0: 100% | 201.6 MiB/s |   2.2 MiB |  00m00s
[ 59/118] Installing python3-numpy-1:1. 100% | 308.7 MiB/s |  42.3 MiB |  00m00s
[ 60/118] Installing python3-packaging- 100% | 210.9 MiB/s | 431.9 KiB |  00m00s
[ 61/118] Installing python3-six-0:1.16 100% | 117.2 MiB/s | 120.0 KiB |  00m00s
[ 62/118] Installing python3-cloudpickl 100% | 124.7 MiB/s | 127.7 KiB |  00m00s
[ 63/118] Installing python3-fsspec-0:2 100% | 203.0 MiB/s |   1.6 MiB |  00m00s
[ 64/118] Installing python3-pyyaml-0:6 100% | 156.4 MiB/s | 800.7 KiB |  00m00s
[ 65/118] Installing python3-toolz-0:0. 100% | 153.0 MiB/s | 626.7 KiB |  00m00s
[ 66/118] Installing python3-appdirs-0: 100% |  69.4 MiB/s |  71.1 KiB |  00m00s
[ 67/118] Installing python3-idna-0:3.6 100% | 165.6 MiB/s | 508.6 KiB |  00m00s
[ 68/118] Installing python3-urllib3-0: 100% | 166.3 MiB/s |   1.0 MiB |  00m00s
[ 69/118] Installing python3-dateutil-1 100% | 174.1 MiB/s | 891.5 KiB |  00m00s
[ 70/118] Installing python3-configobj- 100% | 201.8 MiB/s | 413.2 KiB |  00m00s
[ 71/118] Installing python3-rpm-genera 100% |  81.5 MiB/s |  83.4 KiB |  00m00s
[ 72/118] Installing python3-devel-0:3. 100% | 141.7 MiB/s |   1.3 MiB |  00m00s
[ 73/118] Installing python3-numpy-f2py 100% | 189.8 MiB/s |   2.7 MiB |  00m00s
[ 74/118] Installing python3-contourpy- 100% | 191.7 MiB/s | 785.2 KiB |  00m00s
[ 75/118] Installing python3-pyerfa-0:2 100% | 339.8 MiB/s |   2.4 MiB |  00m00s
[ 76/118] Installing python3-numcodecs- 100% | 167.1 MiB/s |   1.7 MiB |  00m00s
[ 77/118] Installing python3-setuptools 100% | 213.2 MiB/s |   7.2 MiB |  00m00s
[ 78/118] Installing python3-fs-0:2.4.1 100% | 192.0 MiB/s |   1.3 MiB |  00m00s
[ 79/118] Installing python3-iniconfig- 100% |  22.9 MiB/s |  23.4 KiB |  00m00s
[ 80/118] Installing python3-pluggy-0:1 100% |  46.4 MiB/s | 190.1 KiB |  00m00s
[ 81/118] Installing python3-pytest-0:7 100% | 298.0 MiB/s |  15.2 MiB |  00m00s
[ 82/118] Installing python3-olefile-0: 100% | 338.3 MiB/s | 346.4 KiB |  00m00s
[ 83/118] Installing python3-cairo-0:1. 100% | 170.7 MiB/s | 524.3 KiB |  00m00s
[ 84/118] Installing python3-cycler-0:0 100% |  39.4 MiB/s |  40.4 KiB |  00m00s
[ 85/118] Installing python3-kiwisolver 100% | 165.1 MiB/s | 169.1 KiB |  00m00s
[ 86/118] Installing python3-pyparsing- 100% | 249.8 MiB/s |   1.0 MiB |  00m00s
[ 87/118] Installing python3-click-0:8. 100% | 266.9 MiB/s |   1.1 MiB |  00m00s
[ 88/118] Installing python3-ply-0:3.11 100% | 276.5 MiB/s | 566.2 KiB |  00m00s
[ 89/118] Installing python3-brotli-0:1 100% | 179.4 MiB/s | 918.5 KiB |  00m00s
[ 90/118] Installing python3-lxml-0:4.9 100% | 249.8 MiB/s |   5.5 MiB |  00m00s
[ 91/118] Installing python3-asciitree- 100% |  23.9 MiB/s |  24.5 KiB |  00m00s
[ 92/118] Installing python3-fasteners- 100% |  60.7 MiB/s | 124.2 KiB |  00m00s
[ 93/118] Installing python3-zarr-0:2.1 100% | 319.0 MiB/s |   3.2 MiB |  00m00s
[ 94/118] Installing python3-locket-0:1 100% |  22.6 MiB/s |  23.1 KiB |  00m00s
[ 95/118] Installing python3-partd-0:1. 100% |  55.9 MiB/s | 171.8 KiB |  00m00s
[ 96/118] Installing python3-zipp-0:3.1 100% |  43.4 MiB/s |  44.4 KiB |  00m00s
[ 97/118] Installing python3-importlib- 100% |  66.7 MiB/s | 204.9 KiB |  00m00s
[ 98/118] Installing python3-dask-0:202 100% | 291.9 MiB/s |  16.9 MiB |  00m00s
[ 99/118] Installing python3-dask+array 100% |   0.0   B/s | 124.0   B |  00m00s
[100/118] Installing python3-charset-no 100% | 157.5 MiB/s | 322.7 KiB |  00m00s
[101/118] Installing python3-requests-0 100% | 154.5 MiB/s | 474.5 KiB |  00m00s
[102/118] Installing python3-pooch-0:1. 100% |  78.5 MiB/s | 562.9 KiB |  00m00s
[103/118] Installing python3-scipy-0:1. 100% | 287.1 MiB/s |  64.3 MiB |  00m00s
[104/118] Installing python3-fonttools- 100% | 292.8 MiB/s |  18.2 MiB |  00m00s
[105/118] Installing libraqm-0:0.8.0-5. 100% |   0.0   B/s |  29.5 KiB |  00m00s
[106/118] Installing wcslib-0:7.12-3.fc 100% | 166.6 MiB/s |   1.5 MiB |  00m00s
[107/118] Installing python3-astropy-0: 100% | 244.5 MiB/s |  47.9 MiB |  00m00s
[108/118] Installing python3-astropy-he 100% | 108.7 MiB/s | 445.1 KiB |  00m00s
[109/118] Installing libqhull_r-1:8.0.2 100% | 238.3 MiB/s | 488.0 KiB |  00m00s
[110/118] Installing openjpeg2-0:2.5.0- 100% | 144.2 MiB/s | 443.0 KiB |  00m00s
[111/118] Installing libimagequant-0:4. 100% | 212.7 MiB/s | 871.3 KiB |  00m00s
[112/118] Installing lcms2-0:2.16-2.fc4 100% | 149.2 MiB/s | 458.4 KiB |  00m00s
[113/118] Installing python3-pillow-0:1 100% | 208.8 MiB/s |   3.3 MiB |  00m00s
[114/118] Installing python3-pillow-tk- 100% |   0.0   B/s |  55.9 KiB |  00m00s
[115/118] Installing python3-matplotlib 100% |  59.5 MiB/s | 121.9 KiB |  00m00s
[116/118] Installing python3-matplotlib 100% | 267.8 MiB/s |  20.4 MiB |  00m00s
[117/118] Installing python3-reproject- 100% | 224.5 MiB/s |   3.1 MiB |  00m00s
[118/118] Installing python3-pytest-ast 100% | 333.4 KiB/s |  36.0 KiB |  00m00s
>>> Running post-transaction scriptlet: fontconfig-0:2.15.0-1.fc40.s390x
>>> Stop post-transaction scriptlet: fontconfig-0:2.15.0-1.fc40.s390x
>>> Running trigger-install scriptlet: glibc-common-0:2.38.9000-33.fc40.s390x
>>> Stop trigger-install scriptlet: glibc-common-0:2.38.9000-33.fc40.s390x
>>> Running trigger-install scriptlet: info-0:7.1-1.fc40.s390x
>>> Stop trigger-install scriptlet: info-0:7.1-1.fc40.s390x
>>> Running trigger-install scriptlet: glib2-0:2.79.0-6.fc40.s390x
>>> Stop trigger-install scriptlet: glib2-0:2.79.0-6.fc40.s390x
>>> Running trigger-install scriptlet: fontconfig-0:2.15.0-1.fc40.s390x
>>> Stop trigger-install scriptlet: fontconfig-0:2.15.0-1.fc40.s390x
Warning: skipped PGP checks for 116 package(s).
Finish: build setup for APLpy-2.0.3-25.fc40.src.rpm
Start: rpmbuild APLpy-2.0.3-25.fc40.src.rpm
Building target platforms: s390x
Building for target s390x
setting SOURCE_DATE_EPOCH=1705881600
Executing(%prep): /bin/sh -e /var/tmp/rpm-tmp.FmiXDF
+ umask 022
+ cd /builddir/build/BUILD
+ cd /builddir/build/BUILD
+ rm -rf APLpy-2.0.3
+ /usr/lib/rpm/rpmuncompress -x /builddir/build/SOURCES/APLpy-2.0.3.tar.gz
+ STATUS=0
+ '[' 0 -ne 0 ']'
+ cd APLpy-2.0.3
+ rm -rf /builddir/build/BUILD/APLpy-2.0.3-SPECPARTS
+ /usr/bin/mkdir -p /builddir/build/BUILD/APLpy-2.0.3-SPECPARTS
+ /usr/bin/chmod -Rf a+rX,u+w,g-w,o-w .
+ /usr/lib/rpm/rpmuncompress /builddir/build/SOURCES/aplpy-moved-function.patch
+ /usr/bin/patch -p1 -s --fuzz=0 --no-backup-if-mismatch -f
+ /usr/lib/rpm/rpmuncompress /builddir/build/SOURCES/aplpy-wraps-from-functools.patch
+ /usr/bin/patch -p1 -s --fuzz=0 --no-backup-if-mismatch -f
+ /usr/lib/rpm/rpmuncompress /builddir/build/SOURCES/astropy_helpers-py312-imp-deprecation.patch
+ /usr/bin/patch -p1 -s --fuzz=0 --no-backup-if-mismatch -f
+ /usr/lib/rpm/rpmuncompress /builddir/build/SOURCES/aplpy-astropy-5.1-tests-plugins-removal.patch
+ /usr/bin/patch -p1 -s --fuzz=0 --no-backup-if-mismatch -f
+ RPM_EC=0
++ jobs -p
+ exit 0
Executing(%build): /bin/sh -e /var/tmp/rpm-tmp.8pDIj6
+ umask 022
+ cd /builddir/build/BUILD
+ CFLAGS='-O2 -flto=auto -ffat-lto-objects -fexceptions -g -grecord-gcc-switches -pipe -Wall -Werror=format-security -Wp,-U_FORTIFY_SOURCE,-D_FORTIFY_SOURCE=3 -Wp,-D_GLIBCXX_ASSERTIONS -specs=/usr/lib/rpm/redhat/redhat-hardened-cc1 -fstack-protector-strong -specs=/usr/lib/rpm/redhat/redhat-annobin-cc1  -m64 -march=z13 -mtune=z14 -fasynchronous-unwind-tables -fstack-clash-protection '
+ export CFLAGS
+ CXXFLAGS='-O2 -flto=auto -ffat-lto-objects -fexceptions -g -grecord-gcc-switches -pipe -Wall -Werror=format-security -Wp,-U_FORTIFY_SOURCE,-D_FORTIFY_SOURCE=3 -Wp,-D_GLIBCXX_ASSERTIONS -specs=/usr/lib/rpm/redhat/redhat-hardened-cc1 -fstack-protector-strong -specs=/usr/lib/rpm/redhat/redhat-annobin-cc1  -m64 -march=z13 -mtune=z14 -fasynchronous-unwind-tables -fstack-clash-protection '
+ export CXXFLAGS
+ FFLAGS='-O2 -flto=auto -ffat-lto-objects -fexceptions -g -grecord-gcc-switches -pipe -Wall -Wp,-U_FORTIFY_SOURCE,-D_FORTIFY_SOURCE=3 -Wp,-D_GLIBCXX_ASSERTIONS -specs=/usr/lib/rpm/redhat/redhat-hardened-cc1 -fstack-protector-strong -specs=/usr/lib/rpm/redhat/redhat-annobin-cc1  -m64 -march=z13 -mtune=z14 -fasynchronous-unwind-tables -fstack-clash-protection -I/usr/lib64/gfortran/modules '
+ export FFLAGS
+ FCFLAGS='-O2 -flto=auto -ffat-lto-objects -fexceptions -g -grecord-gcc-switches -pipe -Wall -Wp,-U_FORTIFY_SOURCE,-D_FORTIFY_SOURCE=3 -Wp,-D_GLIBCXX_ASSERTIONS -specs=/usr/lib/rpm/redhat/redhat-hardened-cc1 -fstack-protector-strong -specs=/usr/lib/rpm/redhat/redhat-annobin-cc1  -m64 -march=z13 -mtune=z14 -fasynchronous-unwind-tables -fstack-clash-protection -I/usr/lib64/gfortran/modules '
+ export FCFLAGS
+ VALAFLAGS=-g
+ export VALAFLAGS
+ RUSTFLAGS='-Copt-level=3 -Cdebuginfo=2 -Ccodegen-units=1 -Cstrip=none -Clink-arg=-Wl,-z,relro -Clink-arg=-Wl,-z,now -Clink-arg=-specs=/usr/lib/rpm/redhat/redhat-package-notes --cap-lints=warn'
+ export RUSTFLAGS
+ LDFLAGS='-Wl,-z,relro -Wl,--as-needed   -Wl,-z,now -specs=/usr/lib/rpm/redhat/redhat-hardened-ld-errors -specs=/usr/lib/rpm/redhat/redhat-hardened-ld -specs=/usr/lib/rpm/redhat/redhat-annobin-cc1  -Wl,--build-id=sha1 -specs=/usr/lib/rpm/redhat/redhat-package-notes '
+ export LDFLAGS
+ LT_SYS_LIBRARY_PATH=/usr/lib64:
+ export LT_SYS_LIBRARY_PATH
+ CC=gcc
+ export CC
+ CXX=g++
+ export CXX
+ cd APLpy-2.0.3
+ CFLAGS='-O2 -flto=auto -ffat-lto-objects -fexceptions -g -grecord-gcc-switches -pipe -Wall -Werror=format-security -Wp,-U_FORTIFY_SOURCE,-D_FORTIFY_SOURCE=3 -Wp,-D_GLIBCXX_ASSERTIONS -specs=/usr/lib/rpm/redhat/redhat-hardened-cc1 -fstack-protector-strong -specs=/usr/lib/rpm/redhat/redhat-annobin-cc1  -m64 -march=z13 -mtune=z14 -fasynchronous-unwind-tables -fstack-clash-protection '
+ LDFLAGS='-Wl,-z,relro -Wl,--as-needed   -Wl,-z,now -specs=/usr/lib/rpm/redhat/redhat-hardened-ld-errors -specs=/usr/lib/rpm/redhat/redhat-hardened-ld -specs=/usr/lib/rpm/redhat/redhat-annobin-cc1  -Wl,--build-id=sha1 -specs=/usr/lib/rpm/redhat/redhat-package-notes '
+ /usr/bin/python3 setup.py build '--executable=/usr/bin/python3 -sP'
/builddir/build/BUILD/APLpy-2.0.3/ah_bootstrap.py:637: SyntaxWarning: invalid escape sequence '\S'
  '(?P<submodule>\S+)( .*)?$')
Download error on https://pypi.python.org/simple/astropy-helpers/: [Errno -3] Temporary failure in name resolution -- Some packages may not be found!
Couldn't find index page for 'astropy-helpers' (maybe misspelled?)
Download error on https://pypi.python.org/simple/: [Errno -3] Temporary failure in name resolution -- Some packages may not be found!
/usr/lib/python3.12/site-packages/setuptools/dist.py:700: DistDeprecationWarning: use_2to3 is ignored.
  ep.load()(self, ep.name, value)
running build
running build_py
creating build
creating build/lib
creating build/lib/aplpy
copying aplpy/conftest.py -> build/lib/aplpy
copying aplpy/decorators.py -> build/lib/aplpy
copying aplpy/core.py -> build/lib/aplpy
copying aplpy/version.py -> build/lib/aplpy
copying aplpy/ticks.py -> build/lib/aplpy
copying aplpy/tick_labels.py -> build/lib/aplpy
copying aplpy/slicer.py -> build/lib/aplpy
copying aplpy/rgb.py -> build/lib/aplpy
copying aplpy/regions.py -> build/lib/aplpy
copying aplpy/overlays.py -> build/lib/aplpy
copying aplpy/layers.py -> build/lib/aplpy
copying aplpy/header.py -> build/lib/aplpy
copying aplpy/grid.py -> build/lib/aplpy
copying aplpy/frame.py -> build/lib/aplpy
copying aplpy/convolve_util.py -> build/lib/aplpy
copying aplpy/compat.py -> build/lib/aplpy
copying aplpy/colorbar.py -> build/lib/aplpy
copying aplpy/axis_labels.py -> build/lib/aplpy
copying aplpy/_astropy_init.py -> build/lib/aplpy
copying aplpy/__init__.py -> build/lib/aplpy
creating build/lib/aplpy/tests
copying aplpy/tests/test_vectors.py -> build/lib/aplpy/tests
copying aplpy/tests/test_ticks.py -> build/lib/aplpy/tests
copying aplpy/tests/test_tick_labels.py -> build/lib/aplpy/tests
copying aplpy/tests/test_subplot.py -> build/lib/aplpy/tests
copying aplpy/tests/test_scalebar.py -> build/lib/aplpy/tests
copying aplpy/tests/test_save.py -> build/lib/aplpy/tests
copying aplpy/tests/test_rgb.py -> build/lib/aplpy/tests
copying aplpy/tests/test_pixworldmarkers.py -> build/lib/aplpy/tests
copying aplpy/tests/test_misc.py -> build/lib/aplpy/tests
copying aplpy/tests/test_layers.py -> build/lib/aplpy/tests
copying aplpy/tests/test_init_image.py -> build/lib/aplpy/tests
copying aplpy/tests/test_init_cube.py -> build/lib/aplpy/tests
copying aplpy/tests/test_images.py -> build/lib/aplpy/tests
copying aplpy/tests/test_grid.py -> build/lib/aplpy/tests
copying aplpy/tests/test_frame.py -> build/lib/aplpy/tests
copying aplpy/tests/test_downsample.py -> build/lib/aplpy/tests
copying aplpy/tests/test_convolve.py -> build/lib/aplpy/tests
copying aplpy/tests/test_contour.py -> build/lib/aplpy/tests
copying aplpy/tests/test_colorbar.py -> build/lib/aplpy/tests
copying aplpy/tests/test_beam.py -> build/lib/aplpy/tests
copying aplpy/tests/test_axis_labels.py -> build/lib/aplpy/tests
copying aplpy/tests/setup_package.py -> build/lib/aplpy/tests
copying aplpy/tests/helpers.py -> build/lib/aplpy/tests
copying aplpy/tests/__init__.py -> build/lib/aplpy/tests
creating build/lib/aplpy/tests/data
copying aplpy/tests/data/__init__.py -> build/lib/aplpy/tests/data
copying aplpy/tests/coveragerc -> build/lib/aplpy/tests
copying aplpy/tests/data/shapes.reg -> build/lib/aplpy/tests/data
creating build/lib/aplpy/tests/data/3d_fits
copying aplpy/tests/data/3d_fits/cube.hdr -> build/lib/aplpy/tests/data/3d_fits
creating build/lib/aplpy/tests/data/2d_fits
copying aplpy/tests/data/2d_fits/2MASS_k_rot.hdr -> build/lib/aplpy/tests/data/2d_fits
copying aplpy/tests/data/2d_fits/2MASS_k.hdr -> build/lib/aplpy/tests/data/2d_fits
copying aplpy/tests/data/2d_fits/1904-66_ZPN.hdr -> build/lib/aplpy/tests/data/2d_fits
copying aplpy/tests/data/2d_fits/1904-66_ZEA.hdr -> build/lib/aplpy/tests/data/2d_fits
copying aplpy/tests/data/2d_fits/1904-66_TSC.hdr -> build/lib/aplpy/tests/data/2d_fits
copying aplpy/tests/data/2d_fits/1904-66_TAN.hdr -> build/lib/aplpy/tests/data/2d_fits
copying aplpy/tests/data/2d_fits/1904-66_SZP.hdr -> build/lib/aplpy/tests/data/2d_fits
copying aplpy/tests/data/2d_fits/1904-66_STG.hdr -> build/lib/aplpy/tests/data/2d_fits
copying aplpy/tests/data/2d_fits/1904-66_SIN.hdr -> build/lib/aplpy/tests/data/2d_fits
copying aplpy/tests/data/2d_fits/1904-66_SFL.hdr -> build/lib/aplpy/tests/data/2d_fits
copying aplpy/tests/data/2d_fits/1904-66_QSC.hdr -> build/lib/aplpy/tests/data/2d_fits
copying aplpy/tests/data/2d_fits/1904-66_PCO.hdr -> build/lib/aplpy/tests/data/2d_fits
copying aplpy/tests/data/2d_fits/1904-66_PAR.hdr -> build/lib/aplpy/tests/data/2d_fits
copying aplpy/tests/data/2d_fits/1904-66_NCP.hdr -> build/lib/aplpy/tests/data/2d_fits
copying aplpy/tests/data/2d_fits/1904-66_MOL.hdr -> build/lib/aplpy/tests/data/2d_fits
copying aplpy/tests/data/2d_fits/1904-66_MER.hdr -> build/lib/aplpy/tests/data/2d_fits
copying aplpy/tests/data/2d_fits/1904-66_HPX.hdr -> build/lib/aplpy/tests/data/2d_fits
copying aplpy/tests/data/2d_fits/1904-66_CYP.hdr -> build/lib/aplpy/tests/data/2d_fits
copying aplpy/tests/data/2d_fits/1904-66_CSC.hdr -> build/lib/aplpy/tests/data/2d_fits
copying aplpy/tests/data/2d_fits/1904-66_COP.hdr -> build/lib/aplpy/tests/data/2d_fits
copying aplpy/tests/data/2d_fits/1904-66_COO.hdr -> build/lib/aplpy/tests/data/2d_fits
copying aplpy/tests/data/2d_fits/1904-66_COE.hdr -> build/lib/aplpy/tests/data/2d_fits
copying aplpy/tests/data/2d_fits/1904-66_COD.hdr -> build/lib/aplpy/tests/data/2d_fits
copying aplpy/tests/data/2d_fits/1904-66_CEA.hdr -> build/lib/aplpy/tests/data/2d_fits
copying aplpy/tests/data/2d_fits/1904-66_CAR.hdr -> build/lib/aplpy/tests/data/2d_fits
copying aplpy/tests/data/2d_fits/1904-66_BON.hdr -> build/lib/aplpy/tests/data/2d_fits
copying aplpy/tests/data/2d_fits/1904-66_AZP.hdr -> build/lib/aplpy/tests/data/2d_fits
copying aplpy/tests/data/2d_fits/1904-66_ARC.hdr -> build/lib/aplpy/tests/data/2d_fits
copying aplpy/tests/data/2d_fits/1904-66_AIT.hdr -> build/lib/aplpy/tests/data/2d_fits
copying aplpy/tests/data/2d_fits/1904-66_AIR.hdr -> build/lib/aplpy/tests/data/2d_fits
+ RPM_EC=0
++ jobs -p
+ exit 0
Executing(%install): /bin/sh -e /var/tmp/rpm-tmp.rYZ1Vc
+ umask 022
+ cd /builddir/build/BUILD
+ '[' /builddir/build/BUILDROOT/APLpy-2.0.3-25.fc40.s390x '!=' / ']'
+ rm -rf /builddir/build/BUILDROOT/APLpy-2.0.3-25.fc40.s390x
++ dirname /builddir/build/BUILDROOT/APLpy-2.0.3-25.fc40.s390x
+ mkdir -p /builddir/build/BUILDROOT
+ mkdir /builddir/build/BUILDROOT/APLpy-2.0.3-25.fc40.s390x
+ CFLAGS='-O2 -flto=auto -ffat-lto-objects -fexceptions -g -grecord-gcc-switches -pipe -Wall -Werror=format-security -Wp,-U_FORTIFY_SOURCE,-D_FORTIFY_SOURCE=3 -Wp,-D_GLIBCXX_ASSERTIONS -specs=/usr/lib/rpm/redhat/redhat-hardened-cc1 -fstack-protector-strong -specs=/usr/lib/rpm/redhat/redhat-annobin-cc1  -m64 -march=z13 -mtune=z14 -fasynchronous-unwind-tables -fstack-clash-protection '
+ export CFLAGS
+ CXXFLAGS='-O2 -flto=auto -ffat-lto-objects -fexceptions -g -grecord-gcc-switches -pipe -Wall -Werror=format-security -Wp,-U_FORTIFY_SOURCE,-D_FORTIFY_SOURCE=3 -Wp,-D_GLIBCXX_ASSERTIONS -specs=/usr/lib/rpm/redhat/redhat-hardened-cc1 -fstack-protector-strong -specs=/usr/lib/rpm/redhat/redhat-annobin-cc1  -m64 -march=z13 -mtune=z14 -fasynchronous-unwind-tables -fstack-clash-protection '
+ export CXXFLAGS
+ FFLAGS='-O2 -flto=auto -ffat-lto-objects -fexceptions -g -grecord-gcc-switches -pipe -Wall -Wp,-U_FORTIFY_SOURCE,-D_FORTIFY_SOURCE=3 -Wp,-D_GLIBCXX_ASSERTIONS -specs=/usr/lib/rpm/redhat/redhat-hardened-cc1 -fstack-protector-strong -specs=/usr/lib/rpm/redhat/redhat-annobin-cc1  -m64 -march=z13 -mtune=z14 -fasynchronous-unwind-tables -fstack-clash-protection -I/usr/lib64/gfortran/modules '
+ export FFLAGS
+ FCFLAGS='-O2 -flto=auto -ffat-lto-objects -fexceptions -g -grecord-gcc-switches -pipe -Wall -Wp,-U_FORTIFY_SOURCE,-D_FORTIFY_SOURCE=3 -Wp,-D_GLIBCXX_ASSERTIONS -specs=/usr/lib/rpm/redhat/redhat-hardened-cc1 -fstack-protector-strong -specs=/usr/lib/rpm/redhat/redhat-annobin-cc1  -m64 -march=z13 -mtune=z14 -fasynchronous-unwind-tables -fstack-clash-protection -I/usr/lib64/gfortran/modules '
+ export FCFLAGS
+ VALAFLAGS=-g
+ export VALAFLAGS
+ RUSTFLAGS='-Copt-level=3 -Cdebuginfo=2 -Ccodegen-units=1 -Cstrip=none -Clink-arg=-Wl,-z,relro -Clink-arg=-Wl,-z,now -Clink-arg=-specs=/usr/lib/rpm/redhat/redhat-package-notes --cap-lints=warn'
+ export RUSTFLAGS
+ LDFLAGS='-Wl,-z,relro -Wl,--as-needed   -Wl,-z,now -specs=/usr/lib/rpm/redhat/redhat-hardened-ld-errors -specs=/usr/lib/rpm/redhat/redhat-hardened-ld -specs=/usr/lib/rpm/redhat/redhat-annobin-cc1  -Wl,--build-id=sha1 -specs=/usr/lib/rpm/redhat/redhat-package-notes '
+ export LDFLAGS
+ LT_SYS_LIBRARY_PATH=/usr/lib64:
+ export LT_SYS_LIBRARY_PATH
+ CC=gcc
+ export CC
+ CXX=g++
+ export CXX
+ cd APLpy-2.0.3
+ CFLAGS='-O2 -flto=auto -ffat-lto-objects -fexceptions -g -grecord-gcc-switches -pipe -Wall -Werror=format-security -Wp,-U_FORTIFY_SOURCE,-D_FORTIFY_SOURCE=3 -Wp,-D_GLIBCXX_ASSERTIONS -specs=/usr/lib/rpm/redhat/redhat-hardened-cc1 -fstack-protector-strong -specs=/usr/lib/rpm/redhat/redhat-annobin-cc1  -m64 -march=z13 -mtune=z14 -fasynchronous-unwind-tables -fstack-clash-protection '
+ LDFLAGS='-Wl,-z,relro -Wl,--as-needed   -Wl,-z,now -specs=/usr/lib/rpm/redhat/redhat-hardened-ld-errors -specs=/usr/lib/rpm/redhat/redhat-hardened-ld -specs=/usr/lib/rpm/redhat/redhat-annobin-cc1  -Wl,--build-id=sha1 -specs=/usr/lib/rpm/redhat/redhat-package-notes '
+ /usr/bin/python3 setup.py install -O1 --skip-build --root /builddir/build/BUILDROOT/APLpy-2.0.3-25.fc40.s390x --prefix /usr
Download error on https://pypi.python.org/simple/astropy-helpers/: [Errno -3] Temporary failure in name resolution -- Some packages may not be found!
Couldn't find index page for 'astropy-helpers' (maybe misspelled?)
Download error on https://pypi.python.org/simple/: [Errno -3] Temporary failure in name resolution -- Some packages may not be found!
/usr/lib/python3.12/site-packages/setuptools/dist.py:700: DistDeprecationWarning: use_2to3 is ignored.
  ep.load()(self, ep.name, value)
running install
/usr/lib/python3.12/site-packages/setuptools/_distutils/cmd.py:66: SetuptoolsDeprecationWarning: setup.py install is deprecated.
!!

        ********************************************************************************
        Please avoid running ``setup.py`` directly.
        Instead, use pypa/build, pypa/installer or other
        standards-based tools.

        Follow the current Python packaging guidelines when building
        Python RPM packages.

        See https://blog.ganssle.io/articles/2021/10/setup-py-deprecated.html
        and https://docs.fedoraproject.org/en-US/packaging-guidelines/Python/ for details.
        ********************************************************************************

!!
  self.initialize_options()
running install_lib
creating /builddir/build/BUILDROOT/APLpy-2.0.3-25.fc40.s390x/usr
creating /builddir/build/BUILDROOT/APLpy-2.0.3-25.fc40.s390x/usr/lib
creating /builddir/build/BUILDROOT/APLpy-2.0.3-25.fc40.s390x/usr/lib/python3.12
creating /builddir/build/BUILDROOT/APLpy-2.0.3-25.fc40.s390x/usr/lib/python3.12/site-packages
creating /builddir/build/BUILDROOT/APLpy-2.0.3-25.fc40.s390x/usr/lib/python3.12/site-packages/aplpy
creating /builddir/build/BUILDROOT/APLpy-2.0.3-25.fc40.s390x/usr/lib/python3.12/site-packages/aplpy/tests
copying build/lib/aplpy/tests/coveragerc -> /builddir/build/BUILDROOT/APLpy-2.0.3-25.fc40.s390x/usr/lib/python3.12/site-packages/aplpy/tests
creating /builddir/build/BUILDROOT/APLpy-2.0.3-25.fc40.s390x/usr/lib/python3.12/site-packages/aplpy/tests/data
creating /builddir/build/BUILDROOT/APLpy-2.0.3-25.fc40.s390x/usr/lib/python3.12/site-packages/aplpy/tests/data/2d_fits
copying build/lib/aplpy/tests/data/2d_fits/1904-66_AIR.hdr -> /builddir/build/BUILDROOT/APLpy-2.0.3-25.fc40.s390x/usr/lib/python3.12/site-packages/aplpy/tests/data/2d_fits
copying build/lib/aplpy/tests/data/2d_fits/1904-66_AIT.hdr -> /builddir/build/BUILDROOT/APLpy-2.0.3-25.fc40.s390x/usr/lib/python3.12/site-packages/aplpy/tests/data/2d_fits
copying build/lib/aplpy/tests/data/2d_fits/1904-66_ARC.hdr -> /builddir/build/BUILDROOT/APLpy-2.0.3-25.fc40.s390x/usr/lib/python3.12/site-packages/aplpy/tests/data/2d_fits
copying build/lib/aplpy/tests/data/2d_fits/1904-66_AZP.hdr -> /builddir/build/BUILDROOT/APLpy-2.0.3-25.fc40.s390x/usr/lib/python3.12/site-packages/aplpy/tests/data/2d_fits
copying build/lib/aplpy/tests/data/2d_fits/1904-66_BON.hdr -> /builddir/build/BUILDROOT/APLpy-2.0.3-25.fc40.s390x/usr/lib/python3.12/site-packages/aplpy/tests/data/2d_fits
copying build/lib/aplpy/tests/data/2d_fits/1904-66_CAR.hdr -> /builddir/build/BUILDROOT/APLpy-2.0.3-25.fc40.s390x/usr/lib/python3.12/site-packages/aplpy/tests/data/2d_fits
copying build/lib/aplpy/tests/data/2d_fits/1904-66_CEA.hdr -> /builddir/build/BUILDROOT/APLpy-2.0.3-25.fc40.s390x/usr/lib/python3.12/site-packages/aplpy/tests/data/2d_fits
copying build/lib/aplpy/tests/data/2d_fits/1904-66_COD.hdr -> /builddir/build/BUILDROOT/APLpy-2.0.3-25.fc40.s390x/usr/lib/python3.12/site-packages/aplpy/tests/data/2d_fits
copying build/lib/aplpy/tests/data/2d_fits/1904-66_COE.hdr -> /builddir/build/BUILDROOT/APLpy-2.0.3-25.fc40.s390x/usr/lib/python3.12/site-packages/aplpy/tests/data/2d_fits
copying build/lib/aplpy/tests/data/2d_fits/1904-66_COO.hdr -> /builddir/build/BUILDROOT/APLpy-2.0.3-25.fc40.s390x/usr/lib/python3.12/site-packages/aplpy/tests/data/2d_fits
copying build/lib/aplpy/tests/data/2d_fits/1904-66_COP.hdr -> /builddir/build/BUILDROOT/APLpy-2.0.3-25.fc40.s390x/usr/lib/python3.12/site-packages/aplpy/tests/data/2d_fits
copying build/lib/aplpy/tests/data/2d_fits/1904-66_CSC.hdr -> /builddir/build/BUILDROOT/APLpy-2.0.3-25.fc40.s390x/usr/lib/python3.12/site-packages/aplpy/tests/data/2d_fits
copying build/lib/aplpy/tests/data/2d_fits/1904-66_CYP.hdr -> /builddir/build/BUILDROOT/APLpy-2.0.3-25.fc40.s390x/usr/lib/python3.12/site-packages/aplpy/tests/data/2d_fits
copying build/lib/aplpy/tests/data/2d_fits/1904-66_HPX.hdr -> /builddir/build/BUILDROOT/APLpy-2.0.3-25.fc40.s390x/usr/lib/python3.12/site-packages/aplpy/tests/data/2d_fits
copying build/lib/aplpy/tests/data/2d_fits/1904-66_MER.hdr -> /builddir/build/BUILDROOT/APLpy-2.0.3-25.fc40.s390x/usr/lib/python3.12/site-packages/aplpy/tests/data/2d_fits
copying build/lib/aplpy/tests/data/2d_fits/1904-66_MOL.hdr -> /builddir/build/BUILDROOT/APLpy-2.0.3-25.fc40.s390x/usr/lib/python3.12/site-packages/aplpy/tests/data/2d_fits
copying build/lib/aplpy/tests/data/2d_fits/1904-66_NCP.hdr -> /builddir/build/BUILDROOT/APLpy-2.0.3-25.fc40.s390x/usr/lib/python3.12/site-packages/aplpy/tests/data/2d_fits
copying build/lib/aplpy/tests/data/2d_fits/1904-66_PAR.hdr -> /builddir/build/BUILDROOT/APLpy-2.0.3-25.fc40.s390x/usr/lib/python3.12/site-packages/aplpy/tests/data/2d_fits
copying build/lib/aplpy/tests/data/2d_fits/1904-66_PCO.hdr -> /builddir/build/BUILDROOT/APLpy-2.0.3-25.fc40.s390x/usr/lib/python3.12/site-packages/aplpy/tests/data/2d_fits
copying build/lib/aplpy/tests/data/2d_fits/1904-66_QSC.hdr -> /builddir/build/BUILDROOT/APLpy-2.0.3-25.fc40.s390x/usr/lib/python3.12/site-packages/aplpy/tests/data/2d_fits
copying build/lib/aplpy/tests/data/2d_fits/1904-66_SFL.hdr -> /builddir/build/BUILDROOT/APLpy-2.0.3-25.fc40.s390x/usr/lib/python3.12/site-packages/aplpy/tests/data/2d_fits
copying build/lib/aplpy/tests/data/2d_fits/1904-66_SIN.hdr -> /builddir/build/BUILDROOT/APLpy-2.0.3-25.fc40.s390x/usr/lib/python3.12/site-packages/aplpy/tests/data/2d_fits
copying build/lib/aplpy/tests/data/2d_fits/1904-66_STG.hdr -> /builddir/build/BUILDROOT/APLpy-2.0.3-25.fc40.s390x/usr/lib/python3.12/site-packages/aplpy/tests/data/2d_fits
copying build/lib/aplpy/tests/data/2d_fits/1904-66_SZP.hdr -> /builddir/build/BUILDROOT/APLpy-2.0.3-25.fc40.s390x/usr/lib/python3.12/site-packages/aplpy/tests/data/2d_fits
copying build/lib/aplpy/tests/data/2d_fits/1904-66_TAN.hdr -> /builddir/build/BUILDROOT/APLpy-2.0.3-25.fc40.s390x/usr/lib/python3.12/site-packages/aplpy/tests/data/2d_fits
copying build/lib/aplpy/tests/data/2d_fits/1904-66_TSC.hdr -> /builddir/build/BUILDROOT/APLpy-2.0.3-25.fc40.s390x/usr/lib/python3.12/site-packages/aplpy/tests/data/2d_fits
copying build/lib/aplpy/tests/data/2d_fits/1904-66_ZEA.hdr -> /builddir/build/BUILDROOT/APLpy-2.0.3-25.fc40.s390x/usr/lib/python3.12/site-packages/aplpy/tests/data/2d_fits
copying build/lib/aplpy/tests/data/2d_fits/1904-66_ZPN.hdr -> /builddir/build/BUILDROOT/APLpy-2.0.3-25.fc40.s390x/usr/lib/python3.12/site-packages/aplpy/tests/data/2d_fits
copying build/lib/aplpy/tests/data/2d_fits/2MASS_k.hdr -> /builddir/build/BUILDROOT/APLpy-2.0.3-25.fc40.s390x/usr/lib/python3.12/site-packages/aplpy/tests/data/2d_fits
copying build/lib/aplpy/tests/data/2d_fits/2MASS_k_rot.hdr -> /builddir/build/BUILDROOT/APLpy-2.0.3-25.fc40.s390x/usr/lib/python3.12/site-packages/aplpy/tests/data/2d_fits
creating /builddir/build/BUILDROOT/APLpy-2.0.3-25.fc40.s390x/usr/lib/python3.12/site-packages/aplpy/tests/data/3d_fits
copying build/lib/aplpy/tests/data/3d_fits/cube.hdr -> /builddir/build/BUILDROOT/APLpy-2.0.3-25.fc40.s390x/usr/lib/python3.12/site-packages/aplpy/tests/data/3d_fits
copying build/lib/aplpy/tests/data/shapes.reg -> /builddir/build/BUILDROOT/APLpy-2.0.3-25.fc40.s390x/usr/lib/python3.12/site-packages/aplpy/tests/data
copying build/lib/aplpy/tests/data/__init__.py -> /builddir/build/BUILDROOT/APLpy-2.0.3-25.fc40.s390x/usr/lib/python3.12/site-packages/aplpy/tests/data
copying build/lib/aplpy/tests/__init__.py -> /builddir/build/BUILDROOT/APLpy-2.0.3-25.fc40.s390x/usr/lib/python3.12/site-packages/aplpy/tests
copying build/lib/aplpy/tests/helpers.py -> /builddir/build/BUILDROOT/APLpy-2.0.3-25.fc40.s390x/usr/lib/python3.12/site-packages/aplpy/tests
copying build/lib/aplpy/tests/setup_package.py -> /builddir/build/BUILDROOT/APLpy-2.0.3-25.fc40.s390x/usr/lib/python3.12/site-packages/aplpy/tests
copying build/lib/aplpy/tests/test_axis_labels.py -> /builddir/build/BUILDROOT/APLpy-2.0.3-25.fc40.s390x/usr/lib/python3.12/site-packages/aplpy/tests
copying build/lib/aplpy/tests/test_beam.py -> /builddir/build/BUILDROOT/APLpy-2.0.3-25.fc40.s390x/usr/lib/python3.12/site-packages/aplpy/tests
copying build/lib/aplpy/tests/test_colorbar.py -> /builddir/build/BUILDROOT/APLpy-2.0.3-25.fc40.s390x/usr/lib/python3.12/site-packages/aplpy/tests
copying build/lib/aplpy/tests/test_contour.py -> /builddir/build/BUILDROOT/APLpy-2.0.3-25.fc40.s390x/usr/lib/python3.12/site-packages/aplpy/tests
copying build/lib/aplpy/tests/test_convolve.py -> /builddir/build/BUILDROOT/APLpy-2.0.3-25.fc40.s390x/usr/lib/python3.12/site-packages/aplpy/tests
copying build/lib/aplpy/tests/test_downsample.py -> /builddir/build/BUILDROOT/APLpy-2.0.3-25.fc40.s390x/usr/lib/python3.12/site-packages/aplpy/tests
copying build/lib/aplpy/tests/test_frame.py -> /builddir/build/BUILDROOT/APLpy-2.0.3-25.fc40.s390x/usr/lib/python3.12/site-packages/aplpy/tests
copying build/lib/aplpy/tests/test_grid.py -> /builddir/build/BUILDROOT/APLpy-2.0.3-25.fc40.s390x/usr/lib/python3.12/site-packages/aplpy/tests
copying build/lib/aplpy/tests/test_images.py -> /builddir/build/BUILDROOT/APLpy-2.0.3-25.fc40.s390x/usr/lib/python3.12/site-packages/aplpy/tests
copying build/lib/aplpy/tests/test_init_cube.py -> /builddir/build/BUILDROOT/APLpy-2.0.3-25.fc40.s390x/usr/lib/python3.12/site-packages/aplpy/tests
copying build/lib/aplpy/tests/test_init_image.py -> /builddir/build/BUILDROOT/APLpy-2.0.3-25.fc40.s390x/usr/lib/python3.12/site-packages/aplpy/tests
copying build/lib/aplpy/tests/test_layers.py -> /builddir/build/BUILDROOT/APLpy-2.0.3-25.fc40.s390x/usr/lib/python3.12/site-packages/aplpy/tests
copying build/lib/aplpy/tests/test_misc.py -> /builddir/build/BUILDROOT/APLpy-2.0.3-25.fc40.s390x/usr/lib/python3.12/site-packages/aplpy/tests
copying build/lib/aplpy/tests/test_pixworldmarkers.py -> /builddir/build/BUILDROOT/APLpy-2.0.3-25.fc40.s390x/usr/lib/python3.12/site-packages/aplpy/tests
copying build/lib/aplpy/tests/test_rgb.py -> /builddir/build/BUILDROOT/APLpy-2.0.3-25.fc40.s390x/usr/lib/python3.12/site-packages/aplpy/tests
copying build/lib/aplpy/tests/test_save.py -> /builddir/build/BUILDROOT/APLpy-2.0.3-25.fc40.s390x/usr/lib/python3.12/site-packages/aplpy/tests
copying build/lib/aplpy/tests/test_scalebar.py -> /builddir/build/BUILDROOT/APLpy-2.0.3-25.fc40.s390x/usr/lib/python3.12/site-packages/aplpy/tests
copying build/lib/aplpy/tests/test_subplot.py -> /builddir/build/BUILDROOT/APLpy-2.0.3-25.fc40.s390x/usr/lib/python3.12/site-packages/aplpy/tests
copying build/lib/aplpy/tests/test_tick_labels.py -> /builddir/build/BUILDROOT/APLpy-2.0.3-25.fc40.s390x/usr/lib/python3.12/site-packages/aplpy/tests
copying build/lib/aplpy/tests/test_ticks.py -> /builddir/build/BUILDROOT/APLpy-2.0.3-25.fc40.s390x/usr/lib/python3.12/site-packages/aplpy/tests
copying build/lib/aplpy/tests/test_vectors.py -> /builddir/build/BUILDROOT/APLpy-2.0.3-25.fc40.s390x/usr/lib/python3.12/site-packages/aplpy/tests
copying build/lib/aplpy/__init__.py -> /builddir/build/BUILDROOT/APLpy-2.0.3-25.fc40.s390x/usr/lib/python3.12/site-packages/aplpy
copying build/lib/aplpy/_astropy_init.py -> /builddir/build/BUILDROOT/APLpy-2.0.3-25.fc40.s390x/usr/lib/python3.12/site-packages/aplpy
copying build/lib/aplpy/axis_labels.py -> /builddir/build/BUILDROOT/APLpy-2.0.3-25.fc40.s390x/usr/lib/python3.12/site-packages/aplpy
copying build/lib/aplpy/colorbar.py -> /builddir/build/BUILDROOT/APLpy-2.0.3-25.fc40.s390x/usr/lib/python3.12/site-packages/aplpy
copying build/lib/aplpy/compat.py -> /builddir/build/BUILDROOT/APLpy-2.0.3-25.fc40.s390x/usr/lib/python3.12/site-packages/aplpy
copying build/lib/aplpy/convolve_util.py -> /builddir/build/BUILDROOT/APLpy-2.0.3-25.fc40.s390x/usr/lib/python3.12/site-packages/aplpy
copying build/lib/aplpy/frame.py -> /builddir/build/BUILDROOT/APLpy-2.0.3-25.fc40.s390x/usr/lib/python3.12/site-packages/aplpy
copying build/lib/aplpy/grid.py -> /builddir/build/BUILDROOT/APLpy-2.0.3-25.fc40.s390x/usr/lib/python3.12/site-packages/aplpy
copying build/lib/aplpy/header.py -> /builddir/build/BUILDROOT/APLpy-2.0.3-25.fc40.s390x/usr/lib/python3.12/site-packages/aplpy
copying build/lib/aplpy/layers.py -> /builddir/build/BUILDROOT/APLpy-2.0.3-25.fc40.s390x/usr/lib/python3.12/site-packages/aplpy
copying build/lib/aplpy/overlays.py -> /builddir/build/BUILDROOT/APLpy-2.0.3-25.fc40.s390x/usr/lib/python3.12/site-packages/aplpy
copying build/lib/aplpy/regions.py -> /builddir/build/BUILDROOT/APLpy-2.0.3-25.fc40.s390x/usr/lib/python3.12/site-packages/aplpy
copying build/lib/aplpy/rgb.py -> /builddir/build/BUILDROOT/APLpy-2.0.3-25.fc40.s390x/usr/lib/python3.12/site-packages/aplpy
copying build/lib/aplpy/slicer.py -> /builddir/build/BUILDROOT/APLpy-2.0.3-25.fc40.s390x/usr/lib/python3.12/site-packages/aplpy
copying build/lib/aplpy/tick_labels.py -> /builddir/build/BUILDROOT/APLpy-2.0.3-25.fc40.s390x/usr/lib/python3.12/site-packages/aplpy
copying build/lib/aplpy/ticks.py -> /builddir/build/BUILDROOT/APLpy-2.0.3-25.fc40.s390x/usr/lib/python3.12/site-packages/aplpy
copying build/lib/aplpy/version.py -> /builddir/build/BUILDROOT/APLpy-2.0.3-25.fc40.s390x/usr/lib/python3.12/site-packages/aplpy
copying build/lib/aplpy/core.py -> /builddir/build/BUILDROOT/APLpy-2.0.3-25.fc40.s390x/usr/lib/python3.12/site-packages/aplpy
copying build/lib/aplpy/decorators.py -> /builddir/build/BUILDROOT/APLpy-2.0.3-25.fc40.s390x/usr/lib/python3.12/site-packages/aplpy
copying build/lib/aplpy/conftest.py -> /builddir/build/BUILDROOT/APLpy-2.0.3-25.fc40.s390x/usr/lib/python3.12/site-packages/aplpy
byte-compiling /builddir/build/BUILDROOT/APLpy-2.0.3-25.fc40.s390x/usr/lib/python3.12/site-packages/aplpy/tests/data/__init__.py to __init__.cpython-312.pyc
byte-compiling /builddir/build/BUILDROOT/APLpy-2.0.3-25.fc40.s390x/usr/lib/python3.12/site-packages/aplpy/tests/__init__.py to __init__.cpython-312.pyc
byte-compiling /builddir/build/BUILDROOT/APLpy-2.0.3-25.fc40.s390x/usr/lib/python3.12/site-packages/aplpy/tests/helpers.py to helpers.cpython-312.pyc
byte-compiling /builddir/build/BUILDROOT/APLpy-2.0.3-25.fc40.s390x/usr/lib/python3.12/site-packages/aplpy/tests/setup_package.py to setup_package.cpython-312.pyc
byte-compiling /builddir/build/BUILDROOT/APLpy-2.0.3-25.fc40.s390x/usr/lib/python3.12/site-packages/aplpy/tests/test_axis_labels.py to test_axis_labels.cpython-312.pyc
byte-compiling /builddir/build/BUILDROOT/APLpy-2.0.3-25.fc40.s390x/usr/lib/python3.12/site-packages/aplpy/tests/test_beam.py to test_beam.cpython-312.pyc
byte-compiling /builddir/build/BUILDROOT/APLpy-2.0.3-25.fc40.s390x/usr/lib/python3.12/site-packages/aplpy/tests/test_colorbar.py to test_colorbar.cpython-312.pyc
byte-compiling /builddir/build/BUILDROOT/APLpy-2.0.3-25.fc40.s390x/usr/lib/python3.12/site-packages/aplpy/tests/test_contour.py to test_contour.cpython-312.pyc
byte-compiling /builddir/build/BUILDROOT/APLpy-2.0.3-25.fc40.s390x/usr/lib/python3.12/site-packages/aplpy/tests/test_convolve.py to test_convolve.cpython-312.pyc
byte-compiling /builddir/build/BUILDROOT/APLpy-2.0.3-25.fc40.s390x/usr/lib/python3.12/site-packages/aplpy/tests/test_downsample.py to test_downsample.cpython-312.pyc
byte-compiling /builddir/build/BUILDROOT/APLpy-2.0.3-25.fc40.s390x/usr/lib/python3.12/site-packages/aplpy/tests/test_frame.py to test_frame.cpython-312.pyc
byte-compiling /builddir/build/BUILDROOT/APLpy-2.0.3-25.fc40.s390x/usr/lib/python3.12/site-packages/aplpy/tests/test_grid.py to test_grid.cpython-312.pyc
byte-compiling /builddir/build/BUILDROOT/APLpy-2.0.3-25.fc40.s390x/usr/lib/python3.12/site-packages/aplpy/tests/test_images.py to test_images.cpython-312.pyc
byte-compiling /builddir/build/BUILDROOT/APLpy-2.0.3-25.fc40.s390x/usr/lib/python3.12/site-packages/aplpy/tests/test_init_cube.py to test_init_cube.cpython-312.pyc
byte-compiling /builddir/build/BUILDROOT/APLpy-2.0.3-25.fc40.s390x/usr/lib/python3.12/site-packages/aplpy/tests/test_init_image.py to test_init_image.cpython-312.pyc
byte-compiling /builddir/build/BUILDROOT/APLpy-2.0.3-25.fc40.s390x/usr/lib/python3.12/site-packages/aplpy/tests/test_layers.py to test_layers.cpython-312.pyc
byte-compiling /builddir/build/BUILDROOT/APLpy-2.0.3-25.fc40.s390x/usr/lib/python3.12/site-packages/aplpy/tests/test_misc.py to test_misc.cpython-312.pyc
byte-compiling /builddir/build/BUILDROOT/APLpy-2.0.3-25.fc40.s390x/usr/lib/python3.12/site-packages/aplpy/tests/test_pixworldmarkers.py to test_pixworldmarkers.cpython-312.pyc
byte-compiling /builddir/build/BUILDROOT/APLpy-2.0.3-25.fc40.s390x/usr/lib/python3.12/site-packages/aplpy/tests/test_rgb.py to test_rgb.cpython-312.pyc
byte-compiling /builddir/build/BUILDROOT/APLpy-2.0.3-25.fc40.s390x/usr/lib/python3.12/site-packages/aplpy/tests/test_save.py to test_save.cpython-312.pyc
byte-compiling /builddir/build/BUILDROOT/APLpy-2.0.3-25.fc40.s390x/usr/lib/python3.12/site-packages/aplpy/tests/test_scalebar.py to test_scalebar.cpython-312.pyc
byte-compiling /builddir/build/BUILDROOT/APLpy-2.0.3-25.fc40.s390x/usr/lib/python3.12/site-packages/aplpy/tests/test_subplot.py to test_subplot.cpython-312.pyc
byte-compiling /builddir/build/BUILDROOT/APLpy-2.0.3-25.fc40.s390x/usr/lib/python3.12/site-packages/aplpy/tests/test_tick_labels.py to test_tick_labels.cpython-312.pyc
byte-compiling /builddir/build/BUILDROOT/APLpy-2.0.3-25.fc40.s390x/usr/lib/python3.12/site-packages/aplpy/tests/test_ticks.py to test_ticks.cpython-312.pyc
byte-compiling /builddir/build/BUILDROOT/APLpy-2.0.3-25.fc40.s390x/usr/lib/python3.12/site-packages/aplpy/tests/test_vectors.py to test_vectors.cpython-312.pyc
byte-compiling /builddir/build/BUILDROOT/APLpy-2.0.3-25.fc40.s390x/usr/lib/python3.12/site-packages/aplpy/__init__.py to __init__.cpython-312.pyc
byte-compiling /builddir/build/BUILDROOT/APLpy-2.0.3-25.fc40.s390x/usr/lib/python3.12/site-packages/aplpy/_astropy_init.py to _astropy_init.cpython-312.pyc
byte-compiling /builddir/build/BUILDROOT/APLpy-2.0.3-25.fc40.s390x/usr/lib/python3.12/site-packages/aplpy/axis_labels.py to axis_labels.cpython-312.pyc
byte-compiling /builddir/build/BUILDROOT/APLpy-2.0.3-25.fc40.s390x/usr/lib/python3.12/site-packages/aplpy/colorbar.py to colorbar.cpython-312.pyc
byte-compiling /builddir/build/BUILDROOT/APLpy-2.0.3-25.fc40.s390x/usr/lib/python3.12/site-packages/aplpy/compat.py to compat.cpython-312.pyc
byte-compiling /builddir/build/BUILDROOT/APLpy-2.0.3-25.fc40.s390x/usr/lib/python3.12/site-packages/aplpy/convolve_util.py to convolve_util.cpython-312.pyc
byte-compiling /builddir/build/BUILDROOT/APLpy-2.0.3-25.fc40.s390x/usr/lib/python3.12/site-packages/aplpy/frame.py to frame.cpython-312.pyc
byte-compiling /builddir/build/BUILDROOT/APLpy-2.0.3-25.fc40.s390x/usr/lib/python3.12/site-packages/aplpy/grid.py to grid.cpython-312.pyc
byte-compiling /builddir/build/BUILDROOT/APLpy-2.0.3-25.fc40.s390x/usr/lib/python3.12/site-packages/aplpy/header.py to header.cpython-312.pyc
byte-compiling /builddir/build/BUILDROOT/APLpy-2.0.3-25.fc40.s390x/usr/lib/python3.12/site-packages/aplpy/layers.py to layers.cpython-312.pyc
byte-compiling /builddir/build/BUILDROOT/APLpy-2.0.3-25.fc40.s390x/usr/lib/python3.12/site-packages/aplpy/overlays.py to overlays.cpython-312.pyc
byte-compiling /builddir/build/BUILDROOT/APLpy-2.0.3-25.fc40.s390x/usr/lib/python3.12/site-packages/aplpy/regions.py to regions.cpython-312.pyc
byte-compiling /builddir/build/BUILDROOT/APLpy-2.0.3-25.fc40.s390x/usr/lib/python3.12/site-packages/aplpy/rgb.py to rgb.cpython-312.pyc
byte-compiling /builddir/build/BUILDROOT/APLpy-2.0.3-25.fc40.s390x/usr/lib/python3.12/site-packages/aplpy/slicer.py to slicer.cpython-312.pyc
byte-compiling /builddir/build/BUILDROOT/APLpy-2.0.3-25.fc40.s390x/usr/lib/python3.12/site-packages/aplpy/tick_labels.py to tick_labels.cpython-312.pyc
byte-compiling /builddir/build/BUILDROOT/APLpy-2.0.3-25.fc40.s390x/usr/lib/python3.12/site-packages/aplpy/ticks.py to ticks.cpython-312.pyc
byte-compiling /builddir/build/BUILDROOT/APLpy-2.0.3-25.fc40.s390x/usr/lib/python3.12/site-packages/aplpy/version.py to version.cpython-312.pyc
byte-compiling /builddir/build/BUILDROOT/APLpy-2.0.3-25.fc40.s390x/usr/lib/python3.12/site-packages/aplpy/core.py to core.cpython-312.pyc
byte-compiling /builddir/build/BUILDROOT/APLpy-2.0.3-25.fc40.s390x/usr/lib/python3.12/site-packages/aplpy/decorators.py to decorators.cpython-312.pyc
byte-compiling /builddir/build/BUILDROOT/APLpy-2.0.3-25.fc40.s390x/usr/lib/python3.12/site-packages/aplpy/conftest.py to conftest.cpython-312.pyc
writing byte-compilation script '/tmp/tmp48e5ztfj.py'
/usr/bin/python3 /tmp/tmp48e5ztfj.py
removing /tmp/tmp48e5ztfj.py
running install_egg_info
running egg_info
creating APLpy.egg-info
writing APLpy.egg-info/PKG-INFO
writing dependency_links to APLpy.egg-info/dependency_links.txt
writing requirements to APLpy.egg-info/requires.txt
writing top-level names to APLpy.egg-info/top_level.txt
writing manifest file 'APLpy.egg-info/SOURCES.txt'
reading manifest file 'APLpy.egg-info/SOURCES.txt'
adding license file 'LICENSE.md'
writing manifest file 'APLpy.egg-info/SOURCES.txt'
Copying APLpy.egg-info to /builddir/build/BUILDROOT/APLpy-2.0.3-25.fc40.s390x/usr/lib/python3.12/site-packages/APLpy-2.0.3-py3.12.egg-info
running install_scripts
+ rm -rfv /builddir/build/BUILDROOT/APLpy-2.0.3-25.fc40.s390x/usr/bin/__pycache__
+ /usr/bin/find-debuginfo -j2 --strict-build-id -m -i --build-id-seed 2.0.3-25.fc40 --unique-debug-suffix -2.0.3-25.fc40.s390x --unique-debug-src-base APLpy-2.0.3-25.fc40.s390x --run-dwz --dwz-low-mem-die-limit 10000000 --dwz-max-die-limit 50000000 -S debugsourcefiles.list /builddir/build/BUILD/APLpy-2.0.3
find-debuginfo: starting
Extracting debug info from 0 files
Creating .debug symlinks for symlinks to ELF files
find: ‘debug’: No such file or directory
find-debuginfo: done
+ /usr/lib/rpm/check-buildroot
+ /usr/lib/rpm/redhat/brp-ldconfig
+ /usr/lib/rpm/brp-compress
+ /usr/lib/rpm/redhat/brp-strip-lto /usr/bin/strip
+ /usr/lib/rpm/brp-strip-static-archive /usr/bin/strip
+ /usr/lib/rpm/check-rpaths
+ /usr/lib/rpm/redhat/brp-mangle-shebangs
+ /usr/lib/rpm/brp-remove-la-files
+ env /usr/lib/rpm/redhat/brp-python-bytecompile '' 1 0 -j2
Bytecompiling .py files below /builddir/build/BUILDROOT/APLpy-2.0.3-25.fc40.s390x/usr/lib/python3.12 using python3.12
+ /usr/lib/rpm/redhat/brp-python-hardlink
Executing(%check): /bin/sh -e /var/tmp/rpm-tmp.ygRPGd
+ umask 022
+ cd /builddir/build/BUILD
+ CFLAGS='-O2 -flto=auto -ffat-lto-objects -fexceptions -g -grecord-gcc-switches -pipe -Wall -Werror=format-security -Wp,-U_FORTIFY_SOURCE,-D_FORTIFY_SOURCE=3 -Wp,-D_GLIBCXX_ASSERTIONS -specs=/usr/lib/rpm/redhat/redhat-hardened-cc1 -fstack-protector-strong -specs=/usr/lib/rpm/redhat/redhat-annobin-cc1  -m64 -march=z13 -mtune=z14 -fasynchronous-unwind-tables -fstack-clash-protection '
+ export CFLAGS
+ CXXFLAGS='-O2 -flto=auto -ffat-lto-objects -fexceptions -g -grecord-gcc-switches -pipe -Wall -Werror=format-security -Wp,-U_FORTIFY_SOURCE,-D_FORTIFY_SOURCE=3 -Wp,-D_GLIBCXX_ASSERTIONS -specs=/usr/lib/rpm/redhat/redhat-hardened-cc1 -fstack-protector-strong -specs=/usr/lib/rpm/redhat/redhat-annobin-cc1  -m64 -march=z13 -mtune=z14 -fasynchronous-unwind-tables -fstack-clash-protection '
+ export CXXFLAGS
+ FFLAGS='-O2 -flto=auto -ffat-lto-objects -fexceptions -g -grecord-gcc-switches -pipe -Wall -Wp,-U_FORTIFY_SOURCE,-D_FORTIFY_SOURCE=3 -Wp,-D_GLIBCXX_ASSERTIONS -specs=/usr/lib/rpm/redhat/redhat-hardened-cc1 -fstack-protector-strong -specs=/usr/lib/rpm/redhat/redhat-annobin-cc1  -m64 -march=z13 -mtune=z14 -fasynchronous-unwind-tables -fstack-clash-protection -I/usr/lib64/gfortran/modules '
+ export FFLAGS
+ FCFLAGS='-O2 -flto=auto -ffat-lto-objects -fexceptions -g -grecord-gcc-switches -pipe -Wall -Wp,-U_FORTIFY_SOURCE,-D_FORTIFY_SOURCE=3 -Wp,-D_GLIBCXX_ASSERTIONS -specs=/usr/lib/rpm/redhat/redhat-hardened-cc1 -fstack-protector-strong -specs=/usr/lib/rpm/redhat/redhat-annobin-cc1  -m64 -march=z13 -mtune=z14 -fasynchronous-unwind-tables -fstack-clash-protection -I/usr/lib64/gfortran/modules '
+ export FCFLAGS
+ VALAFLAGS=-g
+ export VALAFLAGS
+ RUSTFLAGS='-Copt-level=3 -Cdebuginfo=2 -Ccodegen-units=1 -Cstrip=none -Clink-arg=-Wl,-z,relro -Clink-arg=-Wl,-z,now -Clink-arg=-specs=/usr/lib/rpm/redhat/redhat-package-notes --cap-lints=warn'
+ export RUSTFLAGS
+ LDFLAGS='-Wl,-z,relro -Wl,--as-needed   -Wl,-z,now -specs=/usr/lib/rpm/redhat/redhat-hardened-ld-errors -specs=/usr/lib/rpm/redhat/redhat-hardened-ld -specs=/usr/lib/rpm/redhat/redhat-annobin-cc1  -Wl,--build-id=sha1 -specs=/usr/lib/rpm/redhat/redhat-package-notes '
+ export LDFLAGS
+ LT_SYS_LIBRARY_PATH=/usr/lib64:
+ export LT_SYS_LIBRARY_PATH
+ CC=gcc
+ export CC
+ CXX=g++
+ export CXX
+ cd APLpy-2.0.3
+ mkdir matplotlib
+ touch matplotlib/matplotlibrc
++ pwd
+ export XDG_CONFIG_HOME=/builddir/build/BUILD/APLpy-2.0.3
+ XDG_CONFIG_HOME=/builddir/build/BUILD/APLpy-2.0.3
+ export PYTHONDONTWRITEBYTECODE=1
+ PYTHONDONTWRITEBYTECODE=1
+ export 'PYTEST_ADDOPTS=-p no:cacheprovider'
+ PYTEST_ADDOPTS='-p no:cacheprovider'
+ pushd /builddir/build/BUILDROOT/APLpy-2.0.3-25.fc40.s390x//usr/lib/python3.12/site-packages
~/build/BUILDROOT/APLpy-2.0.3-25.fc40.s390x/usr/lib/python3.12/site-packages ~/build/BUILD/APLpy-2.0.3
+ pytest-3.12 aplpy
============================= test session starts ==============================
platform linux -- Python 3.12.1, pytest-7.4.3, pluggy-1.3.0
rootdir: /builddir/build/BUILDROOT/APLpy-2.0.3-25.fc40.s390x/usr/lib/python3.12/site-packages
plugins: astropy-header-0.2.2
collected 259 items

aplpy/tests/test_axis_labels.py ......                                   [  2%]
aplpy/tests/test_beam.py .............................                   [ 13%]
aplpy/tests/test_colorbar.py ........                                    [ 16%]
aplpy/tests/test_contour.py ..                                           [ 17%]
aplpy/tests/test_convolve.py .....                                       [ 19%]
aplpy/tests/test_downsample.py .                                         [ 19%]
aplpy/tests/test_frame.py ..                                             [ 20%]
aplpy/tests/test_grid.py .......                                         [ 23%]
aplpy/tests/test_images.py ........F...                                  [ 27%]
aplpy/tests/test_init_cube.py ............................x              [ 38%]
aplpy/tests/test_init_image.py ......................................... [ 54%]
...................................                                      [ 68%]
aplpy/tests/test_layers.py ..                                            [ 69%]
aplpy/tests/test_misc.py .F                                              [ 69%]
aplpy/tests/test_pixworldmarkers.py ..............                       [ 75%]
aplpy/tests/test_rgb.py .FFFF                                            [ 77%]
aplpy/tests/test_save.py .....F.....F.....F.....F                        [ 86%]
aplpy/tests/test_scalebar.py ...............                             [ 92%]
aplpy/tests/test_subplot.py ......                                       [ 94%]
aplpy/tests/test_tick_labels.py ......                                   [ 96%]
aplpy/tests/test_ticks.py ......                                         [ 99%]
aplpy/tests/test_vectors.py ..                                           [100%]

=================================== FAILURES ===================================
____________________________ TestBasic.test_regions ____________________________

region_file = '/builddir/build/BUILDROOT/APLpy-2.0.3-25.fc40.s390x/usr/lib/python3.12/site-packages/aplpy/tests/data/shapes.reg'
header = WCSAXES =                    2 / Number of coordinate axes                      
CRPIX1  =                361.0 / Pixe...                                      
NAXIS2  =                  720                                                  
zorder = 3, kwargs = {}

    def ds9(region_file, header, zorder=3, **kwargs):
        """
        Wrapper to return a PatchCollection given a ds9 region file
        and a fits header.
    
        zorder - defaults to 3 so that regions are on top of contours
        """
    
        try:
>           import pyregion
E           ModuleNotFoundError: No module named 'pyregion'

aplpy/regions.py:88: ModuleNotFoundError

During handling of the above exception, another exception occurred:

self = <aplpy.tests.test_images.TestBasic object at 0x3ff73a78440>

    @pytest.mark.remote_data
    @pytest.mark.mpl_image_compare(style={}, savefig_kwargs={'adjust_bbox': False}, baseline_dir=baseline_dir, tolerance=5)
    def test_regions(self):
        f = FITSFigure(self.filename_2, figsize=(7, 5))
    
        # Force aspect ratio
        f.show_grayscale()
        f.hide_grayscale()
    
>       f.show_regions(os.path.join(DATADIR, 'shapes.reg'))

aplpy/tests/test_images.py:205: 
_ _ _ _ _ _ _ _ _ _ _ _ _ _ _ _ _ _ _ _ _ _ _ _ _ _ _ _ _ _ _ _ _ _ _ _ _ _ _ _ 
aplpy/decorators.py:28: in wrapper
    return f(*args, **kwargs)
aplpy/regions.py:64: in show_regions
    PC, TC = ds9(region_file, flatten_header(self._header), **kwargs)
_ _ _ _ _ _ _ _ _ _ _ _ _ _ _ _ _ _ _ _ _ _ _ _ _ _ _ _ _ _ _ _ _ _ _ _ _ _ _ _ 

region_file = '/builddir/build/BUILDROOT/APLpy-2.0.3-25.fc40.s390x/usr/lib/python3.12/site-packages/aplpy/tests/data/shapes.reg'
header = WCSAXES =                    2 / Number of coordinate axes                      
CRPIX1  =                361.0 / Pixe...                                      
NAXIS2  =                  720                                                  
zorder = 3, kwargs = {}

    def ds9(region_file, header, zorder=3, **kwargs):
        """
        Wrapper to return a PatchCollection given a ds9 region file
        and a fits header.
    
        zorder - defaults to 3 so that regions are on top of contours
        """
    
        try:
            import pyregion
        except Exception:
>           raise ImportError("The pyregion package is required to load region files")
E           ImportError: The pyregion package is required to load region files

aplpy/regions.py:90: ImportError
----------------------------- Captured stdout call -----------------------------
INFO: Auto-setting vmin to  0.000e+00 [aplpy.core]
INFO: Auto-setting vmax to  0.000e+00 [aplpy.core]
------------------------------ Captured log call -------------------------------
INFO     astropy:core.py:725 Auto-setting vmin to  0.000e+00
INFO     astropy:core.py:730 Auto-setting vmax to  0.000e+00
________________________________ test_stretches ________________________________

    def test_stretches():
    
        # Regression test to make sure none of the stretches crash
    
        data = np.arange(256).reshape((16, 16))
        f = FITSFigure(data)
        f.show_grayscale()
        f.show_grayscale(stretch='linear')
        f.show_grayscale(stretch='sqrt')
        f.show_grayscale(stretch='log')
>       f.show_grayscale(stretch='arcsinh')

aplpy/tests/test_misc.py:38: 
_ _ _ _ _ _ _ _ _ _ _ _ _ _ _ _ _ _ _ _ _ _ _ _ _ _ _ _ _ _ _ _ _ _ _ _ _ _ _ _ 
aplpy/decorators.py:28: in wrapper
    return f(*args, **kwargs)
aplpy/core.py:594: in show_grayscale
    self.show_colorscale(vmin=vmin, vmid=vmid, vmax=vmax,
aplpy/decorators.py:28: in wrapper
    return f(*args, **kwargs)
aplpy/core.py:717: in show_colorscale
    normalizer = simple_norm(self._data, stretch=stretch, power=exponent,
aplpy/compat.py:42: in simple_norm
    stretch = AsinhStretch(asinh_a)
_ _ _ _ _ _ _ _ _ _ _ _ _ _ _ _ _ _ _ _ _ _ _ _ _ _ _ _ _ _ _ _ _ _ _ _ _ _ _ _ 

self = <astropy.visualization.stretch.AsinhStretch object at 0x3ff72aff0e0>
a = -0.03333333333333333

    def __init__(self, a=0.1):
        super().__init__()
        if a <= 0 or a > 1:
>           raise ValueError("a must be > 0 and <= 1")
E           ValueError: a must be > 0 and <= 1

/usr/lib64/python3.12/site-packages/astropy/visualization/stretch.py:502: ValueError
----------------------------- Captured stdout call -----------------------------
INFO: Auto-setting vmin to -2.474e+01 [aplpy.core]
INFO: Auto-setting vmax to  2.823e+02 [aplpy.core]
INFO: Auto-setting vmin to -2.474e+01 [aplpy.core]
INFO: Auto-setting vmax to  2.823e+02 [aplpy.core]
INFO: Auto-setting vmin to  6.375e-01 [aplpy.core]
INFO: Auto-setting vmax to  2.544e+02 [aplpy.core]
INFO: Auto-setting vmin to  6.375e-01 [aplpy.core]
INFO: Auto-setting vmax to  2.544e+02 [aplpy.core]
----------------------------- Captured stderr call -----------------------------
WARNING: No WCS information found in header - using pixel coordinates [aplpy.header]
------------------------------ Captured log call -------------------------------
WARNING  astropy:header.py:23 No WCS information found in header - using pixel coordinates
INFO     astropy:core.py:725 Auto-setting vmin to -2.474e+01
INFO     astropy:core.py:730 Auto-setting vmax to  2.823e+02
INFO     astropy:core.py:725 Auto-setting vmin to -2.474e+01
INFO     astropy:core.py:730 Auto-setting vmax to  2.823e+02
INFO     astropy:core.py:725 Auto-setting vmin to  6.375e-01
INFO     astropy:core.py:730 Auto-setting vmax to  2.544e+02
INFO     astropy:core.py:725 Auto-setting vmin to  6.375e-01
INFO     astropy:core.py:730 Auto-setting vmax to  2.544e+02
____________________________ TestRGB.test_rgb[True] ____________________________

self = <aplpy.core.FITSFigure object at 0x3ff7309db20>
data = '/tmp/pytest-of-mockbuild/pytest-0/test_rgb_True_0/rgb.png', hdu = 0
figure = None, subplot = (1, 1, 1), downsample = False, north = False
convention = None, dimensions = [0, 1], slices = [], auto_refresh = None
kwargs = {'figsize': (7, 5)}
Image = <module 'PIL.Image' from '/usr/lib64/python3.12/site-packages/PIL/Image.py'>

    @auto_refresh
    def __init__(self, data, hdu=0, figure=None, subplot=(1, 1, 1),
                 downsample=False, north=False, convention=None,
                 dimensions=[0, 1], slices=[], auto_refresh=None,
                 **kwargs):
    
        self._wcsaxes_slices = ('x', 'y')
    
        if 'figsize' not in kwargs:
            kwargs['figsize'] = (10, 9)
    
        # Set the grid type
        if len(slices) > 0:
            self.grid_type = 'contours'
        else:
            self.grid_type = 'lines'
    
        if (isinstance(data, str) and
                data.split('.')[-1].lower() in ['png', 'jpg', 'tif']):
    
            try:
                from PIL import Image
            except ImportError:
                try:
                    import Image
                except ImportError:
                    raise ImportError("The Python Imaging Library (PIL) is "
                                      "required to read in RGB images")
    
            try:
>               import pyavm
E               ModuleNotFoundError: No module named 'pyavm'

aplpy/core.py:166: ModuleNotFoundError

During handling of the above exception, another exception occurred:

self = <aplpy.tests.test_rgb.TestRGB object at 0x3ff736d51f0>
tmpdir = local('/tmp/pytest-of-mockbuild/pytest-0/test_rgb_True_0')
embed_avm_tags = True

    @pytest.mark.remote_data
    @pytest.mark.mpl_image_compare(style={}, savefig_kwargs={'adjust_bbox': False},
                                   baseline_dir=baseline_dir, tolerance=7.5,
                                   filename='test_rgb.png')
    @pytest.mark.parametrize('embed_avm_tags', (False, True))
    def test_rgb(self, tmpdir, embed_avm_tags):
    
        # Regression test to check that RGB recenter works properly
    
        r_file = tmpdir.join('r.fits').strpath
        g_file = tmpdir.join('g.fits').strpath
        b_file = tmpdir.join('b.fits').strpath
        rgb_file = tmpdir.join('rgb.png').strpath
    
        np.random.seed(12345)
    
        header = fits.Header.fromtextfile(HEADER)
    
        r = fits.PrimaryHDU(np.random.random((12, 12)), header)
        r.writeto(r_file)
    
        g = fits.PrimaryHDU(np.random.random((12, 12)), header)
        g.writeto(g_file)
    
        b = fits.PrimaryHDU(np.random.random((12, 12)), header)
        b.writeto(b_file)
    
        make_rgb_image([r_file, g_file, b_file], rgb_file, embed_avm_tags=embed_avm_tags)
    
        if embed_avm_tags:
>           f = FITSFigure(rgb_file, figsize=(7, 5))

aplpy/tests/test_rgb.py:54: 
_ _ _ _ _ _ _ _ _ _ _ _ _ _ _ _ _ _ _ _ _ _ _ _ _ _ _ _ _ _ _ _ _ _ _ _ _ _ _ _ 
aplpy/decorators.py:28: in wrapper
    return f(*args, **kwargs)
_ _ _ _ _ _ _ _ _ _ _ _ _ _ _ _ _ _ _ _ _ _ _ _ _ _ _ _ _ _ _ _ _ _ _ _ _ _ _ _ 

self = <aplpy.core.FITSFigure object at 0x3ff7309db20>
data = '/tmp/pytest-of-mockbuild/pytest-0/test_rgb_True_0/rgb.png', hdu = 0
figure = None, subplot = (1, 1, 1), downsample = False, north = False
convention = None, dimensions = [0, 1], slices = [], auto_refresh = None
kwargs = {'figsize': (7, 5)}
Image = <module 'PIL.Image' from '/usr/lib64/python3.12/site-packages/PIL/Image.py'>

    @auto_refresh
    def __init__(self, data, hdu=0, figure=None, subplot=(1, 1, 1),
                 downsample=False, north=False, convention=None,
                 dimensions=[0, 1], slices=[], auto_refresh=None,
                 **kwargs):
    
        self._wcsaxes_slices = ('x', 'y')
    
        if 'figsize' not in kwargs:
            kwargs['figsize'] = (10, 9)
    
        # Set the grid type
        if len(slices) > 0:
            self.grid_type = 'contours'
        else:
            self.grid_type = 'lines'
    
        if (isinstance(data, str) and
                data.split('.')[-1].lower() in ['png', 'jpg', 'tif']):
    
            try:
                from PIL import Image
            except ImportError:
                try:
                    import Image
                except ImportError:
                    raise ImportError("The Python Imaging Library (PIL) is "
                                      "required to read in RGB images")
    
            try:
                import pyavm
            except ImportError:
>               raise ImportError("PyAVM is required to read in AVM "
                                  "meta-data from RGB images")
E               ImportError: PyAVM is required to read in AVM meta-data from RGB images

aplpy/core.py:168: ImportError
----------------------------- Captured stdout call -----------------------------
INFO: Red: [aplpy.rgb]
INFO: vmin =  1.079e-02 (auto) [aplpy.rgb]
INFO: vmax =  9.866e-01 (auto) [aplpy.rgb]
INFO: Green: [aplpy.rgb]
INFO: vmin =  3.711e-03 (auto) [aplpy.rgb]
INFO: vmax =  9.931e-01 (auto) [aplpy.rgb]
INFO: Blue: [aplpy.rgb]
INFO: vmin =  1.987e-03 (auto) [aplpy.rgb]
INFO: vmax =  9.966e-01 (auto) [aplpy.rgb]
------------------------------ Captured log call -------------------------------
INFO     astropy:rgb.py:176 Red:
INFO     astropy:rgb.py:28 vmin =  1.079e-02 (auto)
INFO     astropy:rgb.py:34 vmax =  9.866e-01 (auto)
INFO     astropy:rgb.py:181 Green:
INFO     astropy:rgb.py:28 vmin =  3.711e-03 (auto)
INFO     astropy:rgb.py:34 vmax =  9.931e-01 (auto)
INFO     astropy:rgb.py:189 Blue:
INFO     astropy:rgb.py:28 vmin =  1.987e-03 (auto)
INFO     astropy:rgb.py:34 vmax =  9.966e-01 (auto)
_____________________ TestRGB.test_make_rgb_cube[default] ______________________

self = <aplpy.core.FITSFigure object at 0x3ff73311070>
data = '/tmp/pytest-of-mockbuild/pytest-0/test_make_rgb_cube_default_0/rgb.png'
hdu = 0, figure = None, subplot = (1, 1, 1), downsample = False, north = False
convention = None, dimensions = [0, 1], slices = [], auto_refresh = None
kwargs = {'figsize': (3, 3)}
Image = <module 'PIL.Image' from '/usr/lib64/python3.12/site-packages/PIL/Image.py'>

    @auto_refresh
    def __init__(self, data, hdu=0, figure=None, subplot=(1, 1, 1),
                 downsample=False, north=False, convention=None,
                 dimensions=[0, 1], slices=[], auto_refresh=None,
                 **kwargs):
    
        self._wcsaxes_slices = ('x', 'y')
    
        if 'figsize' not in kwargs:
            kwargs['figsize'] = (10, 9)
    
        # Set the grid type
        if len(slices) > 0:
            self.grid_type = 'contours'
        else:
            self.grid_type = 'lines'
    
        if (isinstance(data, str) and
                data.split('.')[-1].lower() in ['png', 'jpg', 'tif']):
    
            try:
                from PIL import Image
            except ImportError:
                try:
                    import Image
                except ImportError:
                    raise ImportError("The Python Imaging Library (PIL) is "
                                      "required to read in RGB images")
    
            try:
>               import pyavm
E               ModuleNotFoundError: No module named 'pyavm'

aplpy/core.py:166: ModuleNotFoundError

During handling of the above exception, another exception occurred:

self = <aplpy.tests.test_rgb.TestRGB object at 0x3ff736d5490>
tmpdir = local('/tmp/pytest-of-mockbuild/pytest-0/test_make_rgb_cube_default_0')
north = 'default'

    @pytest.mark.remote_data
    @pytest.mark.parametrize('north', ['default', 'galactic', 'false'])
    @pytest.mark.mpl_image_compare(style={}, savefig_kwargs={'adjust_bbox': False},
                                   baseline_dir=baseline_dir, tolerance=7.5)
    def test_make_rgb_cube(self, tmpdir, north):
    
        # Regression test to check that RGB recenter works properly
    
        header = generate_header(os.path.join(ROOT, 'data', '2d_fits', '2MASS_k_rot.hdr'))
    
        header['CRPIX1'] = 6.5
        header['CRPIX2'] = 6.5
    
        header_r = header.copy()
        header_r['CROTA2'] = 5
        header_g = header.copy()
        header_g['CROTA2'] = 35
        header_b = header.copy()
        header_b['CROTA2'] = 70
    
        r_file = tmpdir.join('r.fits').strpath
        g_file = tmpdir.join('g.fits').strpath
        b_file = tmpdir.join('b.fits').strpath
        rgb_cube = tmpdir.join('rgb.fits').strpath
        rgb_file = tmpdir.join('rgb.png').strpath
    
        header = fits.Header.fromtextfile(HEADER)
    
        r = fits.PrimaryHDU(np.ones((128, 128)), header_r)
        r.writeto(r_file)
    
        g = fits.PrimaryHDU(np.ones((128, 128)), header_g)
        g.writeto(g_file)
    
        b = fits.PrimaryHDU(np.ones((128, 128)), header_b)
        b.writeto(b_file)
    
        if north == 'default':
            kwargs = {}
        elif north == 'galactic':
            kwargs = {'north': Galactic()}
        elif north == 'false':
            kwargs = {'north': False}
    
        make_rgb_cube([r_file, g_file, b_file], rgb_cube, **kwargs)
    
        make_rgb_image(rgb_cube, rgb_file, embed_avm_tags=True,
                       vmin_r=0, vmax_r=1, vmin_g=0, vmax_g=1, vmin_b=0, vmax_b=1)
    
>       f = FITSFigure(rgb_file, figsize=(3, 3))

aplpy/tests/test_rgb.py:118: 
_ _ _ _ _ _ _ _ _ _ _ _ _ _ _ _ _ _ _ _ _ _ _ _ _ _ _ _ _ _ _ _ _ _ _ _ _ _ _ _ 
aplpy/decorators.py:28: in wrapper
    return f(*args, **kwargs)
_ _ _ _ _ _ _ _ _ _ _ _ _ _ _ _ _ _ _ _ _ _ _ _ _ _ _ _ _ _ _ _ _ _ _ _ _ _ _ _ 

self = <aplpy.core.FITSFigure object at 0x3ff73311070>
data = '/tmp/pytest-of-mockbuild/pytest-0/test_make_rgb_cube_default_0/rgb.png'
hdu = 0, figure = None, subplot = (1, 1, 1), downsample = False, north = False
convention = None, dimensions = [0, 1], slices = [], auto_refresh = None
kwargs = {'figsize': (3, 3)}
Image = <module 'PIL.Image' from '/usr/lib64/python3.12/site-packages/PIL/Image.py'>

    @auto_refresh
    def __init__(self, data, hdu=0, figure=None, subplot=(1, 1, 1),
                 downsample=False, north=False, convention=None,
                 dimensions=[0, 1], slices=[], auto_refresh=None,
                 **kwargs):
    
        self._wcsaxes_slices = ('x', 'y')
    
        if 'figsize' not in kwargs:
            kwargs['figsize'] = (10, 9)
    
        # Set the grid type
        if len(slices) > 0:
            self.grid_type = 'contours'
        else:
            self.grid_type = 'lines'
    
        if (isinstance(data, str) and
                data.split('.')[-1].lower() in ['png', 'jpg', 'tif']):
    
            try:
                from PIL import Image
            except ImportError:
                try:
                    import Image
                except ImportError:
                    raise ImportError("The Python Imaging Library (PIL) is "
                                      "required to read in RGB images")
    
            try:
                import pyavm
            except ImportError:
>               raise ImportError("PyAVM is required to read in AVM "
                                  "meta-data from RGB images")
E               ImportError: PyAVM is required to read in AVM meta-data from RGB images

aplpy/core.py:168: ImportError
----------------------------- Captured stdout call -----------------------------
INFO: Red: [aplpy.rgb]
INFO: vmin =  0.000e+00 [aplpy.rgb]
INFO: vmax =  1.000e+00 [aplpy.rgb]
INFO: Green: [aplpy.rgb]
INFO: vmin =  0.000e+00 [aplpy.rgb]
INFO: vmax =  1.000e+00 [aplpy.rgb]
INFO: Blue: [aplpy.rgb]
INFO: vmin =  0.000e+00 [aplpy.rgb]
INFO: vmax =  1.000e+00 [aplpy.rgb]
------------------------------ Captured log call -------------------------------
INFO     astropy:rgb.py:176 Red:
INFO     astropy:rgb.py:31 vmin =  0.000e+00
INFO     astropy:rgb.py:37 vmax =  1.000e+00
INFO     astropy:rgb.py:181 Green:
INFO     astropy:rgb.py:31 vmin =  0.000e+00
INFO     astropy:rgb.py:37 vmax =  1.000e+00
INFO     astropy:rgb.py:189 Blue:
INFO     astropy:rgb.py:31 vmin =  0.000e+00
INFO     astropy:rgb.py:37 vmax =  1.000e+00
_____________________ TestRGB.test_make_rgb_cube[galactic] _____________________

self = <aplpy.core.FITSFigure object at 0x3ff7302cf80>
data = '/tmp/pytest-of-mockbuild/pytest-0/test_make_rgb_cube_galactic_0/rgb.png'
hdu = 0, figure = None, subplot = (1, 1, 1), downsample = False, north = False
convention = None, dimensions = [0, 1], slices = [], auto_refresh = None
kwargs = {'figsize': (3, 3)}
Image = <module 'PIL.Image' from '/usr/lib64/python3.12/site-packages/PIL/Image.py'>

    @auto_refresh
    def __init__(self, data, hdu=0, figure=None, subplot=(1, 1, 1),
                 downsample=False, north=False, convention=None,
                 dimensions=[0, 1], slices=[], auto_refresh=None,
                 **kwargs):
    
        self._wcsaxes_slices = ('x', 'y')
    
        if 'figsize' not in kwargs:
            kwargs['figsize'] = (10, 9)
    
        # Set the grid type
        if len(slices) > 0:
            self.grid_type = 'contours'
        else:
            self.grid_type = 'lines'
    
        if (isinstance(data, str) and
                data.split('.')[-1].lower() in ['png', 'jpg', 'tif']):
    
            try:
                from PIL import Image
            except ImportError:
                try:
                    import Image
                except ImportError:
                    raise ImportError("The Python Imaging Library (PIL) is "
                                      "required to read in RGB images")
    
            try:
>               import pyavm
E               ModuleNotFoundError: No module named 'pyavm'

aplpy/core.py:166: ModuleNotFoundError

During handling of the above exception, another exception occurred:

self = <aplpy.tests.test_rgb.TestRGB object at 0x3ff736d56a0>
tmpdir = local('/tmp/pytest-of-mockbuild/pytest-0/test_make_rgb_cube_galactic_0')
north = 'galactic'

    @pytest.mark.remote_data
    @pytest.mark.parametrize('north', ['default', 'galactic', 'false'])
    @pytest.mark.mpl_image_compare(style={}, savefig_kwargs={'adjust_bbox': False},
                                   baseline_dir=baseline_dir, tolerance=7.5)
    def test_make_rgb_cube(self, tmpdir, north):
    
        # Regression test to check that RGB recenter works properly
    
        header = generate_header(os.path.join(ROOT, 'data', '2d_fits', '2MASS_k_rot.hdr'))
    
        header['CRPIX1'] = 6.5
        header['CRPIX2'] = 6.5
    
        header_r = header.copy()
        header_r['CROTA2'] = 5
        header_g = header.copy()
        header_g['CROTA2'] = 35
        header_b = header.copy()
        header_b['CROTA2'] = 70
    
        r_file = tmpdir.join('r.fits').strpath
        g_file = tmpdir.join('g.fits').strpath
        b_file = tmpdir.join('b.fits').strpath
        rgb_cube = tmpdir.join('rgb.fits').strpath
        rgb_file = tmpdir.join('rgb.png').strpath
    
        header = fits.Header.fromtextfile(HEADER)
    
        r = fits.PrimaryHDU(np.ones((128, 128)), header_r)
        r.writeto(r_file)
    
        g = fits.PrimaryHDU(np.ones((128, 128)), header_g)
        g.writeto(g_file)
    
        b = fits.PrimaryHDU(np.ones((128, 128)), header_b)
        b.writeto(b_file)
    
        if north == 'default':
            kwargs = {}
        elif north == 'galactic':
            kwargs = {'north': Galactic()}
        elif north == 'false':
            kwargs = {'north': False}
    
        make_rgb_cube([r_file, g_file, b_file], rgb_cube, **kwargs)
    
        make_rgb_image(rgb_cube, rgb_file, embed_avm_tags=True,
                       vmin_r=0, vmax_r=1, vmin_g=0, vmax_g=1, vmin_b=0, vmax_b=1)
    
>       f = FITSFigure(rgb_file, figsize=(3, 3))

aplpy/tests/test_rgb.py:118: 
_ _ _ _ _ _ _ _ _ _ _ _ _ _ _ _ _ _ _ _ _ _ _ _ _ _ _ _ _ _ _ _ _ _ _ _ _ _ _ _ 
aplpy/decorators.py:28: in wrapper
    return f(*args, **kwargs)
_ _ _ _ _ _ _ _ _ _ _ _ _ _ _ _ _ _ _ _ _ _ _ _ _ _ _ _ _ _ _ _ _ _ _ _ _ _ _ _ 

self = <aplpy.core.FITSFigure object at 0x3ff7302cf80>
data = '/tmp/pytest-of-mockbuild/pytest-0/test_make_rgb_cube_galactic_0/rgb.png'
hdu = 0, figure = None, subplot = (1, 1, 1), downsample = False, north = False
convention = None, dimensions = [0, 1], slices = [], auto_refresh = None
kwargs = {'figsize': (3, 3)}
Image = <module 'PIL.Image' from '/usr/lib64/python3.12/site-packages/PIL/Image.py'>

    @auto_refresh
    def __init__(self, data, hdu=0, figure=None, subplot=(1, 1, 1),
                 downsample=False, north=False, convention=None,
                 dimensions=[0, 1], slices=[], auto_refresh=None,
                 **kwargs):
    
        self._wcsaxes_slices = ('x', 'y')
    
        if 'figsize' not in kwargs:
            kwargs['figsize'] = (10, 9)
    
        # Set the grid type
        if len(slices) > 0:
            self.grid_type = 'contours'
        else:
            self.grid_type = 'lines'
    
        if (isinstance(data, str) and
                data.split('.')[-1].lower() in ['png', 'jpg', 'tif']):
    
            try:
                from PIL import Image
            except ImportError:
                try:
                    import Image
                except ImportError:
                    raise ImportError("The Python Imaging Library (PIL) is "
                                      "required to read in RGB images")
    
            try:
                import pyavm
            except ImportError:
>               raise ImportError("PyAVM is required to read in AVM "
                                  "meta-data from RGB images")
E               ImportError: PyAVM is required to read in AVM meta-data from RGB images

aplpy/core.py:168: ImportError
----------------------------- Captured stdout call -----------------------------
INFO: Red: [aplpy.rgb]
INFO: vmin =  0.000e+00 [aplpy.rgb]
INFO: vmax =  1.000e+00 [aplpy.rgb]
INFO: Green: [aplpy.rgb]
INFO: vmin =  0.000e+00 [aplpy.rgb]
INFO: vmax =  1.000e+00 [aplpy.rgb]
INFO: Blue: [aplpy.rgb]
INFO: vmin =  0.000e+00 [aplpy.rgb]
INFO: vmax =  1.000e+00 [aplpy.rgb]
------------------------------ Captured log call -------------------------------
INFO     astropy:rgb.py:176 Red:
INFO     astropy:rgb.py:31 vmin =  0.000e+00
INFO     astropy:rgb.py:37 vmax =  1.000e+00
INFO     astropy:rgb.py:181 Green:
INFO     astropy:rgb.py:31 vmin =  0.000e+00
INFO     astropy:rgb.py:37 vmax =  1.000e+00
INFO     astropy:rgb.py:189 Blue:
INFO     astropy:rgb.py:31 vmin =  0.000e+00
INFO     astropy:rgb.py:37 vmax =  1.000e+00
______________________ TestRGB.test_make_rgb_cube[false] _______________________

self = <aplpy.tests.test_rgb.TestRGB object at 0x3ff736d5730>
tmpdir = local('/tmp/pytest-of-mockbuild/pytest-0/test_make_rgb_cube_false_0')
north = 'false'

    @pytest.mark.remote_data
    @pytest.mark.parametrize('north', ['default', 'galactic', 'false'])
    @pytest.mark.mpl_image_compare(style={}, savefig_kwargs={'adjust_bbox': False},
                                   baseline_dir=baseline_dir, tolerance=7.5)
    def test_make_rgb_cube(self, tmpdir, north):
    
        # Regression test to check that RGB recenter works properly
    
        header = generate_header(os.path.join(ROOT, 'data', '2d_fits', '2MASS_k_rot.hdr'))
    
        header['CRPIX1'] = 6.5
        header['CRPIX2'] = 6.5
    
        header_r = header.copy()
        header_r['CROTA2'] = 5
        header_g = header.copy()
        header_g['CROTA2'] = 35
        header_b = header.copy()
        header_b['CROTA2'] = 70
    
        r_file = tmpdir.join('r.fits').strpath
        g_file = tmpdir.join('g.fits').strpath
        b_file = tmpdir.join('b.fits').strpath
        rgb_cube = tmpdir.join('rgb.fits').strpath
        rgb_file = tmpdir.join('rgb.png').strpath
    
        header = fits.Header.fromtextfile(HEADER)
    
        r = fits.PrimaryHDU(np.ones((128, 128)), header_r)
        r.writeto(r_file)
    
        g = fits.PrimaryHDU(np.ones((128, 128)), header_g)
        g.writeto(g_file)
    
        b = fits.PrimaryHDU(np.ones((128, 128)), header_b)
        b.writeto(b_file)
    
        if north == 'default':
            kwargs = {}
        elif north == 'galactic':
            kwargs = {'north': Galactic()}
        elif north == 'false':
            kwargs = {'north': False}
    
>       make_rgb_cube([r_file, g_file, b_file], rgb_cube, **kwargs)

aplpy/tests/test_rgb.py:113: 
_ _ _ _ _ _ _ _ _ _ _ _ _ _ _ _ _ _ _ _ _ _ _ _ _ _ _ _ _ _ _ _ _ _ _ _ _ _ _ _ 
aplpy/rgb.py:278: in make_rgb_cube
    wcs, shape = find_optimal_celestial_wcs(files, frame=frame, auto_rotate=auto_rotate)
_ _ _ _ _ _ _ _ _ _ _ _ _ _ _ _ _ _ _ _ _ _ _ _ _ _ _ _ _ _ _ _ _ _ _ _ _ _ _ _ 

input_data = ['/tmp/pytest-of-mockbuild/pytest-0/test_make_rgb_cube_false_0/r.fits', '/tmp/pytest-of-mockbuild/pytest-0/test_make_rgb_cube_false_0/g.fits', '/tmp/pytest-of-mockbuild/pytest-0/test_make_rgb_cube_false_0/b.fits']
hdu_in = None, frame = <FK5 Frame (equinox=2000.0)>, auto_rotate = True
projection = 'TAN', resolution = <Quantity 0.00138889 deg>
reference = <SkyCoord (FK5: equinox=2000.0): (ra, dec, distance) in (deg, deg, )
    (266.4, -28.93333, 1.)>

    def find_optimal_celestial_wcs(
        input_data,
        hdu_in=None,
        frame=None,
        auto_rotate=False,
        projection="TAN",
        resolution=None,
        reference=None,
    ):
        """
        Given one or more images, return an optimal WCS projection object and
        shape.
    
        This currently only works with 2-d images with celestial WCS.
    
        Parameters
        ----------
        input_data : iterable
            One or more input data specifications to include in the calculation of
            the final WCS. This should be an iterable containing one entry for each
            specification, where a single data specification is one of:
    
                * The name of a FITS file as a `str` or a `pathlib.Path` object
                * An `~astropy.io.fits.HDUList` object
                * An image HDU object such as a `~astropy.io.fits.PrimaryHDU`,
                  `~astropy.io.fits.ImageHDU`, or `~astropy.io.fits.CompImageHDU`
                  instance
                * A tuple where the first element is an Numpy array shape tuple and
                  the second element is either a
                  `~astropy.wcs.wcsapi.BaseLowLevelWCS`,
                  `~astropy.wcs.wcsapi.BaseHighLevelWCS`, or a
                  `~astropy.io.fits.Header` object
                * A tuple where the first element is a `~numpy.ndarray` and the
                  second element is either a
                  `~astropy.wcs.wcsapi.BaseLowLevelWCS`,
                  `~astropy.wcs.wcsapi.BaseHighLevelWCS`, or a
                  `~astropy.io.fits.Header` object
                * An `~astropy.nddata.NDData` object from which the ``.data`` and
                  ``.wcs`` attributes will be used as the input data.
                * A `~astropy.wcs.wcsapi.BaseLowLevelWCS` object with ``array_shape`` set
                  or a `~astropy.wcs.wcsapi.BaseHighLevelWCS` object whose
                  underlying low level WCS object has ``array_shape`` set.
    
            If only one input data needs to be provided, it is also possible to
            pass it in without including it in an iterable.
    
        hdu_in : int or str, optional
            If ``input_data`` is a FITS file or an `~astropy.io.fits.HDUList`
            instance, specifies the HDU to use.
        frame : str or `~astropy.coordinates.BaseCoordinateFrame`
            The coordinate system for the final image (defaults to the frame of
            the first image specified).
        auto_rotate : bool
            Whether to rotate the header to minimize the final image area (if
            `True`, requires shapely>=1.6 to be installed).
        projection : str
            Three-letter code for the WCS projection.
        resolution : `~astropy.units.Quantity`
            The resolution of the final image. If not specified, this is the
            smallest resolution of the input images.
        reference : `~astropy.coordinates.SkyCoord`
            The reference coordinate for the final header. If not specified, this
            is determined automatically from the input images.
    
        Returns
        -------
        wcs : :class:`~astropy.wcs.WCS`
            The optimal WCS determined from the input images.
        shape : tuple
            The optimal shape required to cover all the output.
        """
    
        # TODO: support higher-dimensional datasets in future
        # TODO: take into account NaN values when determining the extent of the
        #       final WCS
    
        if isinstance(frame, str):
            frame = frame_transform_graph.lookup_name(frame)()
    
        # Determine whether an iterable of input values was given or a single
        # input data.
    
        if isinstance(input_data, str):
            # Handle this explicitly as isiterable(str) is True
            iterable = False
        elif isiterable(input_data):
            if len(input_data) == 2 and isinstance(
                input_data[1], (BaseLowLevelWCS, BaseHighLevelWCS, Header)
            ):
                # Since 2-element tuples are valid single inputs we need to check for this
                iterable = False
            else:
                iterable = True
        else:
            iterable = False
    
        if iterable:
            input_shapes = [parse_input_shape(shape, hdu_in=hdu_in) for shape in input_data]
        else:
            input_shapes = [parse_input_shape(input_data, hdu_in=hdu_in)]
    
        # We start off by looping over images, checking that they are indeed
        # celestial images, and building up a list of all corners and all reference
        # coordinates in the frame of reference of the first image.
    
        corners = []
        references = []
        resolutions = []
    
        for shape, wcs in input_shapes:
            if len(shape) != 2:
                raise ValueError(f"Input data is not 2-dimensional (got shape {shape!r})")
    
            if wcs.pixel_n_dim != 2 or wcs.world_n_dim != 2:
                raise ValueError("Input WCS is not 2-dimensional")
    
            if isinstance(wcs, WCS):
                if not wcs.has_celestial:
                    raise TypeError("WCS does not have celestial components")
    
                # Determine frame if it wasn't specified
                if frame is None:
                    frame = wcs_to_celestial_frame(wcs)
    
            else:
                # Convert a single position to determine type of output and make
                # sure there is only a single SkyCoord returned.
                coord = wcs.pixel_to_world(0, 0)
    
                if not isinstance(coord, SkyCoord):
                    raise TypeError("WCS does not have celestial components")
    
                if frame is None:
                    frame = coord.frame.replicate_without_data()
    
            # Find pixel coordinates of corners. In future if we are worried about
            # significant distortions of the edges in the reprojection process we
            # could simply add arbitrary numbers of midpoints to this list.
            ny, nx = shape
            xc = np.array([-0.5, nx - 0.5, nx - 0.5, -0.5])
            yc = np.array([-0.5, -0.5, ny - 0.5, ny - 0.5])
    
            # We have to do .frame here to make sure that we get a frame object
            # without any 'hidden' attributes, otherwise the stacking below won't
            # work.
            corners.append(wcs.pixel_to_world(xc, yc).transform_to(frame).frame)
    
            if isinstance(wcs, WCS):
                # We now figure out the reference coordinate for the image in the
                # frame of the first image. The easiest way to do this is actually
                # to use pixel_to_skycoord with the reference position in pixel
                # coordinates. We have to set origin=1 because crpix values are
                # 1-based.
                xp, yp = wcs.wcs.crpix
                references.append(pixel_to_skycoord(xp, yp, wcs, origin=1).transform_to(frame).frame)
    
                # Find the pixel scale at the reference position - we take the minimum
                # since we are going to set up a header with 'square' pixels with the
                # smallest resolution specified.
                scales = proj_plane_pixel_scales(wcs)
                resolutions.append(np.min(np.abs(scales)))
    
            else:
                xp, yp = (nx - 1) / 2, (ny - 1) / 2
                references.append(wcs.pixel_to_world(xp, yp).transform_to(frame).frame)
    
                xs = np.array([xp, xp, xp + 1])
                ys = np.array([yp, yp + 1, yp])
                cs = wcs.pixel_to_world(xs, ys)
                dx = abs(cs[0].separation(cs[2]).deg)
                dy = abs(cs[0].separation(cs[1]).deg)
                resolutions.append(min(dx, dy))
    
        # We now stack the coordinates - however the frame classes can't do this
        # so we have to use the high-level SkyCoord class.
        corners = SkyCoord(corners)
        references = SkyCoord(references)
    
        # If no reference coordinate has been passed in for the final header, we
        # determine the reference coordinate as the mean of all the reference
        # positions. This choice is as good as any and if the user really cares,
        # they can set  it manually.
        if reference is None:
            reference = SkyCoord(references.data.mean(), frame=references.frame)
    
        # In any case, we need to convert the reference coordinate (either
        # specified or automatically determined) to the requested final frame.
        reference = reference.transform_to(frame)
    
        # Determine resolution if not specified
        if resolution is None:
            resolution = np.min(resolutions) * u.deg
    
        # Construct WCS object centered on position
        wcs_final = celestial_frame_to_wcs(frame, projection=projection)
    
        if wcs_final.wcs.cunit[0] == "":
            wcs_final.wcs.cunit[0] = "deg"
    
        if wcs_final.wcs.cunit[1] == "":
            wcs_final.wcs.cunit[1] = "deg"
    
        rep = reference.represent_as("unitspherical")
        wcs_final.wcs.crval = (
            rep.lon.to_value(wcs_final.wcs.cunit[0]),
            rep.lat.to_value(wcs_final.wcs.cunit[1]),
        )
        wcs_final.wcs.cdelt = (
            -resolution.to_value(wcs_final.wcs.cunit[0]),
            resolution.to_value(wcs_final.wcs.cunit[1]),
        )
    
        # For now, set crpix to (1, 1) and we'll then figure out where all the
        # images fall in this projection, then we'll adjust crpix.
        wcs_final.wcs.crpix = (1, 1)
    
        # Find pixel coordinates of all corners in the final WCS projection. We use
        # origin=1 since we are trying to determine crpix values.
        xp, yp = skycoord_to_pixel(corners, wcs_final, origin=1)
    
        if auto_rotate:
            # Use shapely to represent the points and find the minimum rotated
            # rectangle
>           from shapely.geometry import MultiPoint
E           ModuleNotFoundError: No module named 'shapely'

/usr/lib64/python3.12/site-packages/reproject/mosaicking/wcs_helpers.py:246: ModuleNotFoundError
_____________________________ test_write_png[svg] ______________________________

tmpdir = local('/tmp/pytest-of-mockbuild/pytest-0/test_write_png_svg_0')
format = 'svg'

    @pytest.mark.parametrize(('format'), FORMATS)
    def test_write_png(tmpdir, format):
        filename = os.path.join(str(tmpdir), 'test_output.png')
        f = FITSFigure(ARRAY)
        f.show_grayscale()
        try:
            f.save(filename, format=format)
        except TypeError:
            pytest.xfail()
        finally:
            f.close()
        if format is None:
            assert is_format(filename, 'png')
        else:
>           assert is_format(filename, format)

aplpy/tests/test_save.py:51: 
_ _ _ _ _ _ _ _ _ _ _ _ _ _ _ _ _ _ _ _ _ _ _ _ _ _ _ _ _ _ _ _ _ _ _ _ _ _ _ _ 

filename = '/tmp/pytest-of-mockbuild/pytest-0/test_write_png_svg_0/test_output.png'
format = 'svg'

    def is_format(filename, format):
        if isinstance(filename, str):
            f = open(filename, 'rb')
        else:
            f = filename
        if format == 'png':
            return f.read(8) == b'\x89\x50\x4e\x47\x0d\x0a\x1a\x0a'
        elif format == 'pdf':
            return f.read(4) == b'\x25\x50\x44\x46'
        elif format == 'eps':
            return f.read(23) == b'%!PS-Adobe-3.0 EPSF-3.0'
        elif format == 'ps':
            return f.read(14) == b'%!PS-Adobe-3.0'
        elif format == 'svg':
            from xml.dom import minidom
>           return minidom.parse(f).childNodes[2].attributes['xmlns'].value == 'http://www.w3.org/2000/svg'
E           IndexError: list index out of range

aplpy/tests/test_save.py:32: IndexError
----------------------------- Captured stdout call -----------------------------
INFO: Auto-setting vmin to -2.474e+01 [aplpy.core]
INFO: Auto-setting vmax to  2.823e+02 [aplpy.core]
----------------------------- Captured stderr call -----------------------------
WARNING: No WCS information found in header - using pixel coordinates [aplpy.header]
------------------------------ Captured log call -------------------------------
WARNING  astropy:header.py:23 No WCS information found in header - using pixel coordinates
INFO     astropy:core.py:725 Auto-setting vmin to -2.474e+01
INFO     astropy:core.py:730 Auto-setting vmax to  2.823e+02
_____________________________ test_write_pdf[svg] ______________________________

tmpdir = local('/tmp/pytest-of-mockbuild/pytest-0/test_write_pdf_svg_0')
format = 'svg'

    @pytest.mark.parametrize(('format'), FORMATS)
    def test_write_pdf(tmpdir, format):
        filename = os.path.join(str(tmpdir), 'test_output.pdf')
        f = FITSFigure(ARRAY)
        f.show_grayscale()
        try:
            f.save(filename, format=format)
        except TypeError:
            pytest.xfail()
        finally:
            f.close()
        if format is None:
            assert is_format(filename, 'pdf')
        else:
>           assert is_format(filename, format)

aplpy/tests/test_save.py:68: 
_ _ _ _ _ _ _ _ _ _ _ _ _ _ _ _ _ _ _ _ _ _ _ _ _ _ _ _ _ _ _ _ _ _ _ _ _ _ _ _ 

filename = '/tmp/pytest-of-mockbuild/pytest-0/test_write_pdf_svg_0/test_output.pdf'
format = 'svg'

    def is_format(filename, format):
        if isinstance(filename, str):
            f = open(filename, 'rb')
        else:
            f = filename
        if format == 'png':
            return f.read(8) == b'\x89\x50\x4e\x47\x0d\x0a\x1a\x0a'
        elif format == 'pdf':
            return f.read(4) == b'\x25\x50\x44\x46'
        elif format == 'eps':
            return f.read(23) == b'%!PS-Adobe-3.0 EPSF-3.0'
        elif format == 'ps':
            return f.read(14) == b'%!PS-Adobe-3.0'
        elif format == 'svg':
            from xml.dom import minidom
>           return minidom.parse(f).childNodes[2].attributes['xmlns'].value == 'http://www.w3.org/2000/svg'
E           IndexError: list index out of range

aplpy/tests/test_save.py:32: IndexError
----------------------------- Captured stdout call -----------------------------
INFO: Auto-setting vmin to -2.474e+01 [aplpy.core]
INFO: Auto-setting vmax to  2.823e+02 [aplpy.core]
----------------------------- Captured stderr call -----------------------------
WARNING: No WCS information found in header - using pixel coordinates [aplpy.header]
------------------------------ Captured log call -------------------------------
WARNING  astropy:header.py:23 No WCS information found in header - using pixel coordinates
INFO     astropy:core.py:725 Auto-setting vmin to -2.474e+01
INFO     astropy:core.py:730 Auto-setting vmax to  2.823e+02
_____________________________ test_write_eps[svg] ______________________________

tmpdir = local('/tmp/pytest-of-mockbuild/pytest-0/test_write_eps_svg_0')
format = 'svg'

    @pytest.mark.parametrize(('format'), FORMATS)
    def test_write_eps(tmpdir, format):
        filename = os.path.join(str(tmpdir), 'test_output.eps')
        f = FITSFigure(ARRAY)
        f.show_grayscale()
        try:
            f.save(filename, format=format)
        except TypeError:
            pytest.xfail()
        finally:
            f.close()
        if format is None:
            assert is_format(filename, 'eps')
        else:
>           assert is_format(filename, format)

aplpy/tests/test_save.py:85: 
_ _ _ _ _ _ _ _ _ _ _ _ _ _ _ _ _ _ _ _ _ _ _ _ _ _ _ _ _ _ _ _ _ _ _ _ _ _ _ _ 

filename = '/tmp/pytest-of-mockbuild/pytest-0/test_write_eps_svg_0/test_output.eps'
format = 'svg'

    def is_format(filename, format):
        if isinstance(filename, str):
            f = open(filename, 'rb')
        else:
            f = filename
        if format == 'png':
            return f.read(8) == b'\x89\x50\x4e\x47\x0d\x0a\x1a\x0a'
        elif format == 'pdf':
            return f.read(4) == b'\x25\x50\x44\x46'
        elif format == 'eps':
            return f.read(23) == b'%!PS-Adobe-3.0 EPSF-3.0'
        elif format == 'ps':
            return f.read(14) == b'%!PS-Adobe-3.0'
        elif format == 'svg':
            from xml.dom import minidom
>           return minidom.parse(f).childNodes[2].attributes['xmlns'].value == 'http://www.w3.org/2000/svg'
E           IndexError: list index out of range

aplpy/tests/test_save.py:32: IndexError
----------------------------- Captured stdout call -----------------------------
INFO: Auto-setting vmin to -2.474e+01 [aplpy.core]
INFO: Auto-setting vmax to  2.823e+02 [aplpy.core]
----------------------------- Captured stderr call -----------------------------
WARNING: No WCS information found in header - using pixel coordinates [aplpy.header]
------------------------------ Captured log call -------------------------------
WARNING  astropy:header.py:23 No WCS information found in header - using pixel coordinates
INFO     astropy:core.py:725 Auto-setting vmin to -2.474e+01
INFO     astropy:core.py:730 Auto-setting vmax to  2.823e+02
___________________________ test_write_stringio[svg] ___________________________

tmpdir = local('/tmp/pytest-of-mockbuild/pytest-0/test_write_stringio_svg_0')
format = 'svg'

    @pytest.mark.parametrize(('format'), FORMATS)
    def test_write_stringio(tmpdir, format):
        s = StringIO()
        f = FITSFigure(ARRAY)
        f.show_grayscale()
        try:
            f.save(s, format=format)
        except TypeError:
            pytest.xfail()
        finally:
            f.close()
        try:
            s.seek(0)
        except ValueError:
            if format == 'svg' and sys.version_info[:2] >= (3, 3):
                pytest.xfail()
            else:
                raise
        if format is None:
            assert is_format(s, 'png')
        else:
>           assert is_format(s, format)

aplpy/tests/test_save.py:109: 
_ _ _ _ _ _ _ _ _ _ _ _ _ _ _ _ _ _ _ _ _ _ _ _ _ _ _ _ _ _ _ _ _ _ _ _ _ _ _ _ 

filename = <_io.BytesIO object at 0x3ff71bb4e00>, format = 'svg'

    def is_format(filename, format):
        if isinstance(filename, str):
            f = open(filename, 'rb')
        else:
            f = filename
        if format == 'png':
            return f.read(8) == b'\x89\x50\x4e\x47\x0d\x0a\x1a\x0a'
        elif format == 'pdf':
            return f.read(4) == b'\x25\x50\x44\x46'
        elif format == 'eps':
            return f.read(23) == b'%!PS-Adobe-3.0 EPSF-3.0'
        elif format == 'ps':
            return f.read(14) == b'%!PS-Adobe-3.0'
        elif format == 'svg':
            from xml.dom import minidom
>           return minidom.parse(f).childNodes[2].attributes['xmlns'].value == 'http://www.w3.org/2000/svg'
E           IndexError: list index out of range

aplpy/tests/test_save.py:32: IndexError
----------------------------- Captured stdout call -----------------------------
INFO: Auto-setting vmin to -2.474e+01 [aplpy.core]
INFO: Auto-setting vmax to  2.823e+02 [aplpy.core]
----------------------------- Captured stderr call -----------------------------
WARNING: No WCS information found in header - using pixel coordinates [aplpy.header]
------------------------------ Captured log call -------------------------------
WARNING  astropy:header.py:23 No WCS information found in header - using pixel coordinates
INFO     astropy:core.py:725 Auto-setting vmin to -2.474e+01
INFO     astropy:core.py:730 Auto-setting vmax to  2.823e+02
=============================== warnings summary ===============================
aplpy/conftest.py:41
  /builddir/build/BUILDROOT/APLpy-2.0.3-25.fc40.s390x/usr/lib/python3.12/site-packages/aplpy/conftest.py:41: AstropyDeprecationWarning: The enable_deprecations_as_exceptions function is deprecated and may be removed in a future version.
          Use https://docs.pytest.org/en/stable/warnings.html instead.
    enable_deprecations_as_exceptions()

aplpy/tests/test_images.py:40
  /builddir/build/BUILDROOT/APLpy-2.0.3-25.fc40.s390x/usr/lib/python3.12/site-packages/aplpy/tests/test_images.py:40: PytestUnknownMarkWarning: Unknown pytest.mark.remote_data - is this a typo?  You can register custom marks to avoid this warning - for details, see https://docs.pytest.org/en/stable/how-to/mark.html
    @pytest.mark.remote_data

aplpy/tests/test_images.py:41
  /builddir/build/BUILDROOT/APLpy-2.0.3-25.fc40.s390x/usr/lib/python3.12/site-packages/aplpy/tests/test_images.py:41: PytestUnknownMarkWarning: Unknown pytest.mark.mpl_image_compare - is this a typo?  You can register custom marks to avoid this warning - for details, see https://docs.pytest.org/en/stable/how-to/mark.html
    @pytest.mark.mpl_image_compare(style={}, savefig_kwargs={'adjust_bbox': False}, baseline_dir=baseline_dir, tolerance=7.5)

aplpy/tests/test_images.py:47
  /builddir/build/BUILDROOT/APLpy-2.0.3-25.fc40.s390x/usr/lib/python3.12/site-packages/aplpy/tests/test_images.py:47: PytestUnknownMarkWarning: Unknown pytest.mark.remote_data - is this a typo?  You can register custom marks to avoid this warning - for details, see https://docs.pytest.org/en/stable/how-to/mark.html
    @pytest.mark.remote_data

aplpy/tests/test_images.py:48
  /builddir/build/BUILDROOT/APLpy-2.0.3-25.fc40.s390x/usr/lib/python3.12/site-packages/aplpy/tests/test_images.py:48: PytestUnknownMarkWarning: Unknown pytest.mark.mpl_image_compare - is this a typo?  You can register custom marks to avoid this warning - for details, see https://docs.pytest.org/en/stable/how-to/mark.html
    @pytest.mark.mpl_image_compare(style={}, savefig_kwargs={'adjust_bbox': False}, baseline_dir=baseline_dir, tolerance=7.5)

aplpy/tests/test_images.py:70
  /builddir/build/BUILDROOT/APLpy-2.0.3-25.fc40.s390x/usr/lib/python3.12/site-packages/aplpy/tests/test_images.py:70: PytestUnknownMarkWarning: Unknown pytest.mark.remote_data - is this a typo?  You can register custom marks to avoid this warning - for details, see https://docs.pytest.org/en/stable/how-to/mark.html
    @pytest.mark.remote_data

aplpy/tests/test_images.py:71
  /builddir/build/BUILDROOT/APLpy-2.0.3-25.fc40.s390x/usr/lib/python3.12/site-packages/aplpy/tests/test_images.py:71: PytestUnknownMarkWarning: Unknown pytest.mark.mpl_image_compare - is this a typo?  You can register custom marks to avoid this warning - for details, see https://docs.pytest.org/en/stable/how-to/mark.html
    @pytest.mark.mpl_image_compare(style={}, savefig_kwargs={'adjust_bbox': False}, baseline_dir=baseline_dir, tolerance=5)

aplpy/tests/test_images.py:83
  /builddir/build/BUILDROOT/APLpy-2.0.3-25.fc40.s390x/usr/lib/python3.12/site-packages/aplpy/tests/test_images.py:83: PytestUnknownMarkWarning: Unknown pytest.mark.remote_data - is this a typo?  You can register custom marks to avoid this warning - for details, see https://docs.pytest.org/en/stable/how-to/mark.html
    @pytest.mark.remote_data

aplpy/tests/test_images.py:84
  /builddir/build/BUILDROOT/APLpy-2.0.3-25.fc40.s390x/usr/lib/python3.12/site-packages/aplpy/tests/test_images.py:84: PytestUnknownMarkWarning: Unknown pytest.mark.mpl_image_compare - is this a typo?  You can register custom marks to avoid this warning - for details, see https://docs.pytest.org/en/stable/how-to/mark.html
    @pytest.mark.mpl_image_compare(style={}, savefig_kwargs={'adjust_bbox': False}, baseline_dir=baseline_dir, tolerance=1.5)

aplpy/tests/test_images.py:131
  /builddir/build/BUILDROOT/APLpy-2.0.3-25.fc40.s390x/usr/lib/python3.12/site-packages/aplpy/tests/test_images.py:131: PytestUnknownMarkWarning: Unknown pytest.mark.remote_data - is this a typo?  You can register custom marks to avoid this warning - for details, see https://docs.pytest.org/en/stable/how-to/mark.html
    @pytest.mark.remote_data

aplpy/tests/test_images.py:132
  /builddir/build/BUILDROOT/APLpy-2.0.3-25.fc40.s390x/usr/lib/python3.12/site-packages/aplpy/tests/test_images.py:132: PytestUnknownMarkWarning: Unknown pytest.mark.mpl_image_compare - is this a typo?  You can register custom marks to avoid this warning - for details, see https://docs.pytest.org/en/stable/how-to/mark.html
    @pytest.mark.mpl_image_compare(style={}, savefig_kwargs={'adjust_bbox': False}, baseline_dir=baseline_dir, tolerance=7.5)

aplpy/tests/test_images.py:150
  /builddir/build/BUILDROOT/APLpy-2.0.3-25.fc40.s390x/usr/lib/python3.12/site-packages/aplpy/tests/test_images.py:150: PytestUnknownMarkWarning: Unknown pytest.mark.remote_data - is this a typo?  You can register custom marks to avoid this warning - for details, see https://docs.pytest.org/en/stable/how-to/mark.html
    @pytest.mark.remote_data

aplpy/tests/test_images.py:151
  /builddir/build/BUILDROOT/APLpy-2.0.3-25.fc40.s390x/usr/lib/python3.12/site-packages/aplpy/tests/test_images.py:151: PytestUnknownMarkWarning: Unknown pytest.mark.mpl_image_compare - is this a typo?  You can register custom marks to avoid this warning - for details, see https://docs.pytest.org/en/stable/how-to/mark.html
    @pytest.mark.mpl_image_compare(style={}, savefig_kwargs={'adjust_bbox': False}, baseline_dir=baseline_dir, tolerance=1.5)

aplpy/tests/test_images.py:166
  /builddir/build/BUILDROOT/APLpy-2.0.3-25.fc40.s390x/usr/lib/python3.12/site-packages/aplpy/tests/test_images.py:166: PytestUnknownMarkWarning: Unknown pytest.mark.remote_data - is this a typo?  You can register custom marks to avoid this warning - for details, see https://docs.pytest.org/en/stable/how-to/mark.html
    @pytest.mark.remote_data

aplpy/tests/test_images.py:167
  /builddir/build/BUILDROOT/APLpy-2.0.3-25.fc40.s390x/usr/lib/python3.12/site-packages/aplpy/tests/test_images.py:167: PytestUnknownMarkWarning: Unknown pytest.mark.mpl_image_compare - is this a typo?  You can register custom marks to avoid this warning - for details, see https://docs.pytest.org/en/stable/how-to/mark.html
    @pytest.mark.mpl_image_compare(style={}, savefig_kwargs={'adjust_bbox': False}, baseline_dir=baseline_dir, tolerance=5)

aplpy/tests/test_images.py:181
  /builddir/build/BUILDROOT/APLpy-2.0.3-25.fc40.s390x/usr/lib/python3.12/site-packages/aplpy/tests/test_images.py:181: PytestUnknownMarkWarning: Unknown pytest.mark.remote_data - is this a typo?  You can register custom marks to avoid this warning - for details, see https://docs.pytest.org/en/stable/how-to/mark.html
    @pytest.mark.remote_data

aplpy/tests/test_images.py:182
  /builddir/build/BUILDROOT/APLpy-2.0.3-25.fc40.s390x/usr/lib/python3.12/site-packages/aplpy/tests/test_images.py:182: PytestUnknownMarkWarning: Unknown pytest.mark.mpl_image_compare - is this a typo?  You can register custom marks to avoid this warning - for details, see https://docs.pytest.org/en/stable/how-to/mark.html
    @pytest.mark.mpl_image_compare(style={}, savefig_kwargs={'adjust_bbox': False}, baseline_dir=baseline_dir, tolerance=5)

aplpy/tests/test_images.py:196
  /builddir/build/BUILDROOT/APLpy-2.0.3-25.fc40.s390x/usr/lib/python3.12/site-packages/aplpy/tests/test_images.py:196: PytestUnknownMarkWarning: Unknown pytest.mark.remote_data - is this a typo?  You can register custom marks to avoid this warning - for details, see https://docs.pytest.org/en/stable/how-to/mark.html
    @pytest.mark.remote_data

aplpy/tests/test_images.py:197
  /builddir/build/BUILDROOT/APLpy-2.0.3-25.fc40.s390x/usr/lib/python3.12/site-packages/aplpy/tests/test_images.py:197: PytestUnknownMarkWarning: Unknown pytest.mark.mpl_image_compare - is this a typo?  You can register custom marks to avoid this warning - for details, see https://docs.pytest.org/en/stable/how-to/mark.html
    @pytest.mark.mpl_image_compare(style={}, savefig_kwargs={'adjust_bbox': False}, baseline_dir=baseline_dir, tolerance=5)

aplpy/tests/test_images.py:211
  /builddir/build/BUILDROOT/APLpy-2.0.3-25.fc40.s390x/usr/lib/python3.12/site-packages/aplpy/tests/test_images.py:211: PytestUnknownMarkWarning: Unknown pytest.mark.remote_data - is this a typo?  You can register custom marks to avoid this warning - for details, see https://docs.pytest.org/en/stable/how-to/mark.html
    @pytest.mark.remote_data

aplpy/tests/test_images.py:212
  /builddir/build/BUILDROOT/APLpy-2.0.3-25.fc40.s390x/usr/lib/python3.12/site-packages/aplpy/tests/test_images.py:212: PytestUnknownMarkWarning: Unknown pytest.mark.mpl_image_compare - is this a typo?  You can register custom marks to avoid this warning - for details, see https://docs.pytest.org/en/stable/how-to/mark.html
    @pytest.mark.mpl_image_compare(style={}, savefig_kwargs={'adjust_bbox': False}, baseline_dir=baseline_dir, tolerance=5)

aplpy/tests/test_images.py:221
  /builddir/build/BUILDROOT/APLpy-2.0.3-25.fc40.s390x/usr/lib/python3.12/site-packages/aplpy/tests/test_images.py:221: PytestUnknownMarkWarning: Unknown pytest.mark.remote_data - is this a typo?  You can register custom marks to avoid this warning - for details, see https://docs.pytest.org/en/stable/how-to/mark.html
    @pytest.mark.remote_data

aplpy/tests/test_images.py:222
  /builddir/build/BUILDROOT/APLpy-2.0.3-25.fc40.s390x/usr/lib/python3.12/site-packages/aplpy/tests/test_images.py:222: PytestUnknownMarkWarning: Unknown pytest.mark.mpl_image_compare - is this a typo?  You can register custom marks to avoid this warning - for details, see https://docs.pytest.org/en/stable/how-to/mark.html
    @pytest.mark.mpl_image_compare(style={}, savefig_kwargs={'adjust_bbox': False}, baseline_dir=baseline_dir, tolerance=5)

aplpy/tests/test_images.py:229
  /builddir/build/BUILDROOT/APLpy-2.0.3-25.fc40.s390x/usr/lib/python3.12/site-packages/aplpy/tests/test_images.py:229: PytestUnknownMarkWarning: Unknown pytest.mark.remote_data - is this a typo?  You can register custom marks to avoid this warning - for details, see https://docs.pytest.org/en/stable/how-to/mark.html
    @pytest.mark.remote_data

aplpy/tests/test_images.py:230
  /builddir/build/BUILDROOT/APLpy-2.0.3-25.fc40.s390x/usr/lib/python3.12/site-packages/aplpy/tests/test_images.py:230: PytestUnknownMarkWarning: Unknown pytest.mark.mpl_image_compare - is this a typo?  You can register custom marks to avoid this warning - for details, see https://docs.pytest.org/en/stable/how-to/mark.html
    @pytest.mark.mpl_image_compare(style={}, savefig_kwargs={'adjust_bbox': False}, baseline_dir=baseline_dir, tolerance=5)

aplpy/tests/test_rgb.py:24
  /builddir/build/BUILDROOT/APLpy-2.0.3-25.fc40.s390x/usr/lib/python3.12/site-packages/aplpy/tests/test_rgb.py:24: PytestUnknownMarkWarning: Unknown pytest.mark.remote_data - is this a typo?  You can register custom marks to avoid this warning - for details, see https://docs.pytest.org/en/stable/how-to/mark.html
    @pytest.mark.remote_data

aplpy/tests/test_rgb.py:25
  /builddir/build/BUILDROOT/APLpy-2.0.3-25.fc40.s390x/usr/lib/python3.12/site-packages/aplpy/tests/test_rgb.py:25: PytestUnknownMarkWarning: Unknown pytest.mark.mpl_image_compare - is this a typo?  You can register custom marks to avoid this warning - for details, see https://docs.pytest.org/en/stable/how-to/mark.html
    @pytest.mark.mpl_image_compare(style={}, savefig_kwargs={'adjust_bbox': False},

aplpy/tests/test_rgb.py:69
  /builddir/build/BUILDROOT/APLpy-2.0.3-25.fc40.s390x/usr/lib/python3.12/site-packages/aplpy/tests/test_rgb.py:69: PytestUnknownMarkWarning: Unknown pytest.mark.remote_data - is this a typo?  You can register custom marks to avoid this warning - for details, see https://docs.pytest.org/en/stable/how-to/mark.html
    @pytest.mark.remote_data

aplpy/tests/test_rgb.py:71
  /builddir/build/BUILDROOT/APLpy-2.0.3-25.fc40.s390x/usr/lib/python3.12/site-packages/aplpy/tests/test_rgb.py:71: PytestUnknownMarkWarning: Unknown pytest.mark.mpl_image_compare - is this a typo?  You can register custom marks to avoid this warning - for details, see https://docs.pytest.org/en/stable/how-to/mark.html
    @pytest.mark.mpl_image_compare(style={}, savefig_kwargs={'adjust_bbox': False},

aplpy/tests/test_vectors.py:23
  /builddir/build/BUILDROOT/APLpy-2.0.3-25.fc40.s390x/usr/lib/python3.12/site-packages/aplpy/tests/test_vectors.py:23: PytestUnknownMarkWarning: Unknown pytest.mark.remote_data - is this a typo?  You can register custom marks to avoid this warning - for details, see https://docs.pytest.org/en/stable/how-to/mark.html
    @pytest.mark.remote_data

aplpy/tests/test_vectors.py:24
  /builddir/build/BUILDROOT/APLpy-2.0.3-25.fc40.s390x/usr/lib/python3.12/site-packages/aplpy/tests/test_vectors.py:24: PytestUnknownMarkWarning: Unknown pytest.mark.mpl_image_compare - is this a typo?  You can register custom marks to avoid this warning - for details, see https://docs.pytest.org/en/stable/how-to/mark.html
    @pytest.mark.mpl_image_compare(style={}, savefig_kwargs={'adjust_bbox': False}, baseline_dir=baseline_dir, tolerance=1.5)

aplpy/tests/test_vectors.py:31
  /builddir/build/BUILDROOT/APLpy-2.0.3-25.fc40.s390x/usr/lib/python3.12/site-packages/aplpy/tests/test_vectors.py:31: PytestUnknownMarkWarning: Unknown pytest.mark.remote_data - is this a typo?  You can register custom marks to avoid this warning - for details, see https://docs.pytest.org/en/stable/how-to/mark.html
    @pytest.mark.remote_data

aplpy/tests/test_vectors.py:32
  /builddir/build/BUILDROOT/APLpy-2.0.3-25.fc40.s390x/usr/lib/python3.12/site-packages/aplpy/tests/test_vectors.py:32: PytestUnknownMarkWarning: Unknown pytest.mark.mpl_image_compare - is this a typo?  You can register custom marks to avoid this warning - for details, see https://docs.pytest.org/en/stable/how-to/mark.html
    @pytest.mark.mpl_image_compare(style={}, savefig_kwargs={'adjust_bbox': False}, baseline_dir=baseline_dir, tolerance=1.5)

aplpy/tests/test_beam.py: 18 warnings
aplpy/tests/test_colorbar.py: 7 warnings
aplpy/tests/test_contour.py: 2 warnings
aplpy/tests/test_convolve.py: 5 warnings
aplpy/tests/test_downsample.py: 1 warning
aplpy/tests/test_images.py: 11 warnings
aplpy/tests/test_init_cube.py: 18 warnings
aplpy/tests/test_init_image.py: 67 warnings
aplpy/tests/test_misc.py: 7 warnings
aplpy/tests/test_save.py: 24 warnings
aplpy/tests/test_subplot.py: 2 warnings
aplpy/tests/test_tick_labels.py: 1 warning
aplpy/tests/test_vectors.py: 2 warnings
  /builddir/build/BUILDROOT/APLpy-2.0.3-25.fc40.s390x/usr/lib/python3.12/site-packages/aplpy/core.py:679: MatplotlibDeprecationWarning: The get_cmap function was deprecated in Matplotlib 3.7 and will be removed two minor releases later. Use ``matplotlib.colormaps[name]`` or ``matplotlib.colormaps.get_cmap(obj)`` instead.
    cmap = plt.cm.get_cmap(cmap)

aplpy/tests/test_beam.py: 65 warnings
aplpy/tests/test_images.py: 1 warning
  /builddir/build/BUILDROOT/APLpy-2.0.3-25.fc40.s390x/usr/lib/python3.12/site-packages/aplpy/overlays.py:431: MatplotlibDeprecationWarning: The AnchoredEllipse class was deprecated in Matplotlib 3.8 and will be removed two minor releases later.
    self._beam = AnchoredEllipse(self._ax.transData, width=minor,

aplpy/tests/test_contour.py::test_numpy_contour[True]
aplpy/tests/test_contour.py::test_numpy_contour[False]
aplpy/tests/test_images.py::TestBasic::test_contours
  /builddir/build/BUILDROOT/APLpy-2.0.3-25.fc40.s390x/usr/lib/python3.12/site-packages/aplpy/core.py:932: MatplotlibDeprecationWarning: The get_cmap function was deprecated in Matplotlib 3.7 and will be removed two minor releases later. Use ``matplotlib.colormaps[name]`` or ``matplotlib.colormaps.get_cmap(obj)`` instead.
    cmap = plt.cm.get_cmap('viridis')

aplpy/tests/test_images.py::TestBasic::test_basic_image
  /usr/lib/python3.12/site-packages/_pytest/python.py:198: PytestReturnNotNoneWarning: Expected None, but aplpy/tests/test_images.py::TestBasic::test_basic_image returned <Figure size 700x500 with 1 Axes>, which will be an error in a future version of pytest.  Did you mean to use `assert` instead of `return`?
    warnings.warn(

aplpy/tests/test_images.py::TestBasic::test_ticks_labels_options
  /usr/lib/python3.12/site-packages/_pytest/python.py:198: PytestReturnNotNoneWarning: Expected None, but aplpy/tests/test_images.py::TestBasic::test_ticks_labels_options returned <Figure size 700x500 with 1 Axes>, which will be an error in a future version of pytest.  Did you mean to use `assert` instead of `return`?
    warnings.warn(

aplpy/tests/test_images.py::TestBasic::test_show_colorbar_scalebar_beam
  /usr/lib/python3.12/site-packages/_pytest/python.py:198: PytestReturnNotNoneWarning: Expected None, but aplpy/tests/test_images.py::TestBasic::test_show_colorbar_scalebar_beam returned <Figure size 700x500 with 2 Axes>, which will be an error in a future version of pytest.  Did you mean to use `assert` instead of `return`?
    warnings.warn(

aplpy/tests/test_images.py::TestBasic::test_overlay_shapes
  /usr/lib/python3.12/site-packages/_pytest/python.py:198: PytestReturnNotNoneWarning: Expected None, but aplpy/tests/test_images.py::TestBasic::test_overlay_shapes returned <Figure size 700x500 with 1 Axes>, which will be an error in a future version of pytest.  Did you mean to use `assert` instead of `return`?
    warnings.warn(

aplpy/tests/test_images.py::TestBasic::test_grid
  /usr/lib/python3.12/site-packages/_pytest/python.py:198: PytestReturnNotNoneWarning: Expected None, but aplpy/tests/test_images.py::TestBasic::test_grid returned <Figure size 700x500 with 1 Axes>, which will be an error in a future version of pytest.  Did you mean to use `assert` instead of `return`?
    warnings.warn(

aplpy/tests/test_images.py::TestBasic::test_recenter
  /usr/lib/python3.12/site-packages/_pytest/python.py:198: PytestReturnNotNoneWarning: Expected None, but aplpy/tests/test_images.py::TestBasic::test_recenter returned <Figure size 700x500 with 1 Axes>, which will be an error in a future version of pytest.  Did you mean to use `assert` instead of `return`?
    warnings.warn(

aplpy/tests/test_images.py::TestBasic::test_contours
  /usr/lib/python3.12/site-packages/_pytest/python.py:198: PytestReturnNotNoneWarning: Expected None, but aplpy/tests/test_images.py::TestBasic::test_contours returned <Figure size 700x500 with 1 Axes>, which will be an error in a future version of pytest.  Did you mean to use `assert` instead of `return`?
    warnings.warn(

aplpy/tests/test_images.py::TestBasic::test_cube_slice
  /usr/lib/python3.12/site-packages/_pytest/python.py:198: PytestReturnNotNoneWarning: Expected None, but aplpy/tests/test_images.py::TestBasic::test_cube_slice returned <Figure size 700x500 with 1 Axes>, which will be an error in a future version of pytest.  Did you mean to use `assert` instead of `return`?
    warnings.warn(

aplpy/tests/test_images.py::TestBasic::test_north
  /usr/lib/python3.12/site-packages/_pytest/python.py:198: PytestReturnNotNoneWarning: Expected None, but aplpy/tests/test_images.py::TestBasic::test_north returned <Figure size 300x300 with 1 Axes>, which will be an error in a future version of pytest.  Did you mean to use `assert` instead of `return`?
    warnings.warn(

aplpy/tests/test_images.py::TestBasic::test_downsample
  /usr/lib/python3.12/site-packages/_pytest/python.py:198: PytestReturnNotNoneWarning: Expected None, but aplpy/tests/test_images.py::TestBasic::test_downsample returned <Figure size 1000x900 with 1 Axes>, which will be an error in a future version of pytest.  Did you mean to use `assert` instead of `return`?
    warnings.warn(

aplpy/tests/test_images.py::TestBasic::test_set_nan_color
  /usr/lib/python3.12/site-packages/_pytest/python.py:198: PytestReturnNotNoneWarning: Expected None, but aplpy/tests/test_images.py::TestBasic::test_set_nan_color returned <Figure size 300x300 with 1 Axes>, which will be an error in a future version of pytest.  Did you mean to use `assert` instead of `return`?
    warnings.warn(

aplpy/tests/test_misc.py::test_nan_color_copy
  /builddir/build/BUILDROOT/APLpy-2.0.3-25.fc40.s390x/usr/lib/python3.12/site-packages/aplpy/core.py:249: RuntimeWarning: More than 20 figures have been opened. Figures created through the pyplot interface (`matplotlib.pyplot.figure`) are retained until explicitly closed and may consume too much memory. (To control this warning, see the rcParam `figure.max_open_warning`). Consider using `matplotlib.pyplot.close()`.
    self._figure = plt.figure(**kwargs)

aplpy/tests/test_rgb.py::TestRGB::test_rgb[False]
  /usr/lib/python3.12/site-packages/_pytest/python.py:198: PytestReturnNotNoneWarning: Expected None, but aplpy/tests/test_rgb.py::TestRGB::test_rgb[False] returned <Figure size 700x500 with 1 Axes>, which will be an error in a future version of pytest.  Did you mean to use `assert` instead of `return`?
    warnings.warn(

aplpy/tests/test_rgb.py::TestRGB::test_rgb[True]
aplpy/tests/test_rgb.py::TestRGB::test_make_rgb_cube[default]
aplpy/tests/test_rgb.py::TestRGB::test_make_rgb_cube[galactic]
  /builddir/build/BUILDROOT/APLpy-2.0.3-25.fc40.s390x/usr/lib/python3.12/site-packages/aplpy/rgb.py:214: UserWarning: PyAVM 0.9.1 or later is not installed, so AVM tags will not be embedded in RGB image
    warnings.warn("PyAVM 0.9.1 or later is not installed, so AVM tags will not be embedded in RGB image")

aplpy/tests/test_vectors.py::TestVectors::test_default
  /usr/lib/python3.12/site-packages/_pytest/python.py:198: PytestReturnNotNoneWarning: Expected None, but aplpy/tests/test_vectors.py::TestVectors::test_default returned <Figure size 400x400 with 1 Axes>, which will be an error in a future version of pytest.  Did you mean to use `assert` instead of `return`?
    warnings.warn(

aplpy/tests/test_vectors.py::TestVectors::test_step_scale
  /usr/lib/python3.12/site-packages/_pytest/python.py:198: PytestReturnNotNoneWarning: Expected None, but aplpy/tests/test_vectors.py::TestVectors::test_step_scale returned <Figure size 400x400 with 1 Axes>, which will be an error in a future version of pytest.  Did you mean to use `assert` instead of `return`?
    warnings.warn(

-- Docs: https://docs.pytest.org/en/stable/how-to/capture-warnings.html
=========================== short test summary info ============================
FAILED aplpy/tests/test_images.py::TestBasic::test_regions - ImportError: The...
FAILED aplpy/tests/test_misc.py::test_stretches - ValueError: a must be > 0 a...
FAILED aplpy/tests/test_rgb.py::TestRGB::test_rgb[True] - ImportError: PyAVM ...
FAILED aplpy/tests/test_rgb.py::TestRGB::test_make_rgb_cube[default] - Import...
FAILED aplpy/tests/test_rgb.py::TestRGB::test_make_rgb_cube[galactic] - Impor...
FAILED aplpy/tests/test_rgb.py::TestRGB::test_make_rgb_cube[false] - ModuleNo...
FAILED aplpy/tests/test_save.py::test_write_png[svg] - IndexError: list index...
FAILED aplpy/tests/test_save.py::test_write_pdf[svg] - IndexError: list index...
FAILED aplpy/tests/test_save.py::test_write_eps[svg] - IndexError: list index...
FAILED aplpy/tests/test_save.py::test_write_stringio[svg] - IndexError: list ...
=========== 10 failed, 248 passed, 1 xfailed, 285 warnings in 14.80s ===========
+ :
+ rm /builddir/build/BUILDROOT/APLpy-2.0.3-25.fc40.s390x//usr/lib/python3.12/site-packages/test_label_format.png
+ popd
~/build/BUILD/APLpy-2.0.3
+ RPM_EC=0
++ jobs -p
+ exit 0
Processing files: python3-APLpy-2.0.3-25.fc40.noarch
Executing(%doc): /bin/sh -e /var/tmp/rpm-tmp.ceUGrP
+ umask 022
+ cd /builddir/build/BUILD
+ cd APLpy-2.0.3
+ DOCDIR=/builddir/build/BUILDROOT/APLpy-2.0.3-25.fc40.s390x/usr/share/doc/python3-APLpy
+ export LC_ALL=
+ LC_ALL=
+ export DOCDIR
+ /usr/bin/mkdir -p /builddir/build/BUILDROOT/APLpy-2.0.3-25.fc40.s390x/usr/share/doc/python3-APLpy
+ cp -pr /builddir/build/BUILD/APLpy-2.0.3/CHANGES.rst /builddir/build/BUILDROOT/APLpy-2.0.3-25.fc40.s390x/usr/share/doc/python3-APLpy
+ cp -pr /builddir/build/BUILD/APLpy-2.0.3/README.rst /builddir/build/BUILDROOT/APLpy-2.0.3-25.fc40.s390x/usr/share/doc/python3-APLpy
+ RPM_EC=0
++ jobs -p
+ exit 0
Executing(%license): /bin/sh -e /var/tmp/rpm-tmp.hyaUMB
+ umask 022
+ cd /builddir/build/BUILD
+ cd APLpy-2.0.3
+ LICENSEDIR=/builddir/build/BUILDROOT/APLpy-2.0.3-25.fc40.s390x/usr/share/licenses/python3-APLpy
+ export LC_ALL=
+ LC_ALL=
+ export LICENSEDIR
+ /usr/bin/mkdir -p /builddir/build/BUILDROOT/APLpy-2.0.3-25.fc40.s390x/usr/share/licenses/python3-APLpy
+ cp -pr /builddir/build/BUILD/APLpy-2.0.3/LICENSE.md /builddir/build/BUILDROOT/APLpy-2.0.3-25.fc40.s390x/usr/share/licenses/python3-APLpy
+ RPM_EC=0
++ jobs -p
+ exit 0
Provides: python-APLpy = 2.0.3-25.fc40 python3-APLpy = 2.0.3-25.fc40 python3.12-APLpy = 2.0.3-25.fc40 python3.12dist(aplpy) = 2.0.3 python3dist(aplpy) = 2.0.3
Requires(rpmlib): rpmlib(CompressedFileNames) <= 3.0.4-1 rpmlib(FileDigests) <= 4.6.0-1 rpmlib(PartialHardlinkSets) <= 4.0.4-1 rpmlib(PayloadFilesHavePrefix) <= 4.0-1
Requires: python(abi) = 3.12
Obsoletes: python-APLpy < 2.0.3-25.fc40
Recommends: python3-pillow
Checking for unpackaged file(s): /usr/lib/rpm/check-files /builddir/build/BUILDROOT/APLpy-2.0.3-25.fc40.s390x
Wrote: /builddir/build/RPMS/python3-APLpy-2.0.3-25.fc40.noarch.rpm
Executing(%clean): /bin/sh -e /var/tmp/rpm-tmp.jQ1NWw
+ umask 022
+ cd /builddir/build/BUILD
+ cd APLpy-2.0.3
+ /usr/bin/rm -rf /builddir/build/BUILDROOT/APLpy-2.0.3-25.fc40.s390x
+ RPM_EC=0
++ jobs -p
+ exit 0
Executing(rmbuild): /bin/sh -e /var/tmp/rpm-tmp.uQLZIM
+ umask 022
+ cd /builddir/build/BUILD
+ rm -rf /builddir/build/BUILD/APLpy-2.0.3-SPECPARTS
+ rm -rf APLpy-2.0.3 APLpy-2.0.3.gemspec
+ RPM_EC=0
++ jobs -p
+ exit 0
Finish: rpmbuild APLpy-2.0.3-25.fc40.src.rpm
Finish: build phase for APLpy-2.0.3-25.fc40.src.rpm
INFO: chroot_scan: 1 files copied to /var/lib/copr-rpmbuild/results/chroot_scan
INFO: /var/lib/mock/fedora-rawhide-s390x-1705966360.259598/root/var/log/dnf5.log
INFO: Done(/var/lib/copr-rpmbuild/results/APLpy-2.0.3-25.fc40.src.rpm) Config(child) 0 minutes 30 seconds
INFO: Results and/or logs in: /var/lib/copr-rpmbuild/results
INFO: Cleaning up build root ('cleanup_on_success=True')
Start: clean chroot
INFO: unmounting tmpfs.
Finish: clean chroot
Finish: run
Running RPMResults tool
Package info:
{
    "packages": [
        {
            "name": "APLpy",
            "epoch": null,
            "version": "2.0.3",
            "release": "25.fc40",
            "arch": "src"
        },
        {
            "name": "python3-APLpy",
            "epoch": null,
            "version": "2.0.3",
            "release": "25.fc40",
            "arch": "noarch"
        }
    ]
}
RPMResults finished