Warning: Permanently added '34.224.100.12' (ED25519) to the list of known hosts.
Running (timeout=18000): unbuffer mock --spec /var/lib/copr-rpmbuild/workspace/workdir-en7y0r2q/python-rasterio/python-rasterio.spec --sources /var/lib/copr-rpmbuild/workspace/workdir-en7y0r2q/python-rasterio --resultdir /var/lib/copr-rpmbuild/results --uniqueext 1733463030.252321 -r /var/lib/copr-rpmbuild/results/configs/child.cfg
INFO: mock.py version 5.9 starting (python version = 3.13.0, NVR = mock-5.9-1.fc41), args: /usr/libexec/mock/mock --spec /var/lib/copr-rpmbuild/workspace/workdir-en7y0r2q/python-rasterio/python-rasterio.spec --sources /var/lib/copr-rpmbuild/workspace/workdir-en7y0r2q/python-rasterio --resultdir /var/lib/copr-rpmbuild/results --uniqueext 1733463030.252321 -r /var/lib/copr-rpmbuild/results/configs/child.cfg
Start(bootstrap): init plugins
INFO: tmpfs initialized
INFO: selinux enabled
INFO: chroot_scan: initialized
INFO: compress_logs: initialized
Finish(bootstrap): init plugins
Start: init plugins
INFO: tmpfs initialized
INFO: selinux enabled
INFO: chroot_scan: initialized
INFO: compress_logs: initialized
Finish: init plugins
INFO: Signal handler active
Start: run
INFO: Start(/var/lib/copr-rpmbuild/workspace/workdir-en7y0r2q/python-rasterio/python-rasterio.spec)  Config(fedora-39-aarch64)
Start: clean chroot
Finish: clean chroot
Mock Version: 5.9
INFO: Mock Version: 5.9
Start(bootstrap): chroot init
INFO: mounting tmpfs at /var/lib/mock/fedora-39-aarch64-bootstrap-1733463030.252321/root.
INFO: calling preinit hooks
INFO: enabled root cache
INFO: enabled package manager cache
Start(bootstrap): cleaning package manager metadata
Finish(bootstrap): cleaning package manager metadata
INFO: Guessed host environment type: unknown
INFO: Using bootstrap image: registry.fedoraproject.org/fedora:39
INFO: Pulling image: registry.fedoraproject.org/fedora:39
INFO: Copy content of container registry.fedoraproject.org/fedora:39 to /var/lib/mock/fedora-39-aarch64-bootstrap-1733463030.252321/root
INFO: Checking that registry.fedoraproject.org/fedora:39 image matches host's architecture
INFO: mounting registry.fedoraproject.org/fedora:39 with podman image mount
INFO: image registry.fedoraproject.org/fedora:39 as /var/lib/containers/storage/overlay/5acd9ba9825a2c2ec8c7534bebfea6f809d156320a167dae1c9ddbe095466a28/merged
INFO: umounting image registry.fedoraproject.org/fedora:39 (/var/lib/containers/storage/overlay/5acd9ba9825a2c2ec8c7534bebfea6f809d156320a167dae1c9ddbe095466a28/merged) with podman image umount
INFO: Package manager dnf4 detected and used (fallback)
INFO: Bootstrap image not marked ready
Start(bootstrap): installing dnf tooling
No matches found for the following disable plugin patterns: local, spacewalk, versionlock
Copr repository                                  27 MB/s | 1.7 MB     00:00    
Additional repo http_kojipkgs_fedoraproject_org 173 MB/s |  58 MB     00:00    
fedora                                           55 MB/s |  86 MB     00:01    
updates                                          55 MB/s |  40 MB     00:00    
Package python3-dnf-4.21.1-1.fc39.noarch is already installed.
Dependencies resolved.
============================================================================================================================
 Package                      Arch     Version          Repository                                                      Size
============================================================================================================================
Installing:
 dnf5                         aarch64  5.2.8.1-1.fc42   http_kojipkgs_fedoraproject_org_repos_rawhide_latest_basearch  709 k
     replacing  dnf.noarch 4.21.1-1.fc39
     replacing  yum.noarch 4.21.1-1.fc39
 python3-dnf-plugins-core     noarch   4.10.0-1.fc42    http_kojipkgs_fedoraproject_org_repos_rawhide_latest_basearch  300 k
Upgrading:
 dnf-data                     noarch   4.22.0-1.fc42    http_kojipkgs_fedoraproject_org_repos_rawhide_latest_basearch   40 k
 libcomps                     aarch64  0.1.21-3.fc41    http_kojipkgs_fedoraproject_org_repos_rawhide_latest_basearch   76 k
 libdnf                       aarch64  0.73.4-1.fc42    http_kojipkgs_fedoraproject_org_repos_rawhide_latest_basearch  634 k
 libstdc++                    aarch64  14.2.1-6.fc42    http_kojipkgs_fedoraproject_org_repos_rawhide_latest_basearch  834 k
 python3                      aarch64  3.13.0-1.fc42    http_kojipkgs_fedoraproject_org_repos_rawhide_latest_basearch   28 k
 python3-dnf                  noarch   4.22.0-1.fc42    http_kojipkgs_fedoraproject_org_repos_rawhide_latest_basearch  588 k
 python3-hawkey               aarch64  0.73.4-1.fc42    http_kojipkgs_fedoraproject_org_repos_rawhide_latest_basearch   96 k
 python3-libcomps             aarch64  0.1.21-3.fc41    http_kojipkgs_fedoraproject_org_repos_rawhide_latest_basearch   48 k
 python3-libdnf               aarch64  0.73.4-1.fc42    http_kojipkgs_fedoraproject_org_repos_rawhide_latest_basearch  795 k
 python3-libs                 aarch64  3.13.0-1.fc42    http_kojipkgs_fedoraproject_org_repos_rawhide_latest_basearch  8.7 M
 python3-rpm                  aarch64  4.20.0-1.fc42    http_kojipkgs_fedoraproject_org_repos_rawhide_latest_basearch   69 k
 rpm                          aarch64  4.20.0-1.fc42    http_kojipkgs_fedoraproject_org_repos_rawhide_latest_basearch  521 k
 rpm-build-libs               aarch64  4.20.0-1.fc42    http_kojipkgs_fedoraproject_org_repos_rawhide_latest_basearch   95 k
 rpm-libs                     aarch64  4.20.0-1.fc42    http_kojipkgs_fedoraproject_org_repos_rawhide_latest_basearch  303 k
 rpm-sign-libs                aarch64  4.20.0-1.fc42    http_kojipkgs_fedoraproject_org_repos_rawhide_latest_basearch   26 k
Installing dependencies:
 dbus-libs                    aarch64  1:1.14.10-4.fc41 http_kojipkgs_fedoraproject_org_repos_rawhide_latest_basearch  155 k
 fmt                          aarch64  11.0.2-2.fc42    http_kojipkgs_fedoraproject_org_repos_rawhide_latest_basearch   98 k
 ima-evm-utils-libs           aarch64  1.6.2-3.fc42     http_kojipkgs_fedoraproject_org_repos_rawhide_latest_basearch   30 k
     replacing  ima-evm-utils.aarch64 1.5-2.fc39
 libdnf5                      aarch64  5.2.8.1-1.fc42   http_kojipkgs_fedoraproject_org_repos_rawhide_latest_basearch  1.0 M
 libdnf5-cli                  aarch64  5.2.8.1-1.fc42   http_kojipkgs_fedoraproject_org_repos_rawhide_latest_basearch  313 k
 python3-dateutil             noarch   1:2.8.2-16.fc41  http_kojipkgs_fedoraproject_org_repos_rawhide_latest_basearch  349 k
 python3-dbus                 aarch64  1.3.2-8.fc41     http_kojipkgs_fedoraproject_org_repos_rawhide_latest_basearch  147 k
 python3-distro               noarch   1.9.0-5.fc41     http_kojipkgs_fedoraproject_org_repos_rawhide_latest_basearch   47 k
 python3-six                  noarch   1.16.0-23.fc41   http_kojipkgs_fedoraproject_org_repos_rawhide_latest_basearch   41 k
 python3-systemd              aarch64  235-11.fc41      http_kojipkgs_fedoraproject_org_repos_rawhide_latest_basearch  101 k
 sdbus-cpp                    aarch64  1.5.0-3.fc41     http_kojipkgs_fedoraproject_org_repos_rawhide_latest_basearch  103 k

Transaction Summary
============================================================================================================================
Install  13 Packages
Upgrade  15 Packages

Total download size: 16 M
Downloading Packages:
(1/28): fmt-11.0.2-2.fc42.aarch64.rpm           3.3 MB/s |  98 kB     00:00    
(2/28): dbus-libs-1.14.10-4.fc41.aarch64.rpm    4.9 MB/s | 155 kB     00:00    
(3/28): ima-evm-utils-libs-1.6.2-3.fc42.aarch64 6.5 MB/s |  30 kB     00:00    
(4/28): dnf5-5.2.8.1-1.fc42.aarch64.rpm          19 MB/s | 709 kB     00:00    
(5/28): libdnf5-5.2.8.1-1.fc42.aarch64.rpm      104 MB/s | 1.0 MB     00:00    
(6/28): libdnf5-cli-5.2.8.1-1.fc42.aarch64.rpm   35 MB/s | 313 kB     00:00    
(7/28): python3-dateutil-2.8.2-16.fc41.noarch.r  45 MB/s | 349 kB     00:00    
(8/28): python3-distro-1.9.0-5.fc41.noarch.rpm   11 MB/s |  47 kB     00:00    
(9/28): python3-dbus-1.3.2-8.fc41.aarch64.rpm    19 MB/s | 147 kB     00:00    
(10/28): python3-dnf-plugins-core-4.10.0-1.fc42  56 MB/s | 300 kB     00:00    
(11/28): python3-six-1.16.0-23.fc41.noarch.rpm   10 MB/s |  41 kB     00:00    
(12/28): python3-systemd-235-11.fc41.aarch64.rp  25 MB/s | 101 kB     00:00    
(13/28): sdbus-cpp-1.5.0-3.fc41.aarch64.rpm      25 MB/s | 103 kB     00:00    
(14/28): dnf-data-4.22.0-1.fc42.noarch.rpm       12 MB/s |  40 kB     00:00    
(15/28): libcomps-0.1.21-3.fc41.aarch64.rpm      18 MB/s |  76 kB     00:00    
(16/28): libdnf-0.73.4-1.fc42.aarch64.rpm       102 MB/s | 634 kB     00:00    
(17/28): libstdc++-14.2.1-6.fc42.aarch64.rpm     92 MB/s | 834 kB     00:00    
(18/28): python3-3.13.0-1.fc42.aarch64.rpm      4.0 MB/s |  28 kB     00:00    
(19/28): python3-dnf-4.22.0-1.fc42.noarch.rpm    78 MB/s | 588 kB     00:00    
(20/28): python3-hawkey-0.73.4-1.fc42.aarch64.r  20 MB/s |  96 kB     00:00    
(21/28): python3-libcomps-0.1.21-3.fc41.aarch64  10 MB/s |  48 kB     00:00    
(22/28): python3-libdnf-0.73.4-1.fc42.aarch64.r  92 MB/s | 795 kB     00:00    
(23/28): python3-rpm-4.20.0-1.fc42.aarch64.rpm   10 MB/s |  69 kB     00:00    
(24/28): rpm-build-libs-4.20.0-1.fc42.aarch64.r  15 MB/s |  95 kB     00:00    
(25/28): rpm-4.20.0-1.fc42.aarch64.rpm           54 MB/s | 521 kB     00:00    
(26/28): rpm-libs-4.20.0-1.fc42.aarch64.rpm      39 MB/s | 303 kB     00:00    
(27/28): rpm-sign-libs-4.20.0-1.fc42.aarch64.rp 5.0 MB/s |  26 kB     00:00    
(28/28): python3-libs-3.13.0-1.fc42.aarch64.rpm 168 MB/s | 8.7 MB     00:00    
--------------------------------------------------------------------------------
Total                                           127 MB/s |  16 MB     00:00     
Running transaction check
Transaction check succeeded.
Running transaction test
Transaction test succeeded.
Running transaction
  Preparing        :                                                        1/1 
  Upgrading        : python3-libs-3.13.0-1.fc42.aarch64                    1/46 
  Upgrading        : python3-3.13.0-1.fc42.aarch64                         2/46 
  Upgrading        : libstdc++-14.2.1-6.fc42.aarch64                       3/46 
  Upgrading        : rpm-libs-4.20.0-1.fc42.aarch64                        4/46 
  Installing       : fmt-11.0.2-2.fc42.aarch64                             5/46 
  Installing       : libdnf5-5.2.8.1-1.fc42.aarch64                        6/46 
warning: /etc/dnf/dnf.conf created as /etc/dnf/dnf.conf.rpmnew

  Upgrading        : libdnf-0.73.4-1.fc42.aarch64                          7/46 
  Upgrading        : python3-libdnf-0.73.4-1.fc42.aarch64                  8/46 
  Upgrading        : python3-hawkey-0.73.4-1.fc42.aarch64                  9/46 
  Installing       : libdnf5-cli-5.2.8.1-1.fc42.aarch64                   10/46 
  Upgrading        : dnf-data-4.22.0-1.fc42.noarch                        11/46 
  Upgrading        : rpm-build-libs-4.20.0-1.fc42.aarch64                 12/46 
  Installing       : sdbus-cpp-1.5.0-3.fc41.aarch64                       13/46 
  Installing       : python3-distro-1.9.0-5.fc41.noarch                   14/46 
  Installing       : python3-six-1.16.0-23.fc41.noarch                    15/46 
  Installing       : python3-dateutil-1:2.8.2-16.fc41.noarch              16/46 
  Installing       : python3-systemd-235-11.fc41.aarch64                  17/46 
  Upgrading        : libcomps-0.1.21-3.fc41.aarch64                       18/46 
  Upgrading        : python3-libcomps-0.1.21-3.fc41.aarch64               19/46 
  Installing       : ima-evm-utils-libs-1.6.2-3.fc42.aarch64              20/46 
  Upgrading        : rpm-sign-libs-4.20.0-1.fc42.aarch64                  21/46 
  Upgrading        : python3-rpm-4.20.0-1.fc42.aarch64                    22/46 
  Upgrading        : python3-dnf-4.22.0-1.fc42.noarch                     23/46 
  Installing       : dbus-libs-1:1.14.10-4.fc41.aarch64                   24/46 
  Installing       : python3-dbus-1.3.2-8.fc41.aarch64                    25/46 
  Installing       : python3-dnf-plugins-core-4.10.0-1.fc42.noarch        26/46 
  Installing       : dnf5-5.2.8.1-1.fc42.aarch64                          27/46 
  Running scriptlet: dnf5-5.2.8.1-1.fc42.aarch64                          27/46 
  Running scriptlet: rpm-4.20.0-1.fc42.aarch64                            28/46 
  Upgrading        : rpm-4.20.0-1.fc42.aarch64                            28/46 
  Obsoleting       : yum-4.21.1-1.fc39.noarch                             29/46 
  Cleanup          : rpm-4.19.1.1-1.fc39.aarch64                          30/46 
  Running scriptlet: dnf-4.21.1-1.fc39.noarch                             31/46 
  Obsoleting       : dnf-4.21.1-1.fc39.noarch                             31/46 
  Running scriptlet: dnf-4.21.1-1.fc39.noarch                             31/46 
  Cleanup          : python3-dnf-4.21.1-1.fc39.noarch                     32/46 
  Cleanup          : python3-hawkey-0.73.3-1.fc39.aarch64                 33/46 
  Cleanup          : python3-libdnf-0.73.3-1.fc39.aarch64                 34/46 
  Cleanup          : libdnf-0.73.3-1.fc39.aarch64                         35/46 
  Cleanup          : python3-rpm-4.19.1.1-1.fc39.aarch64                  36/46 
  Cleanup          : rpm-sign-libs-4.19.1.1-1.fc39.aarch64                37/46 
  Cleanup          : python3-libcomps-0.1.20-1.fc39.aarch64               38/46 
  Cleanup          : dnf-data-4.21.1-1.fc39.noarch                        39/46 
  Cleanup          : rpm-build-libs-4.19.1.1-1.fc39.aarch64               40/46 
  Cleanup          : python3-libs-3.12.7-1.fc39.aarch64                   41/46 
  Cleanup          : python3-3.12.7-1.fc39.aarch64                        42/46 
  Cleanup          : rpm-libs-4.19.1.1-1.fc39.aarch64                     43/46 
  Cleanup          : libcomps-0.1.20-1.fc39.aarch64                       44/46 
  Obsoleting       : ima-evm-utils-1.5-2.fc39.aarch64                     45/46 
  Cleanup          : libstdc++-13.3.1-3.fc39.aarch64                      46/46 
  Running scriptlet: rpm-4.20.0-1.fc42.aarch64                            46/46 
  Running scriptlet: libstdc++-13.3.1-3.fc39.aarch64                      46/46 
  Verifying        : dbus-libs-1:1.14.10-4.fc41.aarch64                    1/46 
  Verifying        : dnf5-5.2.8.1-1.fc42.aarch64                           2/46 
  Verifying        : dnf-4.21.1-1.fc39.noarch                              3/46 
  Verifying        : yum-4.21.1-1.fc39.noarch                              4/46 
  Verifying        : fmt-11.0.2-2.fc42.aarch64                             5/46 
  Verifying        : ima-evm-utils-libs-1.6.2-3.fc42.aarch64               6/46 
  Verifying        : ima-evm-utils-1.5-2.fc39.aarch64                      7/46 
  Verifying        : libdnf5-5.2.8.1-1.fc42.aarch64                        8/46 
  Verifying        : libdnf5-cli-5.2.8.1-1.fc42.aarch64                    9/46 
  Verifying        : python3-dateutil-1:2.8.2-16.fc41.noarch              10/46 
  Verifying        : python3-dbus-1.3.2-8.fc41.aarch64                    11/46 
  Verifying        : python3-distro-1.9.0-5.fc41.noarch                   12/46 
  Verifying        : python3-dnf-plugins-core-4.10.0-1.fc42.noarch        13/46 
  Verifying        : python3-six-1.16.0-23.fc41.noarch                    14/46 
  Verifying        : python3-systemd-235-11.fc41.aarch64                  15/46 
  Verifying        : sdbus-cpp-1.5.0-3.fc41.aarch64                       16/46 
  Verifying        : dnf-data-4.22.0-1.fc42.noarch                        17/46 
  Verifying        : dnf-data-4.21.1-1.fc39.noarch                        18/46 
  Verifying        : libcomps-0.1.21-3.fc41.aarch64                       19/46 
  Verifying        : libcomps-0.1.20-1.fc39.aarch64                       20/46 
  Verifying        : libdnf-0.73.4-1.fc42.aarch64                         21/46 
  Verifying        : libdnf-0.73.3-1.fc39.aarch64                         22/46 
  Verifying        : libstdc++-14.2.1-6.fc42.aarch64                      23/46 
  Verifying        : libstdc++-13.3.1-3.fc39.aarch64                      24/46 
  Verifying        : python3-3.13.0-1.fc42.aarch64                        25/46 
  Verifying        : python3-3.12.7-1.fc39.aarch64                        26/46 
  Verifying        : python3-dnf-4.22.0-1.fc42.noarch                     27/46 
  Verifying        : python3-dnf-4.21.1-1.fc39.noarch                     28/46 
  Verifying        : python3-hawkey-0.73.4-1.fc42.aarch64                 29/46 
  Verifying        : python3-hawkey-0.73.3-1.fc39.aarch64                 30/46 
  Verifying        : python3-libcomps-0.1.21-3.fc41.aarch64               31/46 
  Verifying        : python3-libcomps-0.1.20-1.fc39.aarch64               32/46 
  Verifying        : python3-libdnf-0.73.4-1.fc42.aarch64                 33/46 
  Verifying        : python3-libdnf-0.73.3-1.fc39.aarch64                 34/46 
  Verifying        : python3-libs-3.13.0-1.fc42.aarch64                   35/46 
  Verifying        : python3-libs-3.12.7-1.fc39.aarch64                   36/46 
  Verifying        : python3-rpm-4.20.0-1.fc42.aarch64                    37/46 
  Verifying        : python3-rpm-4.19.1.1-1.fc39.aarch64                  38/46 
  Verifying        : rpm-4.20.0-1.fc42.aarch64                            39/46 
  Verifying        : rpm-4.19.1.1-1.fc39.aarch64                          40/46 
  Verifying        : rpm-build-libs-4.20.0-1.fc42.aarch64                 41/46 
  Verifying        : rpm-build-libs-4.19.1.1-1.fc39.aarch64               42/46 
  Verifying        : rpm-libs-4.20.0-1.fc42.aarch64                       43/46 
  Verifying        : rpm-libs-4.19.1.1-1.fc39.aarch64                     44/46 
  Verifying        : rpm-sign-libs-4.20.0-1.fc42.aarch64                  45/46 
  Verifying        : rpm-sign-libs-4.19.1.1-1.fc39.aarch64                46/46 

Upgraded:
  dnf-data-4.22.0-1.fc42.noarch         libcomps-0.1.21-3.fc41.aarch64         
  libdnf-0.73.4-1.fc42.aarch64          libstdc++-14.2.1-6.fc42.aarch64        
  python3-3.13.0-1.fc42.aarch64         python3-dnf-4.22.0-1.fc42.noarch       
  python3-hawkey-0.73.4-1.fc42.aarch64  python3-libcomps-0.1.21-3.fc41.aarch64 
  python3-libdnf-0.73.4-1.fc42.aarch64  python3-libs-3.13.0-1.fc42.aarch64     
  python3-rpm-4.20.0-1.fc42.aarch64     rpm-4.20.0-1.fc42.aarch64              
  rpm-build-libs-4.20.0-1.fc42.aarch64  rpm-libs-4.20.0-1.fc42.aarch64         
  rpm-sign-libs-4.20.0-1.fc42.aarch64  
Installed:
  dbus-libs-1:1.14.10-4.fc41.aarch64                                            
  dnf5-5.2.8.1-1.fc42.aarch64                                                   
  fmt-11.0.2-2.fc42.aarch64                                                     
  ima-evm-utils-libs-1.6.2-3.fc42.aarch64                                       
  libdnf5-5.2.8.1-1.fc42.aarch64                                                
  libdnf5-cli-5.2.8.1-1.fc42.aarch64                                            
  python3-dateutil-1:2.8.2-16.fc41.noarch                                       
  python3-dbus-1.3.2-8.fc41.aarch64                                             
  python3-distro-1.9.0-5.fc41.noarch                                            
  python3-dnf-plugins-core-4.10.0-1.fc42.noarch                                 
  python3-six-1.16.0-23.fc41.noarch                                             
  python3-systemd-235-11.fc41.aarch64                                           
  sdbus-cpp-1.5.0-3.fc41.aarch64                                                

Complete!
Finish(bootstrap): installing dnf tooling
Start(bootstrap): creating root cache
Finish(bootstrap): creating root cache
Finish(bootstrap): chroot init
Start: chroot init
INFO: mounting tmpfs at /var/lib/mock/fedora-39-aarch64-1733463030.252321/root.
INFO: calling preinit hooks
INFO: enabled root cache
INFO: enabled package manager cache
Start: cleaning package manager metadata
Finish: cleaning package manager metadata
INFO: enabled HW Info plugin
INFO: Package manager dnf4 detected and used (direct choice)
INFO: Buildroot is handled by package management downloaded with a bootstrap image:
  rpm-4.20.0-1.fc42.aarch64
  rpm-sequoia-1.7.0-1.fc39.aarch64
  python3-dnf-4.22.0-1.fc42.noarch
  python3-dnf-plugins-core-4.10.0-1.fc42.noarch
  dnf5-5.2.8.1-1.fc42.aarch64
Start: installing minimal buildroot with dnf
Traceback (most recent call last):
  File "/usr/bin/dnf-3", line 56, in <module>
    from dnf.cli import main
  File "/usr/lib/python3.13/site-packages/dnf/__init__.py", line 30, in <module>
    import dnf.base
  File "/usr/lib/python3.13/site-packages/dnf/base.py", line 29, in <module>
    import libdnf.transaction
  File "/usr/lib64/python3.13/site-packages/libdnf/__init__.py", line 14, in <module>
    from . import conf
  File "/usr/lib64/python3.13/site-packages/libdnf/conf.py", line 10, in <module>
    from . import _conf
ImportError: /lib64/libdnf.so.2: undefined symbol: g_once_init_enter_pointer
WARNING: DNF4 command failed, retrying, attempt #2, sleeping 10s
Traceback (most recent call last):
  File "/usr/bin/dnf-3", line 56, in <module>
    from dnf.cli import main
  File "/usr/lib/python3.13/site-packages/dnf/__init__.py", line 30, in <module>
    import dnf.base
  File "/usr/lib/python3.13/site-packages/dnf/base.py", line 29, in <module>
    import libdnf.transaction
  File "/usr/lib64/python3.13/site-packages/libdnf/__init__.py", line 14, in <module>
    from . import conf
  File "/usr/lib64/python3.13/site-packages/libdnf/conf.py", line 10, in <module>
    from . import _conf
ImportError: /lib64/libdnf.so.2: undefined symbol: g_once_init_enter_pointer
WARNING: DNF4 command failed, retrying, attempt #3, sleeping 10s
Traceback (most recent call last):
  File "/usr/bin/dnf-3", line 56, in <module>
    from dnf.cli import main
  File "/usr/lib/python3.13/site-packages/dnf/__init__.py", line 30, in <module>
    import dnf.base
  File "/usr/lib/python3.13/site-packages/dnf/base.py", line 29, in <module>
    import libdnf.transaction
  File "/usr/lib64/python3.13/site-packages/libdnf/__init__.py", line 14, in <module>
    from . import conf
  File "/usr/lib64/python3.13/site-packages/libdnf/conf.py", line 10, in <module>
    from . import _conf
ImportError: /lib64/libdnf.so.2: undefined symbol: g_once_init_enter_pointer
ERROR: Exception(/var/lib/copr-rpmbuild/workspace/workdir-en7y0r2q/python-rasterio/python-rasterio.spec) Config(fedora-39-aarch64) 1 minutes 15 seconds
INFO: Results and/or logs in: /var/lib/copr-rpmbuild/results
INFO: Cleaning up build root ('cleanup_on_failure=True')
Start: clean chroot
INFO: unmounting tmpfs.
Finish: clean chroot
ERROR: Command failed: 
 # /usr/bin/systemd-nspawn -q -M 8747c7e33908434dba3d4c4f35eae75a -D /var/lib/mock/fedora-39-aarch64-bootstrap-1733463030.252321/root -a --capability=cap_ipc_lock --rlimit=RLIMIT_NOFILE=10240 --capability=cap_ipc_lock --bind=/tmp/mock-resolv.9f4dxk13:/etc/resolv.conf --console=pipe --setenv=TERM=vt100 --setenv=SHELL=/bin/bash --setenv=HOME=/var/lib/mock/fedora-39-aarch64-1733463030.252321/root/installation-homedir --setenv=HOSTNAME=mock --setenv=PATH=/usr/bin:/bin:/usr/sbin:/sbin '--setenv=PROMPT_COMMAND=printf "\033]0;<mock-chroot>\007"' '--setenv=PS1=<mock-chroot> \s-\v\$ ' --setenv=LANG=C.UTF-8 --setenv=LC_MESSAGES=C.UTF-8 --setenv=SYSTEMD_NSPAWN_TMPFS_TMP=0 --setenv=SYSTEMD_SECCOMP=0 --resolv-conf=off /usr/bin/dnf-3 --installroot /var/lib/mock/fedora-39-aarch64-1733463030.252321/root/ --releasever 39 --setopt=deltarpm=False --setopt=allow_vendor_change=yes --allowerasing --disableplugin=local --disableplugin=spacewalk --disableplugin=versionlock install @buildsys-build --setopt=tsflags=nocontexts --setopt=tsflags=nocontexts --setopt=tsflags=nocontexts
Traceback (most recent call last):
  File "/usr/bin/dnf-3", line 56, in <module>
    from dnf.cli import main
  File "/usr/lib/python3.13/site-packages/dnf/__init__.py", line 30, in <module>
    import dnf.base
  File "/usr/lib/python3.13/site-packages/dnf/base.py", line 29, in <module>
    import libdnf.transaction
  File "/usr/lib64/python3.13/site-packages/libdnf/__init__.py", line 14, in <module>
    from . import conf
  File "/usr/lib64/python3.13/site-packages/libdnf/conf.py", line 10, in <module>
    from . import _conf
ImportError: /lib64/libdnf.so.2: undefined symbol: g_once_init_enter_pointer

Copr build error: Build failed