10-02 16:09 root         DEBUG    fedora-review 0.10.0 e79b66b 2023-07-24 17:28:48 -0500 started
10-02 16:09 root         DEBUG    Command  line: /bin/fedora-review --no-colors --prebuilt --rpm-spec --name hpnssh --mock-config /var/lib/copr-rpmbuild/results/configs/child.cfg
10-02 16:09 root         INFO     Processing local files: hpnssh
10-02 16:09 root         DEBUG    Active settings after processing options
10-02 16:09 root         DEBUG        bz_url: https://bugzilla.redhat.com
10-02 16:09 root         DEBUG        _con_handler: <StreamHandler <stderr> (INFO)>
10-02 16:09 root         DEBUG        _log_config_done: True
10-02 16:09 root         DEBUG        cache: False
10-02 16:09 root         DEBUG        resultdir: None
10-02 16:09 root         DEBUG        init_done: True
10-02 16:09 root         DEBUG        uniqueext: None
10-02 16:09 root         DEBUG        configdir: None
10-02 16:09 root         DEBUG        log_level: 20
10-02 16:09 root         DEBUG        prebuilt: True
10-02 16:09 root         DEBUG        verbose: False
10-02 16:09 root         DEBUG        name: hpnssh
10-02 16:09 root         DEBUG        use_colors: False
10-02 16:09 root         DEBUG        session_log: /var/lib/copr-rpmbuild/results/cache/fedora-review.log
10-02 16:09 root         DEBUG        bug: None
10-02 16:09 root         DEBUG        url: None
10-02 16:09 root         DEBUG        copr_build_descriptor: None
10-02 16:09 root         DEBUG        list_checks: False
10-02 16:09 root         DEBUG        list_flags: False
10-02 16:09 root         DEBUG        list_plugins: False
10-02 16:09 root         DEBUG        version: False
10-02 16:09 root         DEBUG        flags: []
10-02 16:09 root         DEBUG        repo: None
10-02 16:09 root         DEBUG        mock_config: /var/lib/copr-rpmbuild/results/configs/child.cfg
10-02 16:09 root         DEBUG        no_report: False
10-02 16:09 root         DEBUG        nobuild: False
10-02 16:09 root         DEBUG        mock_options: --no-cleanup-after --no-clean  --plugin-option=tmpfs:keep_mounted=True 
10-02 16:09 root         DEBUG        other_bz: None
10-02 16:09 root         DEBUG        plugins_arg: None
10-02 16:09 root         DEBUG        single: None
10-02 16:09 root         DEBUG        rpm_spec: True
10-02 16:09 root         DEBUG        exclude: None
10-02 16:09 root         DEBUG        checksum: sha256
10-02 16:09 root         DEBUG        plugins: {}
10-02 16:09 root         INFO     Getting .spec and .srpm Urls from : Local files in /var/lib/copr-rpmbuild/results
10-02 16:09 root         INFO       --> SRPM url: file:///var/lib/copr-rpmbuild/results/hpnssh-9.9p1_hpn18.6.0-1.fc40.src.rpm
10-02 16:09 root         INFO     Using review directory: /var/lib/copr-rpmbuild/results/hpnssh
10-02 16:09 root         DEBUG    find_urls completed: 0.039
10-02 16:09 root         DEBUG    Avoiding init of working mock root
10-02 16:09 root         DEBUG    Url download completed: 48.421
10-02 16:09 root         INFO     No upstream for (Source17): sshd-suse.pam
10-02 16:09 root         INFO     No upstream for (Source16): series
10-02 16:09 root         INFO     No upstream for (Source14): hpnsshd.sysuser
10-02 16:09 root         INFO     No upstream for (Source13): hpnssh-agent.socket
10-02 16:09 root         INFO     No upstream for (Source12): hpnssh-agent.service
10-02 16:09 root         INFO     No upstream for (Source11): hpnsshd-keygen.target
10-02 16:09 root         INFO     No upstream for (Source10): hpnsshd-keygen
10-02 16:09 root         INFO     No upstream for (Source9): hpnsshd-keygen@.service
10-02 16:09 root         INFO     No upstream for (Source8): hpnsshd.service
10-02 16:09 root         INFO     No upstream for (Source7): hpnsshd.socket
10-02 16:09 root         INFO     No upstream for (Source6): hpnsshd@.service
10-02 16:09 root         INFO     No upstream for (Source5): hpnsshd.sysconfig
10-02 16:09 root         INFO     No upstream for (Source4): hpnssh-keycat.pam
10-02 16:09 root         DEBUG      --> /var/lib/copr-rpmbuild/results/hpnssh/upstream : https://github.com/rapier1/hpnssh-fedora/blob/main/SOURCES/CJR-GPG-KEY.gpg
10-02 16:09 root         INFO     Downloading (Source3): https://github.com/rapier1/hpnssh-fedora/blob/main/SOURCES/CJR-GPG-KEY.gpg
10-02 16:09 root         INFO     No upstream for (Source2): hpnsshd.pam
10-02 16:09 root         DEBUG      --> /var/lib/copr-rpmbuild/results/hpnssh/upstream : https://github.com/rapier1/hpnssh-fedora/blob/main/SOURCES/hpnssh-9.9p1_hpn18.6.0.tar.gz.asc
10-02 16:09 root         INFO     Downloading (Source1): https://github.com/rapier1/hpnssh-fedora/blob/main/SOURCES/hpnssh-9.9p1_hpn18.6.0.tar.gz.asc
10-02 16:09 root         DEBUG    Download error on https://github.com/rapier1/hpnssh-fedora/blob/main/SOURCES/hpnssh-9.9p1_hpn18.6.0.tar.gz.asc, : 'Error HTTP Error 404: Not Found downloading https://github.com/rapier1/hpnssh-fedora/blob/main/SOURCES/hpnssh-9.9p1_hpn18.6.0.tar.gz.asc'
Traceback (most recent call last):
  File "/usr/lib/python3.12/site-packages/FedoraReview/helpers_mixin.py", line 89, in urlretrieve
    istream = urllib.request.urlopen(url)
              ^^^^^^^^^^^^^^^^^^^^^^^^^^^
  File "/usr/lib64/python3.12/urllib/request.py", line 215, in urlopen
    return opener.open(url, data, timeout)
           ^^^^^^^^^^^^^^^^^^^^^^^^^^^^^^^
  File "/usr/lib64/python3.12/urllib/request.py", line 521, in open
    response = meth(req, response)
               ^^^^^^^^^^^^^^^^^^^
  File "/usr/lib64/python3.12/urllib/request.py", line 630, in http_response
    response = self.parent.error(
               ^^^^^^^^^^^^^^^^^^
  File "/usr/lib64/python3.12/urllib/request.py", line 559, in error
    return self._call_chain(*args)
           ^^^^^^^^^^^^^^^^^^^^^^^
  File "/usr/lib64/python3.12/urllib/request.py", line 492, in _call_chain
    result = func(*args)
             ^^^^^^^^^^^
  File "/usr/lib64/python3.12/urllib/request.py", line 639, in http_error_default
    raise HTTPError(req.full_url, code, msg, hdrs, fp)
urllib.error.HTTPError: HTTP Error 404: Not Found

During handling of the above exception, another exception occurred:

Traceback (most recent call last):
  File "/usr/lib/python3.12/site-packages/FedoraReview/source.py", line 76, in __init__
    self.filename = self._get_file(url, ReviewDirs.upstream, my_logger)
                    ^^^^^^^^^^^^^^^^^^^^^^^^^^^^^^^^^^^^^^^^^^^^^^^^^^^
  File "/usr/lib/python3.12/site-packages/FedoraReview/helpers_mixin.py", line 112, in _get_file
    self.urlretrieve(link, path)
  File "/usr/lib/python3.12/site-packages/FedoraReview/helpers_mixin.py", line 98, in urlretrieve
    raise DownloadError(str(err), url)
FedoraReview.helpers_mixin.DownloadError: 'Error HTTP Error 404: Not Found downloading https://github.com/rapier1/hpnssh-fedora/blob/main/SOURCES/hpnssh-9.9p1_hpn18.6.0.tar.gz.asc'
10-02 16:09 root         WARNING  Cannot download url: https://github.com/rapier1/hpnssh-fedora/blob/main/SOURCES/hpnssh-9.9p1_hpn18.6.0.tar.gz.asc
10-02 16:09 root         INFO     No upstream for (Source1): hpnssh-9.9p1_hpn18.6.0.tar.gz.asc
10-02 16:09 root         DEBUG      --> /var/lib/copr-rpmbuild/results/hpnssh/upstream : https://github.com/rapier1/hpnssh-fedora/blob/main/SOURCES/hpnssh-9.9p1_hpn18.6.0.tar.gz
10-02 16:09 root         INFO     Downloading (Source0): https://github.com/rapier1/hpnssh-fedora/blob/main/SOURCES/hpnssh-9.9p1_hpn18.6.0.tar.gz
10-02 16:09 root         DEBUG    Download error on https://github.com/rapier1/hpnssh-fedora/blob/main/SOURCES/hpnssh-9.9p1_hpn18.6.0.tar.gz, : 'Error HTTP Error 404: Not Found downloading https://github.com/rapier1/hpnssh-fedora/blob/main/SOURCES/hpnssh-9.9p1_hpn18.6.0.tar.gz'
Traceback (most recent call last):
  File "/usr/lib/python3.12/site-packages/FedoraReview/helpers_mixin.py", line 89, in urlretrieve
    istream = urllib.request.urlopen(url)
              ^^^^^^^^^^^^^^^^^^^^^^^^^^^
  File "/usr/lib64/python3.12/urllib/request.py", line 215, in urlopen
    return opener.open(url, data, timeout)
           ^^^^^^^^^^^^^^^^^^^^^^^^^^^^^^^
  File "/usr/lib64/python3.12/urllib/request.py", line 521, in open
    response = meth(req, response)
               ^^^^^^^^^^^^^^^^^^^
  File "/usr/lib64/python3.12/urllib/request.py", line 630, in http_response
    response = self.parent.error(
               ^^^^^^^^^^^^^^^^^^
  File "/usr/lib64/python3.12/urllib/request.py", line 559, in error
    return self._call_chain(*args)
           ^^^^^^^^^^^^^^^^^^^^^^^
  File "/usr/lib64/python3.12/urllib/request.py", line 492, in _call_chain
    result = func(*args)
             ^^^^^^^^^^^
  File "/usr/lib64/python3.12/urllib/request.py", line 639, in http_error_default
    raise HTTPError(req.full_url, code, msg, hdrs, fp)
urllib.error.HTTPError: HTTP Error 404: Not Found

During handling of the above exception, another exception occurred:

Traceback (most recent call last):
  File "/usr/lib/python3.12/site-packages/FedoraReview/source.py", line 76, in __init__
    self.filename = self._get_file(url, ReviewDirs.upstream, my_logger)
                    ^^^^^^^^^^^^^^^^^^^^^^^^^^^^^^^^^^^^^^^^^^^^^^^^^^^
  File "/usr/lib/python3.12/site-packages/FedoraReview/helpers_mixin.py", line 112, in _get_file
    self.urlretrieve(link, path)
  File "/usr/lib/python3.12/site-packages/FedoraReview/helpers_mixin.py", line 98, in urlretrieve
    raise DownloadError(str(err), url)
FedoraReview.helpers_mixin.DownloadError: 'Error HTTP Error 404: Not Found downloading https://github.com/rapier1/hpnssh-fedora/blob/main/SOURCES/hpnssh-9.9p1_hpn18.6.0.tar.gz'
10-02 16:09 root         WARNING  Cannot download url: https://github.com/rapier1/hpnssh-fedora/blob/main/SOURCES/hpnssh-9.9p1_hpn18.6.0.tar.gz
10-02 16:09 root         INFO     No upstream for (Source0): hpnssh-9.9p1_hpn18.6.0.tar.gz
10-02 16:09 root         INFO     Running checks and generating report
10-02 16:09 root         DEBUG    Running check: CheckResultdir
10-02 16:09 root         DEBUG        CheckResultdir completed: 0.000 seconds
10-02 16:09 root         DEBUG    Running check: CheckBuild
10-02 16:09 root         DEBUG    Running: rpm -ql --dump --nosignature -p /var/lib/copr-rpmbuild/results/hpnssh-9.9p1_hpn18.6.0-1.fc40.s390x.rpm
10-02 16:09 root         DEBUG    Running: rpm -ql --dump --nosignature -p /var/lib/copr-rpmbuild/results/hpnssh-clients-9.9p1_hpn18.6.0-1.fc40.s390x.rpm
10-02 16:09 root         DEBUG    Running: rpm -ql --dump --nosignature -p /var/lib/copr-rpmbuild/results/hpnssh-server-9.9p1_hpn18.6.0-1.fc40.s390x.rpm
10-02 16:09 root         DEBUG    Running: rpm -ql --dump --nosignature -p /var/lib/copr-rpmbuild/results/hpnssh-keycat-9.9p1_hpn18.6.0-1.fc40.s390x.rpm
10-02 16:09 root         DEBUG    Running: rpm -ql --dump --nosignature -p /var/lib/copr-rpmbuild/results/hpnssh-askpass-9.9p1_hpn18.6.0-1.fc40.s390x.rpm
10-02 16:09 root         DEBUG    Running: rpm -ql --dump --nosignature -p /var/lib/copr-rpmbuild/results/hpnssh-debuginfo-9.9p1_hpn18.6.0-1.fc40.s390x.rpm
10-02 16:09 root         DEBUG    Running: rpm -ql --dump --nosignature -p /var/lib/copr-rpmbuild/results/hpnssh-debugsource-9.9p1_hpn18.6.0-1.fc40.s390x.rpm
10-02 16:09 root         DEBUG        CheckBuild completed: 0.056 seconds
10-02 16:09 root         DEBUG    Running check: CheckRpmlint
10-02 16:09 root         DEBUG    Run command: rpmlint --ignore-unused-rpmlintrc --rpmlintrc /tmp/tmpmckn0gty /var/lib/copr-rpmbuild/results/hpnssh-9.9p1_hpn18.6.0-1.fc40.s390x.rpm /var/lib/copr-rpmbuild/results/hpnssh-clients-9.9p1_hpn18.6.0-1.fc40.s390x.rpm /var/lib/copr-rpmbuild/results/hpnssh-server-9.9p1_hpn18.6.0-1.fc40.s390x.rpm /var/lib/copr-rpmbuild/results/hpnssh-keycat-9.9p1_hpn18.6.0-1.fc40.s390x.rpm /var/lib/copr-rpmbuild/results/hpnssh-askpass-9.9p1_hpn18.6.0-1.fc40.s390x.rpm /var/lib/copr-rpmbuild/results/hpnssh-debuginfo-9.9p1_hpn18.6.0-1.fc40.s390x.rpm /var/lib/copr-rpmbuild/results/hpnssh-debugsource-9.9p1_hpn18.6.0-1.fc40.s390x.rpm /var/lib/copr-rpmbuild/results/hpnssh-9.9p1_hpn18.6.0-1.fc40.src.rpm
10-02 16:09 root         DEBUG        CheckRpmlint completed: 2.582 seconds
10-02 16:09 root         DEBUG    Running check: CheckPackageInstalls
10-02 16:10 root         DEBUG    Init command: mock, -r, /var/lib/copr-rpmbuild/results/configs/child.cfg, --init
10-02 16:10 root         DEBUG    Init output: INFO: mock.py version 5.6 starting (python version = 3.12.1, NVR = mock-5.6-1.fc39), args: /usr/libexec/mock/mock -r /var/lib/copr-rpmbuild/results/configs/child.cfg --init
Start(bootstrap): init plugins
INFO: tmpfs initialized
INFO: selinux enabled
INFO: chroot_scan: initialized
INFO: compress_logs: initialized
Finish(bootstrap): init plugins
Start: init plugins
INFO: tmpfs initialized
INFO: selinux enabled
INFO: chroot_scan: initialized
INFO: compress_logs: initialized
Finish: init plugins
INFO: Signal handler active
Start: run
Start: clean chroot
INFO: unmounting tmpfs.
Finish: clean chroot
Mock Version: 5.6
INFO: Mock Version: 5.6
Start(bootstrap): chroot init
INFO: mounting tmpfs at /var/lib/mock/fedora-40-s390x-bootstrap/root.
INFO: reusing tmpfs at /var/lib/mock/fedora-40-s390x-bootstrap/root.
INFO: calling preinit hooks
INFO: enabled root cache
INFO: enabled package manager cache
Start(bootstrap): cleaning package manager metadata
Finish(bootstrap): cleaning package manager metadata
INFO: Package manager dnf5 detected and used (fallback)
Finish(bootstrap): chroot init
Start: chroot init
INFO: mounting tmpfs at /var/lib/mock/fedora-40-s390x/root.
INFO: calling preinit hooks
INFO: enabled root cache
Start: unpacking root cache
Finish: unpacking root cache
INFO: enabled package manager cache
Start: cleaning package manager metadata
Finish: cleaning package manager metadata
INFO: enabled HW Info plugin
INFO: Package manager dnf5 detected and used (direct choice)
Finish: chroot init
Finish: run
 None
NoneType: None
10-02 16:10 root         INFO     Installing built package(s)
10-02 16:10 root         DEBUG    --init command: mock, -r, /var/lib/copr-rpmbuild/results/configs/child.cfg, --no-cleanup-after, --no-clean, --plugin-option=tmpfs:keep_mounted=True, --resultdir=/var/lib/copr-rpmbuild/results/hpnssh/results, --init
10-02 16:10 root         DEBUG    --init output: INFO: mock.py version 5.6 starting (python version = 3.12.1, NVR = mock-5.6-1.fc39), args: /usr/libexec/mock/mock -r /var/lib/copr-rpmbuild/results/configs/child.cfg --no-cleanup-after --no-clean --plugin-option=tmpfs:keep_mounted=True --resultdir=/var/lib/copr-rpmbuild/results/hpnssh/results --init
Start(bootstrap): init plugins
INFO: tmpfs initialized
INFO: selinux enabled
INFO: chroot_scan: initialized
INFO: compress_logs: initialized
Finish(bootstrap): init plugins
Start: init plugins
INFO: tmpfs initialized
INFO: selinux enabled
INFO: chroot_scan: initialized
INFO: compress_logs: initialized
Finish: init plugins
INFO: Signal handler active
Start: run
Mock Version: 5.6
INFO: Mock Version: 5.6
Start(bootstrap): chroot init
INFO: mounting tmpfs at /var/lib/mock/fedora-40-s390x-bootstrap/root.
INFO: reusing tmpfs at /var/lib/mock/fedora-40-s390x-bootstrap/root.
INFO: calling preinit hooks
INFO: enabled root cache
INFO: enabled package manager cache
Start(bootstrap): cleaning package manager metadata
Finish(bootstrap): cleaning package manager metadata
INFO: Package manager dnf5 detected and used (fallback)
Finish(bootstrap): chroot init
Start: chroot init
INFO: mounting tmpfs at /var/lib/mock/fedora-40-s390x/root.
INFO: reusing tmpfs at /var/lib/mock/fedora-40-s390x/root.
INFO: calling preinit hooks
INFO: enabled root cache
INFO: enabled package manager cache
Start: cleaning package manager metadata
Finish: cleaning package manager metadata
INFO: enabled HW Info plugin
INFO: Package manager dnf5 detected and used (direct choice)
Finish: chroot init
Finish: run
 None
NoneType: None
10-02 16:10 root         DEBUG        CheckPackageInstalls completed: 6.139 seconds
10-02 16:10 root         DEBUG    Running check: CheckRpmlintInstalled
10-02 16:10 root         DEBUG    --init command: mock, -r, /var/lib/copr-rpmbuild/results/configs/child.cfg, --no-cleanup-after, --no-clean, --plugin-option=tmpfs:keep_mounted=True, --resultdir=/var/lib/copr-rpmbuild/results/hpnssh/results, --init
10-02 16:10 root         DEBUG    --init output: INFO: mock.py version 5.6 starting (python version = 3.12.1, NVR = mock-5.6-1.fc39), args: /usr/libexec/mock/mock -r /var/lib/copr-rpmbuild/results/configs/child.cfg --no-cleanup-after --no-clean --plugin-option=tmpfs:keep_mounted=True --resultdir=/var/lib/copr-rpmbuild/results/hpnssh/results --init
Start(bootstrap): init plugins
INFO: tmpfs initialized
INFO: selinux enabled
INFO: chroot_scan: initialized
INFO: compress_logs: initialized
Finish(bootstrap): init plugins
Start: init plugins
INFO: tmpfs initialized
INFO: selinux enabled
INFO: chroot_scan: initialized
INFO: compress_logs: initialized
Finish: init plugins
INFO: Signal handler active
Start: run
Mock Version: 5.6
INFO: Mock Version: 5.6
Start(bootstrap): chroot init
INFO: mounting tmpfs at /var/lib/mock/fedora-40-s390x-bootstrap/root.
INFO: reusing tmpfs at /var/lib/mock/fedora-40-s390x-bootstrap/root.
INFO: calling preinit hooks
INFO: enabled root cache
INFO: enabled package manager cache
Start(bootstrap): cleaning package manager metadata
Finish(bootstrap): cleaning package manager metadata
INFO: Package manager dnf5 detected and used (fallback)
Finish(bootstrap): chroot init
Start: chroot init
INFO: mounting tmpfs at /var/lib/mock/fedora-40-s390x/root.
INFO: reusing tmpfs at /var/lib/mock/fedora-40-s390x/root.
INFO: calling preinit hooks
INFO: enabled root cache
INFO: enabled package manager cache
Start: cleaning package manager metadata
Finish: cleaning package manager metadata
INFO: enabled HW Info plugin
INFO: Package manager dnf5 detected and used (direct choice)
Finish: chroot init
Finish: run
 None
NoneType: None
10-02 16:10 root         DEBUG    is_installed: Tested rpmlint, result: 1
10-02 16:10 root         DEBUG     command: mock, -r, /var/lib/copr-rpmbuild/results/configs/child.cfg, --no-cleanup-after, --no-clean, --plugin-option=tmpfs:keep_mounted=True, --resultdir=/var/lib/copr-rpmbuild/results/hpnssh/results, --shell, 'rm -f /var/lib/rpm/__db*'
10-02 16:10 root         DEBUG     output: INFO: mock.py version 5.6 starting (python version = 3.12.1, NVR = mock-5.6-1.fc39), args: /usr/libexec/mock/mock -r /var/lib/copr-rpmbuild/results/configs/child.cfg --no-cleanup-after --no-clean --plugin-option=tmpfs:keep_mounted=True --resultdir=/var/lib/copr-rpmbuild/results/hpnssh/results --shell ''"'"'rm -f /var/lib/rpm/__db*'"'"''
Start(bootstrap): init plugins
INFO: tmpfs initialized
INFO: selinux enabled
INFO: chroot_scan: initialized
INFO: compress_logs: initialized
Finish(bootstrap): init plugins
Start: init plugins
INFO: tmpfs initialized
INFO: selinux enabled
INFO: chroot_scan: initialized
INFO: compress_logs: initialized
Finish: init plugins
INFO: Signal handler active
Start: run
Start(bootstrap): chroot init
INFO: mounting tmpfs at /var/lib/mock/fedora-40-s390x-bootstrap/root.
INFO: reusing tmpfs at /var/lib/mock/fedora-40-s390x-bootstrap/root.
INFO: calling preinit hooks
INFO: enabled root cache
INFO: enabled package manager cache
Start(bootstrap): cleaning package manager metadata
Finish(bootstrap): cleaning package manager metadata
INFO: Package manager dnf5 detected and used (fallback)
Finish(bootstrap): chroot init
Start: chroot init
INFO: mounting tmpfs at /var/lib/mock/fedora-40-s390x/root.
INFO: reusing tmpfs at /var/lib/mock/fedora-40-s390x/root.
INFO: calling preinit hooks
INFO: enabled root cache
INFO: enabled package manager cache
Start: cleaning package manager metadata
Finish: cleaning package manager metadata
INFO: enabled HW Info plugin
INFO: Package manager dnf5 detected and used (direct choice)
Finish: chroot init
Start: shell
/bin/sh: line 1: rm -f /var/lib/rpm/__db*: No such file or directory
Finish: shell
Finish: run
 None
NoneType: None
10-02 16:10 root         DEBUG    Install command: mock, -r, /var/lib/copr-rpmbuild/results/configs/child.cfg, --no-cleanup-after, --no-clean, --plugin-option=tmpfs:keep_mounted=True, --resultdir=/var/lib/copr-rpmbuild/results/hpnssh/results, install, rpmlint
10-02 16:10 root         DEBUG    Install output: INFO: mock.py version 5.6 starting (python version = 3.12.1, NVR = mock-5.6-1.fc39), args: /usr/libexec/mock/mock -r /var/lib/copr-rpmbuild/results/configs/child.cfg --no-cleanup-after --no-clean --plugin-option=tmpfs:keep_mounted=True --resultdir=/var/lib/copr-rpmbuild/results/hpnssh/results install rpmlint
Start(bootstrap): init plugins
INFO: tmpfs initialized
INFO: selinux enabled
INFO: chroot_scan: initialized
INFO: compress_logs: initialized
Finish(bootstrap): init plugins
Start: init plugins
INFO: tmpfs initialized
INFO: selinux enabled
INFO: chroot_scan: initialized
INFO: compress_logs: initialized
Finish: init plugins
INFO: Signal handler active
Start: run
Mock Version: 5.6
INFO: Mock Version: 5.6
Start(bootstrap): chroot init
INFO: mounting tmpfs at /var/lib/mock/fedora-40-s390x-bootstrap/root.
INFO: reusing tmpfs at /var/lib/mock/fedora-40-s390x-bootstrap/root.
INFO: calling preinit hooks
INFO: enabled root cache
INFO: enabled package manager cache
Start(bootstrap): cleaning package manager metadata
Finish(bootstrap): cleaning package manager metadata
INFO: Package manager dnf5 detected and used (fallback)
Finish(bootstrap): chroot init
Start: chroot init
INFO: mounting tmpfs at /var/lib/mock/fedora-40-s390x/root.
INFO: reusing tmpfs at /var/lib/mock/fedora-40-s390x/root.
INFO: calling preinit hooks
INFO: enabled root cache
INFO: enabled package manager cache
Start: cleaning package manager metadata
Finish: cleaning package manager metadata
INFO: enabled HW Info plugin
INFO: Package manager dnf5 detected and used (direct choice)
Finish: chroot init
INFO: installing package(s): rpmlint
INFO: 
Finish: run
 None
NoneType: None
10-02 16:10 root         DEBUG    Script output: INFO: mock.py version 5.6 starting (python version = 3.12.1, NVR = mock-5.6-1.fc39), args: /usr/libexec/mock/mock --enable-network -r /var/lib/copr-rpmbuild/results/configs/child.cfg --no-cleanup-after --no-clean --plugin-option=tmpfs:keep_mounted=True --resultdir=/var/lib/copr-rpmbuild/results/hpnssh/results --chroot 'echo '"'"'rpmlint:'"'"'; rpmlint --installed hpnssh hpnssh-keycat hpnssh-server-debuginfo hpnssh-clients-debuginfo hpnssh-askpass-debuginfo hpnssh-debugsource hpnssh-clients hpnssh-debuginfo hpnssh-keycat-debuginfo hpnssh-server hpnssh-askpass; echo '"'"'rpmlint-done:'"'"''
Start(bootstrap): init plugins
INFO: tmpfs initialized
INFO: selinux enabled
INFO: chroot_scan: initialized
INFO: compress_logs: initialized
Finish(bootstrap): init plugins
Start: init plugins
INFO: tmpfs initialized
INFO: selinux enabled
INFO: chroot_scan: initialized
INFO: compress_logs: initialized
Finish: init plugins
INFO: Signal handler active
Start: run
Mock Version: 5.6
INFO: Mock Version: 5.6
Start(bootstrap): chroot init
INFO: mounting tmpfs at /var/lib/mock/fedora-40-s390x-bootstrap/root.
INFO: reusing tmpfs at /var/lib/mock/fedora-40-s390x-bootstrap/root.
INFO: calling preinit hooks
INFO: enabled root cache
INFO: enabled package manager cache
Start(bootstrap): cleaning package manager metadata
Finish(bootstrap): cleaning package manager metadata
INFO: Package manager dnf5 detected and used (fallback)
Finish(bootstrap): chroot init
Start: chroot init
INFO: mounting tmpfs at /var/lib/mock/fedora-40-s390x/root.
INFO: reusing tmpfs at /var/lib/mock/fedora-40-s390x/root.
INFO: calling preinit hooks
INFO: enabled root cache
INFO: enabled package manager cache
Start: cleaning package manager metadata
Finish: cleaning package manager metadata
INFO: enabled HW Info plugin
INFO: Package manager dnf5 detected and used (direct choice)
Finish: chroot init
INFO: Running in chroot: ["echo 'rpmlint:'; rpmlint --installed hpnssh hpnssh-keycat hpnssh-server-debuginfo hpnssh-clients-debuginfo hpnssh-askpass-debuginfo hpnssh-debugsource hpnssh-clients hpnssh-debuginfo hpnssh-keycat-debuginfo hpnssh-server hpnssh-askpass; echo 'rpmlint-done:'"]
Start: chroot ["echo 'rpmlint:'; rpmlint --installed hpnssh hpnssh-keycat hpnssh-server-debuginfo hpnssh-clients-debuginfo hpnssh-askpass-debuginfo hpnssh-debugsource hpnssh-clients hpnssh-debuginfo hpnssh-keycat-debuginfo hpnssh-server hpnssh-askpass; echo 'rpmlint-done:'"]
rpmlint:
(none): E: there is no installed rpm "hpnssh".
(none): E: there is no installed rpm "hpnssh-keycat".
(none): E: there is no installed rpm "hpnssh-server-debuginfo".
(none): E: there is no installed rpm "hpnssh-clients-debuginfo".
(none): E: there is no installed rpm "hpnssh-askpass-debuginfo".
(none): E: there is no installed rpm "hpnssh-debugsource".
(none): E: there is no installed rpm "hpnssh-clients".
(none): E: there is no installed rpm "hpnssh-debuginfo".
(none): E: there is no installed rpm "hpnssh-keycat-debuginfo".
(none): E: there is no installed rpm "hpnssh-server".
(none): E: there is no installed rpm "hpnssh-askpass".
There are no files to process nor additional arguments.
Nothing to do, aborting.
============================ rpmlint session starts ============================
rpmlint: 2.5.0
configuration:
    /usr/lib/python3.12/site-packages/rpmlint/configdefaults.toml
    /etc/xdg/rpmlint/fedora-legacy-licenses.toml
    /etc/xdg/rpmlint/fedora-spdx-licenses.toml
    /etc/xdg/rpmlint/fedora.toml
    /etc/xdg/rpmlint/scoring.toml
    /etc/xdg/rpmlint/users-groups.toml
    /etc/xdg/rpmlint/warn-on-functions.toml
checks: 32, packages: 11

 0 packages and 0 specfiles checked; 0 errors, 0 warnings, 0 filtered, 0 badness; has taken 0.0 s 
rpmlint-done:
Finish: chroot ["echo 'rpmlint:'; rpmlint --installed hpnssh hpnssh-keycat hpnssh-server-debuginfo hpnssh-clients-debuginfo hpnssh-askpass-debuginfo hpnssh-debugsource hpnssh-clients hpnssh-debuginfo hpnssh-keycat-debuginfo hpnssh-server hpnssh-askpass; echo 'rpmlint-done:'"]
Finish: run

10-02 16:10 root         DEBUG        CheckRpmlintInstalled completed: 16.877 seconds
10-02 16:10 root         DEBUG    Running check: CheckRpmlintDebuginfo
10-02 16:10 root         DEBUG    Run command: rpmlint --ignore-unused-rpmlintrc --rpmlintrc /tmp/tmpescrdvym /var/lib/copr-rpmbuild/results/hpnssh-clients-debuginfo-9.9p1_hpn18.6.0-1.fc40.s390x.rpm /var/lib/copr-rpmbuild/results/hpnssh-askpass-debuginfo-9.9p1_hpn18.6.0-1.fc40.s390x.rpm /var/lib/copr-rpmbuild/results/hpnssh-debuginfo-9.9p1_hpn18.6.0-1.fc40.s390x.rpm /var/lib/copr-rpmbuild/results/hpnssh-keycat-debuginfo-9.9p1_hpn18.6.0-1.fc40.s390x.rpm /var/lib/copr-rpmbuild/results/hpnssh-server-debuginfo-9.9p1_hpn18.6.0-1.fc40.s390x.rpm
10-02 16:10 root         DEBUG        CheckRpmlintDebuginfo completed: 1.288 seconds
10-02 16:10 root         DEBUG    Running check: CheckInitDeps
10-02 16:11 root         DEBUG        CheckInitDeps completed: 47.308 seconds
10-02 16:11 root         DEBUG    Running check: CheckBuildCompleted
10-02 16:11 root         DEBUG    Mock command: mock, -r, /var/lib/copr-rpmbuild/results/configs/child.cfg, --no-cleanup-after, --no-clean, --plugin-option=tmpfs:keep_mounted=True, --resultdir=/var/lib/copr-rpmbuild/results/hpnssh/results, --chroot, --, rm -rf $(rpm --eval %_builddir)/*
10-02 16:11 root         DEBUG    Mock output: INFO: mock.py version 5.6 starting (python version = 3.12.1, NVR = mock-5.6-1.fc39), args: /usr/libexec/mock/mock -r /var/lib/copr-rpmbuild/results/configs/child.cfg --no-cleanup-after --no-clean --plugin-option=tmpfs:keep_mounted=True --resultdir=/var/lib/copr-rpmbuild/results/hpnssh/results --chroot -- 'rm -rf $(rpm --eval %_builddir)/*'
Start(bootstrap): init plugins
INFO: tmpfs initialized
INFO: selinux enabled
INFO: chroot_scan: initialized
INFO: compress_logs: initialized
Finish(bootstrap): init plugins
Start: init plugins
INFO: tmpfs initialized
INFO: selinux enabled
INFO: chroot_scan: initialized
INFO: compress_logs: initialized
Finish: init plugins
INFO: Signal handler active
Start: run
Mock Version: 5.6
INFO: Mock Version: 5.6
Start(bootstrap): chroot init
INFO: mounting tmpfs at /var/lib/mock/fedora-40-s390x-bootstrap/root.
INFO: reusing tmpfs at /var/lib/mock/fedora-40-s390x-bootstrap/root.
INFO: calling preinit hooks
INFO: enabled root cache
INFO: enabled package manager cache
Start(bootstrap): cleaning package manager metadata
Finish(bootstrap): cleaning package manager metadata
INFO: Package manager dnf5 detected and used (fallback)
Finish(bootstrap): chroot init
Start: chroot init
INFO: mounting tmpfs at /var/lib/mock/fedora-40-s390x/root.
INFO: reusing tmpfs at /var/lib/mock/fedora-40-s390x/root.
INFO: calling preinit hooks
INFO: enabled root cache
INFO: enabled package manager cache
Start: cleaning package manager metadata
Finish: cleaning package manager metadata
INFO: enabled HW Info plugin
INFO: Package manager dnf5 detected and used (direct choice)
Finish: chroot init
INFO: Running in chroot: ['rm -rf $(rpm --eval %_builddir)/*']
Start: chroot ['rm -rf $(rpm --eval %_builddir)/*']
Finish: chroot ['rm -rf $(rpm --eval %_builddir)/*']
Finish: run
 None
NoneType: None
10-02 16:11 root         DEBUG    Mock command: mock, -r, /var/lib/copr-rpmbuild/results/configs/child.cfg, --no-cleanup-after, --no-clean, --plugin-option=tmpfs:keep_mounted=True, --resultdir=/var/lib/copr-rpmbuild/results/hpnssh/results, --copyin, /var/lib/copr-rpmbuild/results/hpnssh-9.9p1_hpn18.6.0-1.fc40.src.rpm, hpnssh-9.9p1_hpn18.6.0-1.fc40.src.rpm
10-02 16:11 root         DEBUG    Mock output: INFO: mock.py version 5.6 starting (python version = 3.12.1, NVR = mock-5.6-1.fc39), args: /usr/libexec/mock/mock -r /var/lib/copr-rpmbuild/results/configs/child.cfg --no-cleanup-after --no-clean --plugin-option=tmpfs:keep_mounted=True --resultdir=/var/lib/copr-rpmbuild/results/hpnssh/results --copyin /var/lib/copr-rpmbuild/results/hpnssh-9.9p1_hpn18.6.0-1.fc40.src.rpm hpnssh-9.9p1_hpn18.6.0-1.fc40.src.rpm
Start(bootstrap): init plugins
INFO: tmpfs initialized
INFO: selinux enabled
INFO: chroot_scan: initialized
INFO: compress_logs: initialized
Finish(bootstrap): init plugins
Start: init plugins
INFO: tmpfs initialized
INFO: selinux enabled
INFO: chroot_scan: initialized
INFO: compress_logs: initialized
Finish: init plugins
INFO: Signal handler active
Start: run
Mock Version: 5.6
INFO: Mock Version: 5.6
Start(bootstrap): chroot init
INFO: mounting tmpfs at /var/lib/mock/fedora-40-s390x-bootstrap/root.
INFO: reusing tmpfs at /var/lib/mock/fedora-40-s390x-bootstrap/root.
INFO: calling preinit hooks
INFO: enabled root cache
INFO: enabled package manager cache
Start(bootstrap): cleaning package manager metadata
Finish(bootstrap): cleaning package manager metadata
INFO: Package manager dnf5 detected and used (fallback)
Finish(bootstrap): chroot init
Start: chroot init
INFO: mounting tmpfs at /var/lib/mock/fedora-40-s390x/root.
INFO: reusing tmpfs at /var/lib/mock/fedora-40-s390x/root.
INFO: calling preinit hooks
INFO: enabled root cache
INFO: enabled package manager cache
Start: cleaning package manager metadata
Finish: cleaning package manager metadata
INFO: enabled HW Info plugin
INFO: Package manager dnf5 detected and used (direct choice)
Finish: chroot init
INFO: copying /var/lib/copr-rpmbuild/results/hpnssh-9.9p1_hpn18.6.0-1.fc40.src.rpm to /var/lib/mock/fedora-40-s390x/root/hpnssh-9.9p1_hpn18.6.0-1.fc40.src.rpm
Finish: run
 None
NoneType: None
10-02 16:11 root         DEBUG    Mock command: mock, -r, /var/lib/copr-rpmbuild/results/configs/child.cfg, --no-cleanup-after, --no-clean, --plugin-option=tmpfs:keep_mounted=True, --resultdir=/var/lib/copr-rpmbuild/results/hpnssh/results, --chroot, --, rpm -i hpnssh-9.9p1_hpn18.6.0-1.fc40.src.rpm; rpmbuild --nodeps -bp $(rpm --eval %_specdir)/hpnssh.spec;chmod -R  go+r  $(rpm --eval %_builddir)/* || :
10-02 16:11 root         DEBUG    Mock output: INFO: mock.py version 5.6 starting (python version = 3.12.1, NVR = mock-5.6-1.fc39), args: /usr/libexec/mock/mock -r /var/lib/copr-rpmbuild/results/configs/child.cfg --no-cleanup-after --no-clean --plugin-option=tmpfs:keep_mounted=True --resultdir=/var/lib/copr-rpmbuild/results/hpnssh/results --chroot -- 'rpm -i hpnssh-9.9p1_hpn18.6.0-1.fc40.src.rpm; rpmbuild --nodeps -bp $(rpm --eval %_specdir)/hpnssh.spec;chmod -R  go+r  $(rpm --eval %_builddir)/* || :'
Start(bootstrap): init plugins
INFO: tmpfs initialized
INFO: selinux enabled
INFO: chroot_scan: initialized
INFO: compress_logs: initialized
Finish(bootstrap): init plugins
Start: init plugins
INFO: tmpfs initialized
INFO: selinux enabled
INFO: chroot_scan: initialized
INFO: compress_logs: initialized
Finish: init plugins
INFO: Signal handler active
Start: run
Mock Version: 5.6
INFO: Mock Version: 5.6
Start(bootstrap): chroot init
INFO: mounting tmpfs at /var/lib/mock/fedora-40-s390x-bootstrap/root.
INFO: reusing tmpfs at /var/lib/mock/fedora-40-s390x-bootstrap/root.
INFO: calling preinit hooks
INFO: enabled root cache
INFO: enabled package manager cache
Start(bootstrap): cleaning package manager metadata
Finish(bootstrap): cleaning package manager metadata
INFO: Package manager dnf5 detected and used (fallback)
Finish(bootstrap): chroot init
Start: chroot init
INFO: mounting tmpfs at /var/lib/mock/fedora-40-s390x/root.
INFO: reusing tmpfs at /var/lib/mock/fedora-40-s390x/root.
INFO: calling preinit hooks
INFO: enabled root cache
INFO: enabled package manager cache
Start: cleaning package manager metadata
Finish: cleaning package manager metadata
INFO: enabled HW Info plugin
INFO: Package manager dnf5 detected and used (direct choice)
Finish: chroot init
INFO: Running in chroot: ['rpm -i hpnssh-9.9p1_hpn18.6.0-1.fc40.src.rpm; rpmbuild --nodeps -bp $(rpm --eval %_specdir)/hpnssh.spec;chmod -R  go+r  $(rpm --eval %_builddir)/* || :']
Start: chroot ['rpm -i hpnssh-9.9p1_hpn18.6.0-1.fc40.src.rpm; rpmbuild --nodeps -bp $(rpm --eval %_specdir)/hpnssh.spec;chmod -R  go+r  $(rpm --eval %_builddir)/* || :']
setting SOURCE_DATE_EPOCH=1727740800
Executing(%prep): /bin/sh -e /var/tmp/rpm-tmp.2RjwNH
+ umask 022
+ cd /builddir/build/BUILD
+ /usr/lib/rpm/redhat/gpgverify --keyring=/builddir/build/SOURCES/CJR-GPG-KEY.gpg --signature=/builddir/build/SOURCES/hpnssh-9.9p1_hpn18.6.0.tar.gz.asc --data=/builddir/build/SOURCES/hpnssh-9.9p1_hpn18.6.0.tar.gz
gpgv: Signature made Tue Oct  1 19:49:14 2024 UTC
gpgv:                using EDDSA key 9CC07D2F8B1B04700F7D04B34A9E494897401E09
gpgv: Good signature from "Chris Rapier <rapier@psc.edu>"
+ cd /builddir/build/BUILD
+ rm -rf hpnssh-9.9p1_hpn18.6.0
+ /usr/lib/rpm/rpmuncompress -x /builddir/build/SOURCES/hpnssh-9.9p1_hpn18.6.0.tar.gz
+ STATUS=0
+ '[' 0 -ne 0 ']'
+ cd hpnssh-9.9p1_hpn18.6.0
+ rm -rf /builddir/build/BUILD/hpnssh-9.9p1_hpn18.6.0-SPECPARTS
+ /usr/bin/mkdir -p /builddir/build/BUILD/hpnssh-9.9p1_hpn18.6.0-SPECPARTS
+ /usr/lib/rpm/rpmuncompress -x /builddir/build/SOURCES/hpnssh-9.9p1_hpn18.6.0.tar.gz
+ STATUS=0
+ '[' 0 -ne 0 ']'
+ /usr/bin/chmod -Rf a+rX,u+w,g-w,o-w .
Patch #400 (openssh-7.8p1-role-mls.patch):
+ echo 'Patch #400 (openssh-7.8p1-role-mls.patch):'
+ /usr/bin/patch --no-backup-if-mismatch -f -p1 -b --suffix .role-mls --fuzz=0
patching file auth2.c
patching file auth2-gss.c
patching file auth2-hostbased.c
patching file auth2-pubkey.c
patching file auth.h
patching file auth-pam.c
patching file auth-pam.h
patching file misc.c
patching file monitor.c
patching file monitor.h
patching file monitor_wrap.c
patching file monitor_wrap.h
patching file openbsd-compat/Makefile.in
patching file openbsd-compat/port-linux.c
patching file openbsd-compat/port-linux.h
patching file openbsd-compat/port-linux-sshd.c
patching file platform.c
patching file sshd-session.c
Patch #404 (openssh-6.6p1-privsep-selinux.patch):
+ echo 'Patch #404 (openssh-6.6p1-privsep-selinux.patch):'
+ /usr/bin/patch --no-backup-if-mismatch -f -p1 -b --suffix .privsep-selinux --fuzz=0
patching file openbsd-compat/port-linux.h
patching file openbsd-compat/port-linux-sshd.c
patching file session.c
patching file sshd-session.c
Patch #502 (openssh-6.6p1-keycat.patch):
+ echo 'Patch #502 (openssh-6.6p1-keycat.patch):'
+ /usr/bin/patch --no-backup-if-mismatch -f -p1 -b --suffix .keycat --fuzz=0
patching file misc.c
patching file HOWTO.ssh-keycat
patching file Makefile.in
patching file openbsd-compat/port-linux.h
patching file openbsd-compat/port-linux-sshd.c
patching file platform.c
patching file ssh-keycat.c
patching file configure.ac
Patch #601 (openssh-6.6p1-allow-ip-opts.patch):
+ echo 'Patch #601 (openssh-6.6p1-allow-ip-opts.patch):'
+ /usr/bin/patch --no-backup-if-mismatch -f -p1 -b --suffix .ip-opts --fuzz=0
patching file sshd-session.c
Patch #606 (openssh-5.9p1-ipv6man.patch):
+ echo 'Patch #606 (openssh-5.9p1-ipv6man.patch):'
+ /usr/bin/patch --no-backup-if-mismatch -f -p1 -b --suffix .ipv6man --fuzz=0
patching file hpnssh.1
patching file hpnsshd.8
Patch #607 (openssh-5.8p2-sigpipe.patch):
+ echo 'Patch #607 (openssh-5.8p2-sigpipe.patch):'
+ /usr/bin/patch --no-backup-if-mismatch -f -p1 -b --suffix .sigpipe --fuzz=0
patching file ssh-keyscan.c
Patch #609 (openssh-7.2p2-x11.patch):
+ echo 'Patch #609 (openssh-7.2p2-x11.patch):'
+ /usr/bin/patch --no-backup-if-mismatch -f -p1 -b --suffix .x11 --fuzz=0
patching file channels.c
Patch #702 (openssh-5.1p1-askpass-progress.patch):
+ echo 'Patch #702 (openssh-5.1p1-askpass-progress.patch):'
+ /usr/bin/patch --no-backup-if-mismatch -f -p1 -b --suffix .progress --fuzz=0
patching file contrib/gnome-ssh-askpass2.c
Patch #703 (openssh-4.3p2-askpass-grab-info.patch):
+ echo 'Patch #703 (openssh-4.3p2-askpass-grab-info.patch):'
+ /usr/bin/patch --no-backup-if-mismatch -f -p1 -b --suffix .grab-info --fuzz=0
patching file contrib/gnome-ssh-askpass2.c
Patch #707 (openssh-7.7p1-redhat.patch):
+ echo 'Patch #707 (openssh-7.7p1-redhat.patch):'
+ /usr/bin/patch --no-backup-if-mismatch -f -p1 -b --suffix .redhat --fuzz=0
patching file ssh_config
patching file ssh_config_redhat
patching file sshd_config
patching file hpnsshd_config.5
patching file sshd_config_redhat
Patch #711 (openssh-7.8p1-UsePAM-warning.patch):
+ echo 'Patch #711 (openssh-7.8p1-UsePAM-warning.patch):'
+ /usr/bin/patch --no-backup-if-mismatch -f -p1 -b --suffix .log-usepam-no --fuzz=0
patching file sshd-session.c
patching file sshd_config
Patch #800 (openssh-8.0p1-gssapi-keyex.patch):
+ echo 'Patch #800 (openssh-8.0p1-gssapi-keyex.patch):'
+ /usr/bin/patch --no-backup-if-mismatch -f -p1 -b --suffix .gsskex --fuzz=0
patching file Makefile.in
patching file auth.c
patching file auth2-gss.c
patching file auth2.c
patching file canohost.c
patching file canohost.h
patching file clientloop.c
patching file configure.ac
patching file gss-genr.c
patching file gss-serv-krb5.c
patching file gss-serv.c
patching file kex.c
patching file kex-names.c
patching file kex.h
patching file kexdh.c
patching file kexgen.c
patching file kexgssc.c
patching file kexgsss.c
patching file monitor.c
patching file monitor.h
patching file monitor_wrap.c
patching file monitor_wrap.h
patching file readconf.c
patching file readconf.h
patching file servconf.c
patching file servconf.h
patching file session.c
patching file ssh-gss.h
patching file hpnssh.1
patching file ssh.c
patching file ssh_config
patching file hpnssh_config.5
patching file sshconnect2.c
patching file sshd.c
patching file sshd-session.c
patching file sshd_config
patching file hpnsshd_config.5
patching file sshkey.c
patching file sshkey.h
patching file packet.h
patching file packet.c
Patch #801 (openssh-6.6p1-force_krb.patch):
+ echo 'Patch #801 (openssh-6.6p1-force_krb.patch):'
+ /usr/bin/patch --no-backup-if-mismatch -f -p1 -b --suffix .force_krb --fuzz=0
patching file gss-serv-krb5.c
patching file session.c
patching file ssh-gss.h
patching file hpnsshd.8
Patch #804 (openssh-7.7p1-gssapi-new-unique.patch):
+ echo 'Patch #804 (openssh-7.7p1-gssapi-new-unique.patch):'
+ /usr/bin/patch --no-backup-if-mismatch -f -p1 -b --suffix .ccache_name --fuzz=0
patching file auth.h
patching file auth-krb5.c
patching file gss-serv.c
patching file gss-serv-krb5.c
patching file servconf.c
patching file servconf.h
patching file session.c
patching file sshd-session.c
patching file hpnsshd_config.5
patching file ssh-gss.h
Patch #805 (openssh-7.2p2-k5login_directory.patch):
+ echo 'Patch #805 (openssh-7.2p2-k5login_directory.patch):'
+ /usr/bin/patch --no-backup-if-mismatch -f -p1 -b --suffix .k5login --fuzz=0
patching file auth-krb5.c
patching file auth.h
patching file gss-serv-krb5.c
patching file hpnsshd.8
Patch #806 (openssh-9.6p1-gsskex-new-api.patch):
+ echo 'Patch #806 (openssh-9.6p1-gsskex-new-api.patch):'
+ /usr/bin/patch --no-backup-if-mismatch -f -p1 -b --suffix .gsskex-new-api --fuzz=0
patching file gss-genr.c
patching file kexgssc.c
patching file kexgsss.c
patching file kex.h
patching file ssh-gss.h
Patch #901 (openssh-6.6p1-kuserok.patch):
+ echo 'Patch #901 (openssh-6.6p1-kuserok.patch):'
+ /usr/bin/patch --no-backup-if-mismatch -f -p1 -b --suffix .kuserok --fuzz=0
patching file auth-krb5.c
patching file gss-serv-krb5.c
patching file servconf.c
patching file servconf.h
patching file hpnsshd_config.5
patching file sshd_config
Patch #906 (openssh-6.4p1-fromto-remote.patch):
+ echo 'Patch #906 (openssh-6.4p1-fromto-remote.patch):'
+ /usr/bin/patch --no-backup-if-mismatch -f -p1 -b --suffix .fromto-remote --fuzz=0
patching file scp.c
Patch #916 (openssh-6.6.1p1-selinux-contexts.patch):
+ echo 'Patch #916 (openssh-6.6.1p1-selinux-contexts.patch):'
+ /usr/bin/patch --no-backup-if-mismatch -f -p1 -b --suffix .contexts --fuzz=0
patching file openbsd-compat/port-linux-sshd.c
patching file openbsd-compat/port-linux.c
patching file openbsd-compat/port-linux.h
patching file sshd-session.c
Patch #918 (openssh-6.6.1p1-log-in-chroot.patch):
+ echo 'Patch #918 (openssh-6.6.1p1-log-in-chroot.patch):'
+ /usr/bin/patch --no-backup-if-mismatch -f -p1 -b --suffix .log-in-chroot --fuzz=0
patching file log.c
patching file log.h
patching file monitor.c
patching file monitor.h
patching file session.c
patching file sftp.h
patching file sftp-server.c
patching file sftp-server-main.c
patching file sshd-session.c
Patch #919 (openssh-6.6.1p1-scp-non-existing-directory.patch):
+ echo 'Patch #919 (openssh-6.6.1p1-scp-non-existing-directory.patch):'
+ /usr/bin/patch --no-backup-if-mismatch -f -p1 -b --suffix .scp --fuzz=0
patching file scp.c
Patch #802 (openssh-6.6p1-GSSAPIEnablek5users.patch):
+ echo 'Patch #802 (openssh-6.6p1-GSSAPIEnablek5users.patch):'
+ /usr/bin/patch --no-backup-if-mismatch -f -p1 -b --suffix .GSSAPIEnablek5users --fuzz=0
patching file gss-serv-krb5.c
patching file servconf.c
patching file servconf.h
patching file hpnsshd_config.5
patching file sshd_config
Patch #922 (openssh-6.8p1-sshdT-output.patch):
+ echo 'Patch #922 (openssh-6.8p1-sshdT-output.patch):'
+ /usr/bin/patch --no-backup-if-mismatch -f -p1 -b --suffix .sshdt --fuzz=0
patching file servconf.c
Patch #926 (openssh-6.7p1-sftp-force-permission.patch):
+ echo 'Patch #926 (openssh-6.7p1-sftp-force-permission.patch):'
+ /usr/bin/patch --no-backup-if-mismatch -f -p1 -b --suffix .sftp-force-mode --fuzz=0
patching file hpnsftp-server.8
patching file sftp-server.c
Patch #939 (openssh-7.2p2-s390-closefrom.patch):
+ echo 'Patch #939 (openssh-7.2p2-s390-closefrom.patch):'
+ /usr/bin/patch --no-backup-if-mismatch -f -p1 -b --suffix .s390-dev --fuzz=0
patching file openbsd-compat/bsd-closefrom.c
Patch #944 (openssh-7.3p1-x11-max-displays.patch):
+ echo 'Patch #944 (openssh-7.3p1-x11-max-displays.patch):'
+ /usr/bin/patch --no-backup-if-mismatch -f -p1 -b --suffix .x11max --fuzz=0
patching file channels.c
patching file channels.h
patching file servconf.c
patching file servconf.h
patching file session.c
patching file hpnsshd_config.5
Patch #948 (openssh-7.4p1-systemd.patch):
+ echo 'Patch #948 (openssh-7.4p1-systemd.patch):'
+ /usr/bin/patch --no-backup-if-mismatch -f -p1 -b --suffix .systemd --fuzz=0
patching file configure.ac
patching file contrib/sshd.service
patching file sshd.c
Patch #949 (openssh-7.6p1-cleanup-selinux.patch):
+ echo 'Patch #949 (openssh-7.6p1-cleanup-selinux.patch):'
+ /usr/bin/patch --no-backup-if-mismatch -f -p1 -b --suffix .refactor --fuzz=0
patching file auth2-pubkey.c
patching file misc.c
patching file misc.h
patching file openbsd-compat/port-linux.h
patching file openbsd-compat/port-linux-sshd.c
patching file platform.c
patching file sshd-session.c
patching file sshconnect.c
Patch #950 (openssh-7.5p1-sandbox.patch):
+ echo 'Patch #950 (openssh-7.5p1-sandbox.patch):'
+ /usr/bin/patch --no-backup-if-mismatch -f -p1 -b --suffix .sandbox --fuzz=0
patching file sandbox-seccomp-filter.c
Patch #951 (openssh-8.0p1-pkcs11-uri.patch):
+ echo 'Patch #951 (openssh-8.0p1-pkcs11-uri.patch):'
+ /usr/bin/patch --no-backup-if-mismatch -f -p1 -b --suffix .pkcs11-uri --fuzz=0
patching file configure.ac
patching file Makefile.in
patching file regress/Makefile
patching file regress/pkcs11.sh
patching file regress/unittests/Makefile
patching file regress/unittests/pkcs11/tests.c
patching file ssh-add.c
patching file ssh-agent.c
patching file hpnssh_config.5
patching file ssh.c
patching file ssh-keygen.c
patching file ssh-pkcs11-client.c
patching file ssh-pkcs11.c
patching file ssh-pkcs11.h
patching file ssh-pkcs11-uri.c
patching file ssh-pkcs11-uri.h
Patch #953 (openssh-7.8p1-scp-ipv6.patch):
+ echo 'Patch #953 (openssh-7.8p1-scp-ipv6.patch):'
+ /usr/bin/patch --no-backup-if-mismatch -f -p1 -b --suffix .scp-ipv6 --fuzz=0
patching file scp.c
Patch #962 (openssh-8.0p1-crypto-policies.patch):
+ echo 'Patch #962 (openssh-8.0p1-crypto-policies.patch):'
+ /usr/bin/patch --no-backup-if-mismatch -f -p1 -b --suffix .crypto-policies --fuzz=0
patching file hpnssh_config.5
patching file hpnsshd_config.5
Patch #963 (openssh-9.3p1-merged-openssl-evp.patch):
+ echo 'Patch #963 (openssh-9.3p1-merged-openssl-evp.patch):'
+ /usr/bin/patch --no-backup-if-mismatch -f -p1 -b --suffix .openssl-evp --fuzz=0
patching file digest.h
patching file digest-openssl.c
patching file ssh-dss.c
patching file ssh-ecdsa.c
patching file sshkey.c
patching file sshkey.h
patching file ssh-pkcs11.c
patching file ssh-pkcs11-client.c
patching file ssh-pkcs11.h
patching file ssh-rsa.c
Patch #964 (openssh-8.0p1-openssl-kdf.patch):
+ echo 'Patch #964 (openssh-8.0p1-openssl-kdf.patch):'
+ /usr/bin/patch --no-backup-if-mismatch -f -p1 -b --suffix .openssl-kdf --fuzz=0
patching file configure.ac
patching file kex.c
Patch #965 (openssh-8.2p1-visibility.patch):
+ echo 'Patch #965 (openssh-8.2p1-visibility.patch):'
+ /usr/bin/patch --no-backup-if-mismatch -f -p1 -b --suffix .visibility --fuzz=0
patching file regress/misc/sk-dummy/sk-dummy.c
Patch #966 (openssh-8.2p1-x11-without-ipv6.patch):
+ echo 'Patch #966 (openssh-8.2p1-x11-without-ipv6.patch):'
+ /usr/bin/patch --no-backup-if-mismatch -f -p1 -b --suffix .x11-ipv6 --fuzz=0
patching file channels.c
Patch #974 (openssh-8.0p1-keygen-strip-doseol.patch):
+ echo 'Patch #974 (openssh-8.0p1-keygen-strip-doseol.patch):'
+ /usr/bin/patch --no-backup-if-mismatch -f -p1 -b --suffix .keygen-strip-doseol --fuzz=0
patching file ssh-keygen.c
Patch #975 (openssh-8.0p1-preserve-pam-errors.patch):
+ echo 'Patch #975 (openssh-8.0p1-preserve-pam-errors.patch):'
+ /usr/bin/patch --no-backup-if-mismatch -f -p1 -b --suffix .preserve-pam-errors --fuzz=0
patching file auth-pam.c
Patch #977 (openssh-8.7p1-scp-kill-switch.patch):
+ echo 'Patch #977 (openssh-8.7p1-scp-kill-switch.patch):'
+ /usr/bin/patch --no-backup-if-mismatch -f -p1 -b --suffix .kill-scp --fuzz=0
patching file pathnames.h
patching file hpnscp.1
patching file scp.c
Patch #981 (openssh-8.7p1-recursive-scp.patch):
+ echo 'Patch #981 (openssh-8.7p1-recursive-scp.patch):'
+ /usr/bin/patch --no-backup-if-mismatch -f -p1 -b --suffix .scp-sftpdirs --fuzz=0
patching file scp.c
patching file sftp-client.c
patching file sftp-client.h
patching file sftp.c
Patch #982 (openssh-8.7p1-minrsabits.patch):
+ echo 'Patch #982 (openssh-8.7p1-minrsabits.patch):'
+ /usr/bin/patch --no-backup-if-mismatch -f -p1 -b --suffix .minrsabits --fuzz=0
patching file readconf.c
patching file servconf.c
Patch #984 (openssh-8.7p1-ibmca.patch):
+ echo 'Patch #984 (openssh-8.7p1-ibmca.patch):'
+ /usr/bin/patch --no-backup-if-mismatch -f -p1 -b --suffix .ibmca --fuzz=0
patching file openbsd-compat/bsd-closefrom.c
Patch #200 (openssh-7.6p1-audit.patch):
+ echo 'Patch #200 (openssh-7.6p1-audit.patch):'
+ /usr/bin/patch --no-backup-if-mismatch -f -p1 -b --suffix .audit --fuzz=0
patching file audit-bsm.c
patching file audit.c
patching file audit.h
patching file audit-linux.c
patching file auditstub.c
patching file auth2.c
patching file auth2-hostbased.c
patching file auth2-pubkey.c
patching file auth.c
patching file auth.h
patching file cipher.c
patching file cipher.h
patching file kex.c
patching file kex.h
patching file mac.c
patching file mac.h
patching file Makefile.in
patching file monitor.c
patching file monitor.h
patching file monitor_wrap.c
patching file monitor_wrap.h
patching file packet.c
patching file packet.h
patching file session.c
patching file session.h
patching file sshd.c
patching file sshd-session.c
patching file sshkey.c
patching file sshkey.h
Patch #201 (openssh-7.1p2-audit-race-condition.patch):
+ echo 'Patch #201 (openssh-7.1p2-audit-race-condition.patch):'
+ /usr/bin/patch --no-backup-if-mismatch -f -p1 -b --suffix .audit-race --fuzz=0
patching file monitor_wrap.c
patching file monitor_wrap.h
patching file session.c
Patch #202 (openssh-9.0p1-audit-log.patch):
+ echo 'Patch #202 (openssh-9.0p1-audit-log.patch):'
+ /usr/bin/patch --no-backup-if-mismatch -f -p1 -b --suffix .audit-log --fuzz=0
patching file audit-bsm.c
patching file audit.c
patching file audit.h
patching file audit-linux.c
Patch #203 (openssh-8.7p1-audit-hostname.patch):
+ echo 'Patch #203 (openssh-8.7p1-audit-hostname.patch):'
+ /usr/bin/patch --no-backup-if-mismatch -f -p1 -b --suffix .audit-hostname --fuzz=0
patching file audit-linux.c
Patch #700 (openssh-7.7p1-fips.patch):
+ echo 'Patch #700 (openssh-7.7p1-fips.patch):'
+ /usr/bin/patch --no-backup-if-mismatch -f -p1 -b --suffix .fips --fuzz=0
patching file dh.c
patching file dh.h
patching file kex-names.c
patching file kexgexc.c
patching file myproposal.h
patching file readconf.c
patching file sandbox-seccomp-filter.c
patching file servconf.c
patching file ssh.c
patching file sshconnect2.c
patching file sshd.c
patching file sshd-session.c
patching file sshkey.c
patching file ssh-keygen.c
patching file ssh-rsa.c
patching file kexgen.c
patching file ssh-ed25519.c
Patch #1002 (openssh-8.7p1-ssh-manpage.patch):
+ echo 'Patch #1002 (openssh-8.7p1-ssh-manpage.patch):'
+ /usr/bin/patch --no-backup-if-mismatch -f -p1 -b --suffix .ssh-manpage --fuzz=0
patching file hpnssh.1
Patch #1006 (openssh-8.7p1-negotiate-supported-algs.patch):
+ echo 'Patch #1006 (openssh-8.7p1-negotiate-supported-algs.patch):'
+ /usr/bin/patch --no-backup-if-mismatch -f -p1 -b --suffix .negotiate-supported-algs --fuzz=0
patching file regress/hostkey-agent.sh
patching file sshconnect2.c
Patch #1012 (openssh-9.0p1-evp-fips-dh.patch):
+ echo 'Patch #1012 (openssh-9.0p1-evp-fips-dh.patch):'
+ /usr/bin/patch --no-backup-if-mismatch -f -p1 -b --suffix .evp-fips-dh --fuzz=0
patching file dh.c
patching file kex.c
patching file kexdh.c
patching file kex.h
Patch #1013 (openssh-9.0p1-evp-fips-ecdh.patch):
+ echo 'Patch #1013 (openssh-9.0p1-evp-fips-ecdh.patch):'
+ /usr/bin/patch --no-backup-if-mismatch -f -p1 -b --suffix .evp-fips-ecdh --fuzz=0
patching file kexecdh.c
Patch #1014 (openssh-8.7p1-nohostsha1proof.patch):
+ echo 'Patch #1014 (openssh-8.7p1-nohostsha1proof.patch):'
+ /usr/bin/patch --no-backup-if-mismatch -f -p1 -b --suffix .nosha1hostproof --fuzz=0
patching file compat.c
patching file compat.h
patching file monitor.c
patching file regress/cert-userkey.sh
patching file regress/Makefile
patching file regress/test-exec.sh
patching file regress/unittests/kex/test_kex.c
patching file regress/unittests/sshkey/test_file.c
patching file regress/unittests/sshkey/test_fuzz.c
patching file regress/unittests/sshkey/test_sshkey.c
patching file serverloop.c
patching file sshconnect2.c
patching file ssh-rsa.c
patching file sshd-session.c
Patch #1015 (openssh-9.6p1-pam-rhost.patch):
+ echo 'Patch #1015 (openssh-9.6p1-pam-rhost.patch):'
+ /usr/bin/patch --no-backup-if-mismatch -f -p1 -b --suffix .pam-rhost --fuzz=0
patching file auth-pam.c
Patch #100 (openssh-6.7p1-coverity.patch):
+ echo 'Patch #100 (openssh-6.7p1-coverity.patch):'
+ /usr/bin/patch --no-backup-if-mismatch -f -p1 -b --suffix .coverity --fuzz=0
patching file auth-krb5.c
patching file gss-genr.c
patching file krl.c
patching file loginrec.c
patching file misc.c
patching file monitor.c
patching file openbsd-compat/bindresvport.c
patching file openbsd-compat/bsd-pselect.c
patching file readconf.c
patching file servconf.c
patching file serverloop.c
patching file ssh-agent.c
patching file sshd-session.c
patching file ssh-keygen.c
+ autoupdate
/var/tmp/rpm-tmp.2RjwNH: line 227: autoupdate: command not found

RPM build errors:
error: Bad exit status from /var/tmp/rpm-tmp.2RjwNH (%prep)
    Bad exit status from /var/tmp/rpm-tmp.2RjwNH (%prep)
Finish: chroot ['rpm -i hpnssh-9.9p1_hpn18.6.0-1.fc40.src.rpm; rpmbuild --nodeps -bp $(rpm --eval %_specdir)/hpnssh.spec;chmod -R  go+r  $(rpm --eval %_builddir)/* || :']
Finish: run
 None
NoneType: None
10-02 16:11 root         DEBUG    _topdir: /builddir/build
10-02 16:11 root         INFO     Reading configuration from /etc/mock/site-defaults.cfg
10-02 16:11 root         INFO     Reading configuration from /etc/mock/chroot-aliases.cfg
10-02 16:11 root         INFO     Reading configuration from /var/lib/copr-rpmbuild/results/configs/child.cfg
10-02 16:11 root         INFO     WARNING: Probably non-rawhide buildroot used. Rawhide should be used for most package reviews
10-02 16:11 root         INFO     Active plugins: Shell-api, C/C++, Generic
10-02 16:11 root         DEBUG        CheckBuildCompleted completed: 10.992 seconds
10-02 16:11 root         DEBUG    Skipping CheckExcludeArch in /usr/lib/python3.12/site-packages/FedoraReview/plugins/generic.py, deprecated by generic-excludearch in /usr/share/fedora-review/scripts/generic-excludearch.sh
10-02 16:11 root         DEBUG    Skipping CheckLargeDocs in /usr/lib/python3.12/site-packages/FedoraReview/plugins/generic.py, deprecated by generic-large-docs in /usr/share/fedora-review/scripts/generic-large-docs.sh
10-02 16:11 root         DEBUG    Skipping CheckDesktopFile in /usr/lib/python3.12/site-packages/FedoraReview/plugins/generic.py, deprecated by fonts-disable in /usr/share/fedora-review/scripts/fonts-disable.sh
10-02 16:11 root         DEBUG    Skipping CheckSystemdScripts in /usr/lib/python3.12/site-packages/FedoraReview/plugins/generic.py, deprecated by fonts-disable in /usr/share/fedora-review/scripts/fonts-disable.sh
10-02 16:11 root         DEBUG    Skipping CheckClean in /usr/lib/python3.12/site-packages/FedoraReview/plugins/generic_should.py, deprecated by fonts-disable in /usr/share/fedora-review/scripts/fonts-disable.sh
10-02 16:11 root         DEBUG    Skipping CheckFullVerReqSub in /usr/lib/python3.12/site-packages/FedoraReview/plugins/generic_should.py, deprecated by fonts-disable in /usr/share/fedora-review/scripts/fonts-disable.sh
10-02 16:11 root         DEBUG    Running check: OcamlCheckStaticLibs
10-02 16:11 root         DEBUG        OcamlCheckStaticLibs completed: 0.055 seconds
10-02 16:11 root         DEBUG    Running check: HaskellCheckStaticLibs
10-02 16:11 root         DEBUG        HaskellCheckStaticLibs completed: 0.001 seconds
10-02 16:11 root         DEBUG    Running check: CreateEnvCheck
10-02 16:11 root         DEBUG        CreateEnvCheck completed: 0.001 seconds
10-02 16:11 root         DEBUG    Running check: RCheckBuildRequires
10-02 16:11 root         DEBUG        RCheckBuildRequires completed: 0.000 seconds
10-02 16:11 root         DEBUG    Running check: RCheckCheckMacro
10-02 16:11 root         DEBUG        RCheckCheckMacro completed: 0.000 seconds
10-02 16:11 root         DEBUG    Running check: RCheckDoc
10-02 16:11 root         DEBUG        RCheckDoc completed: 0.000 seconds
10-02 16:11 root         DEBUG    Running check: RCheckInstallSection
10-02 16:11 root         DEBUG        RCheckInstallSection completed: 0.000 seconds
10-02 16:11 root         DEBUG    Running check: RCheckLatestVersionIsPackaged
10-02 16:11 root         DEBUG        RCheckLatestVersionIsPackaged completed: 0.000 seconds
10-02 16:11 root         DEBUG    Running check: RCheckRequires
10-02 16:11 root         DEBUG        RCheckRequires completed: 0.000 seconds
10-02 16:11 root         DEBUG    Running check: CheckBundledGnulib
10-02 16:11 root         DEBUG        CheckBundledGnulib completed: 0.001 seconds
10-02 16:11 root         DEBUG    Running check: CheckGccBuildRequires
10-02 16:11 root         DEBUG        CheckGccBuildRequires completed: 0.000 seconds
10-02 16:11 root         DEBUG    Running check: CheckHeaderFiles
10-02 16:11 root         DEBUG        CheckHeaderFiles completed: 0.001 seconds
10-02 16:11 root         DEBUG    Running check: CheckLDConfig
10-02 16:11 root         DEBUG        CheckLDConfig completed: 0.000 seconds
10-02 16:11 root         DEBUG    Running check: CheckLibToolArchives
10-02 16:11 root         DEBUG        CheckLibToolArchives completed: 0.001 seconds
10-02 16:11 root         DEBUG    Running check: CheckNoKernelModules
10-02 16:11 root         DEBUG        CheckNoKernelModules completed: 0.000 seconds
10-02 16:11 root         DEBUG    Running check: CheckNoStaticExecutables
10-02 16:11 root         DEBUG    Run command: env -i bash -c "source ./review-env.sh; unpack_rpms"
10-02 16:11 root         DEBUG    Run command: file ./rpms-unpacked/hpnssh-askpass-9.9p1_hpn18.6.0-1.fc40.s390x.rpm/usr/libexec/hpnssh/hpnssh-askpass
10-02 16:11 root         DEBUG    Run command: file ./rpms-unpacked/hpnssh-askpass-9.9p1_hpn18.6.0-1.fc40.s390x.rpm/usr/libexec/hpnssh/gnome-hpnssh-askpass
10-02 16:11 root         DEBUG    Run command: file ./rpms-unpacked/hpnssh-askpass-9.9p1_hpn18.6.0-1.fc40.s390x.rpm/usr/lib/.build-id/be/858f908b724884eea0aa2ff1fbf2228e6869da
10-02 16:11 root         DEBUG    Run command: file ./rpms-unpacked/hpnssh-keycat-9.9p1_hpn18.6.0-1.fc40.s390x.rpm/usr/libexec/hpnssh/hpnssh-keycat
10-02 16:11 root         DEBUG    Run command: file ./rpms-unpacked/hpnssh-keycat-9.9p1_hpn18.6.0-1.fc40.s390x.rpm/usr/lib/.build-id/d5/fd4b8275e3f2540bd9706f6be2834ccf42dd58
10-02 16:11 root         DEBUG    Run command: file ./rpms-unpacked/hpnssh-9.9p1_hpn18.6.0-1.fc40.s390x.rpm/usr/libexec/hpnssh/hpnssh-keysign
10-02 16:11 root         DEBUG    Run command: file ./rpms-unpacked/hpnssh-9.9p1_hpn18.6.0-1.fc40.s390x.rpm/usr/lib/.build-id/aa/d0a6577efd93a052725e14cd40a7ef875344b8
10-02 16:11 root         DEBUG    Run command: file ./rpms-unpacked/hpnssh-9.9p1_hpn18.6.0-1.fc40.s390x.rpm/usr/lib/.build-id/94/cb22c1b9edec4d3341d915d988d47230fbd611
10-02 16:11 root         DEBUG    Run command: file ./rpms-unpacked/hpnssh-9.9p1_hpn18.6.0-1.fc40.s390x.rpm/usr/bin/hpnssh-keygen
10-02 16:11 root         DEBUG    Run command: file ./rpms-unpacked/hpnssh-server-9.9p1_hpn18.6.0-1.fc40.s390x.rpm/usr/sbin/hpnsshd
10-02 16:11 root         DEBUG    Run command: file ./rpms-unpacked/hpnssh-server-9.9p1_hpn18.6.0-1.fc40.s390x.rpm/usr/libexec/hpnssh/hpnsshd-keygen
10-02 16:11 root         DEBUG    Run command: file ./rpms-unpacked/hpnssh-server-9.9p1_hpn18.6.0-1.fc40.s390x.rpm/usr/libexec/hpnssh/hpnsshd-session
10-02 16:11 root         DEBUG    Run command: file ./rpms-unpacked/hpnssh-server-9.9p1_hpn18.6.0-1.fc40.s390x.rpm/usr/libexec/hpnssh/hpnsftp-server
10-02 16:11 root         DEBUG    Run command: file ./rpms-unpacked/hpnssh-server-9.9p1_hpn18.6.0-1.fc40.s390x.rpm/usr/lib/.build-id/25/16ba3401a714a9e26b18277c2de6b6c83dacd8
10-02 16:11 root         DEBUG    Run command: file ./rpms-unpacked/hpnssh-server-9.9p1_hpn18.6.0-1.fc40.s390x.rpm/usr/lib/.build-id/29/d644642fff3b8709d4f2c7347799588fd321d8
10-02 16:11 root         DEBUG    Run command: file ./rpms-unpacked/hpnssh-server-9.9p1_hpn18.6.0-1.fc40.s390x.rpm/usr/lib/.build-id/52/d02db138edf2a93803a8fad1f11e1ce018d42d
10-02 16:11 root         DEBUG    Run command: file ./rpms-unpacked/hpnssh-clients-9.9p1_hpn18.6.0-1.fc40.s390x.rpm/usr/libexec/hpnssh/hpnssh-pkcs11-helper
10-02 16:11 root         DEBUG    Run command: file ./rpms-unpacked/hpnssh-clients-9.9p1_hpn18.6.0-1.fc40.s390x.rpm/usr/libexec/hpnssh/hpnssh-sk-helper
10-02 16:11 root         DEBUG    Run command: file ./rpms-unpacked/hpnssh-clients-9.9p1_hpn18.6.0-1.fc40.s390x.rpm/usr/lib/.build-id/fe/aa176cc24544c338fd09adb0710ba84bb7d763
10-02 16:11 root         DEBUG    Run command: file ./rpms-unpacked/hpnssh-clients-9.9p1_hpn18.6.0-1.fc40.s390x.rpm/usr/lib/.build-id/0f/e1ea9c72674f2f8d0966ea42ab8c7fb21688a4
10-02 16:11 root         DEBUG    Run command: file ./rpms-unpacked/hpnssh-clients-9.9p1_hpn18.6.0-1.fc40.s390x.rpm/usr/lib/.build-id/02/19e1c94d136e6ed4f884e8fb3b536f34407b35
10-02 16:11 root         DEBUG    Run command: file ./rpms-unpacked/hpnssh-clients-9.9p1_hpn18.6.0-1.fc40.s390x.rpm/usr/lib/.build-id/3a/410a5a7c288d8c35035d9e15b0336bbd9641c5
10-02 16:11 root         DEBUG    Run command: file ./rpms-unpacked/hpnssh-clients-9.9p1_hpn18.6.0-1.fc40.s390x.rpm/usr/lib/.build-id/ea/307ba291b139012efdabddb86c09f32c0f19bc
10-02 16:11 root         DEBUG    Run command: file ./rpms-unpacked/hpnssh-clients-9.9p1_hpn18.6.0-1.fc40.s390x.rpm/usr/lib/.build-id/aa/32d4f471e09857529064b7c6fbac105e03c762
10-02 16:11 root         DEBUG    Run command: file ./rpms-unpacked/hpnssh-clients-9.9p1_hpn18.6.0-1.fc40.s390x.rpm/usr/lib/.build-id/18/510fef98cef9248a4dabca3ffa7820a446d89a
10-02 16:11 root         DEBUG    Run command: file ./rpms-unpacked/hpnssh-clients-9.9p1_hpn18.6.0-1.fc40.s390x.rpm/usr/lib/.build-id/1f/af4d53298051eb842f5e600724bb82b30829be
10-02 16:11 root         DEBUG    Run command: file ./rpms-unpacked/hpnssh-clients-9.9p1_hpn18.6.0-1.fc40.s390x.rpm/usr/bin/hpnssh
10-02 16:11 root         DEBUG    Run command: file ./rpms-unpacked/hpnssh-clients-9.9p1_hpn18.6.0-1.fc40.s390x.rpm/usr/bin/hpnssh-keyscan
10-02 16:11 root         DEBUG    Run command: file ./rpms-unpacked/hpnssh-clients-9.9p1_hpn18.6.0-1.fc40.s390x.rpm/usr/bin/hpnssh-add
10-02 16:11 root         DEBUG    Run command: file ./rpms-unpacked/hpnssh-clients-9.9p1_hpn18.6.0-1.fc40.s390x.rpm/usr/bin/hpnssh-copy-id
10-02 16:11 root         DEBUG    Run command: file ./rpms-unpacked/hpnssh-clients-9.9p1_hpn18.6.0-1.fc40.s390x.rpm/usr/bin/hpnssh-agent
10-02 16:11 root         DEBUG    Run command: file ./rpms-unpacked/hpnssh-clients-9.9p1_hpn18.6.0-1.fc40.s390x.rpm/usr/bin/hpnsftp
10-02 16:11 root         DEBUG    Run command: file ./rpms-unpacked/hpnssh-clients-9.9p1_hpn18.6.0-1.fc40.s390x.rpm/usr/bin/hpnscp
10-02 16:11 root         DEBUG        CheckNoStaticExecutables completed: 0.204 seconds
10-02 16:11 root         DEBUG    Running check: CheckRPATH
10-02 16:11 root         DEBUG        CheckRPATH completed: 0.001 seconds
10-02 16:11 root         DEBUG    Running check: CheckSoFiles
10-02 16:11 root         DEBUG        CheckSoFiles completed: 0.001 seconds
10-02 16:11 root         DEBUG    Running check: CheckJavaPlugin
10-02 16:11 root         DEBUG        CheckJavaPlugin completed: 0.002 seconds
10-02 16:11 root         DEBUG    Running check: PerlCheckBuildRequires
10-02 16:11 root         DEBUG        PerlCheckBuildRequires completed: 0.001 seconds
10-02 16:11 root         DEBUG    Running check: CheckPythonBuildRequires
10-02 16:11 root         DEBUG        CheckPythonBuildRequires completed: 0.000 seconds
10-02 16:11 root         DEBUG    Running check: CheckPythonRequires
10-02 16:11 root         DEBUG        CheckPythonRequires completed: 0.000 seconds
10-02 16:11 root         DEBUG    Running check: CheckPythonX_Site
10-02 16:11 root         DEBUG        CheckPythonX_Site completed: 0.000 seconds
10-02 16:11 root         DEBUG    Running check: CheckApprovedLicense
10-02 16:11 root         DEBUG        CheckApprovedLicense completed: 0.000 seconds
10-02 16:11 root         DEBUG    Running check: CheckBuildrootMacros
10-02 16:11 root         DEBUG        CheckBuildrootMacros completed: 0.005 seconds
10-02 16:11 root         DEBUG    Running check: CheckBundledLibs
10-02 16:11 root         DEBUG        CheckBundledLibs completed: 0.000 seconds
10-02 16:11 root         DEBUG    Running check: CheckChangelogFormat
10-02 16:11 root         DEBUG        CheckChangelogFormat completed: 0.000 seconds
10-02 16:11 root         DEBUG    Running check: CheckCleanBuildroot
10-02 16:11 root         DEBUG    regex: rm\s+\-[rf][rf]\s+(/rpmbuild/BUILDROOT/hpnssh-9.9p1_hpn18.6.0-1.fc39.s390x|\$RPM_BUILD_ROOT)[^/]
10-02 16:11 root         DEBUG    install_sec: 
mkdir -p -m755 $RPM_BUILD_ROOT/etc/hpnssh
mkdir -p -m755 $RPM_BUILD_ROOT/etc/hpnssh/ssh_config.d
mkdir -p -m755 $RPM_BUILD_ROOT/etc/hpnssh/sshd_config.d
mkdir -p -m755 $RPM_BUILD_ROOT/usr/libexec/hpnssh
mkdir -p -m755 $RPM_BUILD_ROOT/usr/share/empty.hpnsshd
mkdir -p -m755 $RPM_BUILD_ROOT/usr/lib/systemd/system
mkdir -p -m755 $RPM_BUILD_ROOT/etc/profile.d

/usr/bin/make install DESTDIR=/rpmbuild/BUILDROOT/hpnssh-9.9p1_hpn18.6.0-1.fc39.s390x INSTALL="/usr/bin/install -p"

install -d $RPM_BUILD_ROOT/etc/pam.d/
install -d $RPM_BUILD_ROOT/etc/sysconfig/
install -d $RPM_BUILD_ROOT/usr/libexec/hpnssh

# handle which pam conf we will use
install -m644 /rpmbuild/SOURCES/hpnsshd.pam $RPM_BUILD_ROOT/etc/pam.d/hpnsshd
install -m644 /rpmbuild/SOURCES/hpnssh-keycat.pam $RPM_BUILD_ROOT/etc/pam.d/hpnssh-keycat

install -m644 /rpmbuild/SOURCES/hpnsshd.sysconfig $RPM_BUILD_ROOT/etc/sysconfig/hpnsshd
install -m644 ssh_config_redhat $RPM_BUILD_ROOT/etc/hpnssh/ssh_config.d/50-redhat.conf
install -m644 sshd_config_redhat $RPM_BUILD_ROOT/etc/hpnssh/sshd_config.d/50-redhat.conf
install -d -m755 $RPM_BUILD_ROOT/usr/lib/systemd/system
install -m644 /rpmbuild/SOURCES/hpnsshd@.service $RPM_BUILD_ROOT/usr/lib/systemd/system/hpnsshd@.service
install -m644 /rpmbuild/SOURCES/hpnsshd.socket $RPM_BUILD_ROOT/usr/lib/systemd/system/hpnsshd.socket
install -m644 /rpmbuild/SOURCES/hpnsshd.service $RPM_BUILD_ROOT/usr/lib/systemd/system/hpnsshd.service
install -m644 /rpmbuild/SOURCES/hpnsshd-keygen@.service $RPM_BUILD_ROOT/usr/lib/systemd/system/hpnsshd-keygen@.service
install -m644 /rpmbuild/SOURCES/hpnsshd-keygen.target $RPM_BUILD_ROOT/usr/lib/systemd/system/hpnsshd-keygen.target
install -d -m755 $RPM_BUILD_ROOT/usr/lib/systemd/user
install -m644 /rpmbuild/SOURCES/hpnssh-agent.service $RPM_BUILD_ROOT/usr/lib/systemd/user/hpnssh-agent.service
install -m644 /rpmbuild/SOURCES/hpnssh-agent.socket $RPM_BUILD_ROOT//usr/lib/systemd/user/hpnssh-agent.socket
install -m744 /rpmbuild/SOURCES/hpnsshd-keygen $RPM_BUILD_ROOT/usr/libexec/hpnssh/hpnsshd-keygen
install -m755 contrib/hpnssh-copy-id $RPM_BUILD_ROOT/usr/bin/
install contrib/hpnssh-copy-id.1 $RPM_BUILD_ROOT/usr/share/man/man1/
install -d -m711 $RPM_BUILD_ROOT/usr/share/empty.hpnsshd
install -p -D -m 0644 /rpmbuild/SOURCES/hpnsshd.sysuser $RPM_BUILD_ROOT/usr/lib/sysusers.d/hpnsshd.conf

install contrib/gnome-hpnssh-askpass $RPM_BUILD_ROOT/usr/libexec/hpnssh/gnome-hpnssh-askpass

ln -s gnome-hpnssh-askpass $RPM_BUILD_ROOT/usr/libexec/hpnssh/hpnssh-askpass
install -m 755 -d $RPM_BUILD_ROOT/etc/profile.d/
install -m 755 contrib/redhat/gnome-ssh-askpass.csh $RPM_BUILD_ROOT/etc/profile.d/gnome-hpnssh-askpass.csh
install -m 755 contrib/redhat/gnome-ssh-askpass.sh $RPM_BUILD_ROOT/etc/profile.d/gnome-hpnssh-askpass.sh


perl -pi -e "s|$RPM_BUILD_ROOT||g" $RPM_BUILD_ROOT/usr/share/man/man*/*


10-02 16:11 root         DEBUG        CheckCleanBuildroot completed: 0.000 seconds
10-02 16:11 root         DEBUG    Running check: CheckCodeAndContent
10-02 16:11 root         DEBUG        CheckCodeAndContent completed: 0.000 seconds
10-02 16:11 root         DEBUG    Running check: CheckConfigNoReplace
10-02 16:11 root         DEBUG        CheckConfigNoReplace completed: 0.000 seconds
10-02 16:11 root         DEBUG    Running check: CheckDefattr
10-02 16:11 root         DEBUG        CheckDefattr completed: 0.000 seconds
10-02 16:11 root         DEBUG    Running check: CheckDescMacros
10-02 16:11 root         DEBUG        CheckDescMacros completed: 0.000 seconds
10-02 16:11 root         DEBUG    Running check: CheckDesktopFile
10-02 16:11 root         DEBUG        CheckDesktopFile completed: 0.001 seconds
10-02 16:11 root         DEBUG    Running check: CheckDesktopFileInstall
10-02 16:11 root         DEBUG        CheckDesktopFileInstall completed: 0.000 seconds
10-02 16:11 root         DEBUG    Running check: CheckDevelFilesInDevel
10-02 16:11 root         DEBUG        CheckDevelFilesInDevel completed: 0.000 seconds
10-02 16:11 root         DEBUG    Running check: CheckDirectoryRequire
10-02 16:11 root         DEBUG    Running: mock -r /var/lib/copr-rpmbuild/results/configs/child.cfg --no-cleanup-after --no-clean --plugin-option=tmpfs:keep_mounted=True -qn --enable-network --shell -- dnf repoquery -C -l 'filesystem'
10-02 16:12 root         DEBUG    Running: mock -r /var/lib/copr-rpmbuild/results/configs/child.cfg --no-cleanup-after --no-clean --plugin-option=tmpfs:keep_mounted=True -qn --enable-network --shell -- dnf repoquery -C --quiet --file /etc/profile.d
10-02 16:12 root         DEBUG    Running: mock -r /var/lib/copr-rpmbuild/results/configs/child.cfg --no-cleanup-after --no-clean --plugin-option=tmpfs:keep_mounted=True -qn --enable-network --shell -- dnf repoquery -C --quiet --file /etc/pam.d
10-02 16:12 root         DEBUG        CheckDirectoryRequire completed: 49.487 seconds
10-02 16:12 root         DEBUG    Running check: CheckDistTag
10-02 16:12 root         DEBUG        CheckDistTag completed: 0.001 seconds
10-02 16:12 root         DEBUG    Running check: CheckDocRuntime
10-02 16:12 root         DEBUG        CheckDocRuntime completed: 0.000 seconds
10-02 16:12 root         DEBUG    Running check: CheckFileDuplicates
10-02 16:12 root         DEBUG        CheckFileDuplicates completed: 0.000 seconds
10-02 16:12 root         DEBUG    Running check: CheckFilePermissions
10-02 16:12 root         DEBUG        CheckFilePermissions completed: 0.000 seconds
10-02 16:12 root         DEBUG    Running check: CheckGconfSchemaInstall
10-02 16:12 root         DEBUG        CheckGconfSchemaInstall completed: 0.001 seconds
10-02 16:12 root         DEBUG    Running check: CheckGdkPixbufLoaders
10-02 16:12 root         DEBUG        CheckGdkPixbufLoaders completed: 0.001 seconds
10-02 16:12 root         DEBUG    Running check: CheckGioQueryModules
10-02 16:12 root         DEBUG        CheckGioQueryModules completed: 0.001 seconds
10-02 16:12 root         DEBUG    Running check: CheckGlibCompileSchemas
10-02 16:12 root         DEBUG        CheckGlibCompileSchemas completed: 0.001 seconds
10-02 16:12 root         DEBUG    Running check: CheckGtkQueryModules
10-02 16:12 root         DEBUG        CheckGtkQueryModules completed: 0.001 seconds
10-02 16:12 root         DEBUG    Running check: CheckGuidelines
10-02 16:12 root         DEBUG        CheckGuidelines completed: 0.000 seconds
10-02 16:12 root         DEBUG    Running check: CheckIfDepsDeprecated
10-02 16:12 root         DEBUG    Running: mock -r /var/lib/copr-rpmbuild/results/configs/child.cfg --no-cleanup-after --no-clean --plugin-option=tmpfs:keep_mounted=True -qn --enable-network --shell -- dnf repoquery -q -C --whatprovides 'libpam.so.0()(64bit)'
10-02 16:12 root         DEBUG    Running: mock -r /var/lib/copr-rpmbuild/results/configs/child.cfg --no-cleanup-after --no-clean --plugin-option=tmpfs:keep_mounted=True -qn --enable-network --shell -- dnf repoquery -q -C --whatprovides 'libcrypto.so.3(OPENSSL_3.0.0)(64bit)'
10-02 16:12 root         DEBUG    Running: mock -r /var/lib/copr-rpmbuild/results/configs/child.cfg --no-cleanup-after --no-clean --plugin-option=tmpfs:keep_mounted=True -qn --enable-network --shell -- dnf repoquery -q -C --whatprovides 'systemd-rpm-macros'
10-02 16:12 root         DEBUG    Running: mock -r /var/lib/copr-rpmbuild/results/configs/child.cfg --no-cleanup-after --no-clean --plugin-option=tmpfs:keep_mounted=True -qn --enable-network --shell -- dnf repoquery -q -C --whatprovides 'libc.so.6(GLIBC_2.36)(64bit)'
10-02 16:12 root         DEBUG    Running: mock -r /var/lib/copr-rpmbuild/results/configs/child.cfg --no-cleanup-after --no-clean --plugin-option=tmpfs:keep_mounted=True -qn --enable-network --shell -- dnf repoquery -q -C --whatprovides 'rtld(GNU_HASH)'
10-02 16:12 root         DEBUG    Running: mock -r /var/lib/copr-rpmbuild/results/configs/child.cfg --no-cleanup-after --no-clean --plugin-option=tmpfs:keep_mounted=True -qn --enable-network --shell -- dnf repoquery -q -C --whatprovides 'libkrb5.so.3()(64bit)'
10-02 16:12 root         DEBUG    Running: mock -r /var/lib/copr-rpmbuild/results/configs/child.cfg --no-cleanup-after --no-clean --plugin-option=tmpfs:keep_mounted=True -qn --enable-network --shell -- dnf repoquery -q -C --whatprovides '/usr/bin/sh'
10-02 16:12 root         DEBUG    Running: mock -r /var/lib/copr-rpmbuild/results/configs/child.cfg --no-cleanup-after --no-clean --plugin-option=tmpfs:keep_mounted=True -qn --enable-network --shell -- dnf repoquery -q -C --whatprovides '/usr/sbin/nologin'
10-02 16:12 root         DEBUG    Running: mock -r /var/lib/copr-rpmbuild/results/configs/child.cfg --no-cleanup-after --no-clean --plugin-option=tmpfs:keep_mounted=True -qn --enable-network --shell -- dnf repoquery -q -C --whatprovides 'ncurses-devel'
10-02 16:12 root         DEBUG    Running: mock -r /var/lib/copr-rpmbuild/results/configs/child.cfg --no-cleanup-after --no-clean --plugin-option=tmpfs:keep_mounted=True -qn --enable-network --shell -- dnf repoquery -q -C --whatprovides 'krb5-devel'
10-02 16:12 root         DEBUG    Running: mock -r /var/lib/copr-rpmbuild/results/configs/child.cfg --no-cleanup-after --no-clean --plugin-option=tmpfs:keep_mounted=True -qn --enable-network --shell -- dnf repoquery -q -C --whatprovides '/usr/sbin/useradd'
10-02 16:12 root         DEBUG    Running: mock -r /var/lib/copr-rpmbuild/results/configs/child.cfg --no-cleanup-after --no-clean --plugin-option=tmpfs:keep_mounted=True -qn --enable-network --shell -- dnf repoquery -q -C --whatprovides 'libc.so.6(GLIBC_2.34)(64bit)'
10-02 16:12 root         DEBUG    Running: mock -r /var/lib/copr-rpmbuild/results/configs/child.cfg --no-cleanup-after --no-clean --plugin-option=tmpfs:keep_mounted=True -qn --enable-network --shell -- dnf repoquery -q -C --whatprovides 'make'
10-02 16:12 root         DEBUG    Running: mock -r /var/lib/copr-rpmbuild/results/configs/child.cfg --no-cleanup-after --no-clean --plugin-option=tmpfs:keep_mounted=True -qn --enable-network --shell -- dnf repoquery -q -C --whatprovides 'autoconf'
10-02 16:12 root         DEBUG    Running: mock -r /var/lib/copr-rpmbuild/results/configs/child.cfg --no-cleanup-after --no-clean --plugin-option=tmpfs:keep_mounted=True -qn --enable-network --shell -- dnf repoquery -q -C --whatprovides 'gcc'
10-02 16:13 root         DEBUG    Running: mock -r /var/lib/copr-rpmbuild/results/configs/child.cfg --no-cleanup-after --no-clean --plugin-option=tmpfs:keep_mounted=True -qn --enable-network --shell -- dnf repoquery -q -C --whatprovides 'libcrypt.so.2(XCRYPT_2.0)(64bit)'
10-02 16:13 root         DEBUG    Running: mock -r /var/lib/copr-rpmbuild/results/configs/child.cfg --no-cleanup-after --no-clean --plugin-option=tmpfs:keep_mounted=True -qn --enable-network --shell -- dnf repoquery -q -C --whatprovides 'p11-kit-devel'
10-02 16:13 root         DEBUG    Running: mock -r /var/lib/copr-rpmbuild/results/configs/child.cfg --no-cleanup-after --no-clean --plugin-option=tmpfs:keep_mounted=True -qn --enable-network --shell -- dnf repoquery -q -C --whatprovides 'libc.so.6(GLIBC_2.38)(64bit)'
10-02 16:13 root         DEBUG    Running: mock -r /var/lib/copr-rpmbuild/results/configs/child.cfg --no-cleanup-after --no-clean --plugin-option=tmpfs:keep_mounted=True -qn --enable-network --shell -- dnf repoquery -q -C --whatprovides 'libselinux-devel'
10-02 16:13 root         DEBUG    Running: mock -r /var/lib/copr-rpmbuild/results/configs/child.cfg --no-cleanup-after --no-clean --plugin-option=tmpfs:keep_mounted=True -qn --enable-network --shell -- dnf repoquery -q -C --whatprovides 'libc.so.6(GLIBC_2.26)(64bit)'
10-02 16:13 root         DEBUG    Running: mock -r /var/lib/copr-rpmbuild/results/configs/child.cfg --no-cleanup-after --no-clean --plugin-option=tmpfs:keep_mounted=True -qn --enable-network --shell -- dnf repoquery -q -C --whatprovides 'libcom_err.so.2()(64bit)'
10-02 16:13 root         DEBUG    Running: mock -r /var/lib/copr-rpmbuild/results/configs/child.cfg --no-cleanup-after --no-clean --plugin-option=tmpfs:keep_mounted=True -qn --enable-network --shell -- dnf repoquery -q -C --whatprovides 'libc.so.6(GLIBC_2.2.4)(64bit)'
10-02 16:13 root         DEBUG    Running: mock -r /var/lib/copr-rpmbuild/results/configs/child.cfg --no-cleanup-after --no-clean --plugin-option=tmpfs:keep_mounted=True -qn --enable-network --shell -- dnf repoquery -q -C --whatprovides 'systemd'
10-02 16:13 root         DEBUG    Running: mock -r /var/lib/copr-rpmbuild/results/configs/child.cfg --no-cleanup-after --no-clean --plugin-option=tmpfs:keep_mounted=True -qn --enable-network --shell -- dnf repoquery -q -C --whatprovides 'libcrypto.so.3()(64bit)'
10-02 16:13 root         DEBUG    Running: mock -r /var/lib/copr-rpmbuild/results/configs/child.cfg --no-cleanup-after --no-clean --plugin-option=tmpfs:keep_mounted=True -qn --enable-network --shell -- dnf repoquery -q -C --whatprovides 'crypto-policies'
10-02 16:13 root         DEBUG    Running: mock -r /var/lib/copr-rpmbuild/results/configs/child.cfg --no-cleanup-after --no-clean --plugin-option=tmpfs:keep_mounted=True -qn --enable-network --shell -- dnf repoquery -q -C --whatprovides 'libc.so.6(GLIBC_2.25)(64bit)'
10-02 16:13 root         DEBUG    Running: mock -r /var/lib/copr-rpmbuild/results/configs/child.cfg --no-cleanup-after --no-clean --plugin-option=tmpfs:keep_mounted=True -qn --enable-network --shell -- dnf repoquery -q -C --whatprovides 'libsystemd.so.0(LIBSYSTEMD_209)(64bit)'
10-02 16:13 root         DEBUG    Running: mock -r /var/lib/copr-rpmbuild/results/configs/child.cfg --no-cleanup-after --no-clean --plugin-option=tmpfs:keep_mounted=True -qn --enable-network --shell -- dnf repoquery -q -C --whatprovides 'groff'
10-02 16:13 root         DEBUG    Running: mock -r /var/lib/copr-rpmbuild/results/configs/child.cfg --no-cleanup-after --no-clean --plugin-option=tmpfs:keep_mounted=True -qn --enable-network --shell -- dnf repoquery -q -C --whatprovides 'libc.so.6(GLIBC_2.33)(64bit)'
10-02 16:13 root         DEBUG    Running: mock -r /var/lib/copr-rpmbuild/results/configs/child.cfg --no-cleanup-after --no-clean --plugin-option=tmpfs:keep_mounted=True -qn --enable-network --shell -- dnf repoquery -q -C --whatprovides 'automake'
10-02 16:13 root         DEBUG    Running: mock -r /var/lib/copr-rpmbuild/results/configs/child.cfg --no-cleanup-after --no-clean --plugin-option=tmpfs:keep_mounted=True -qn --enable-network --shell -- dnf repoquery -q -C --whatprovides 'libgcc_s.so.1()(64bit)'
10-02 16:13 root         DEBUG    Running: mock -r /var/lib/copr-rpmbuild/results/configs/child.cfg --no-cleanup-after --no-clean --plugin-option=tmpfs:keep_mounted=True -qn --enable-network --shell -- dnf repoquery -q -C --whatprovides 'perl-podlators'
10-02 16:13 root         DEBUG    Running: mock -r /var/lib/copr-rpmbuild/results/configs/child.cfg --no-cleanup-after --no-clean --plugin-option=tmpfs:keep_mounted=True -qn --enable-network --shell -- dnf repoquery -q -C --whatprovides 'libselinux.so.1(LIBSELINUX_1.0)(64bit)'
10-02 16:14 root         DEBUG    Running: mock -r /var/lib/copr-rpmbuild/results/configs/child.cfg --no-cleanup-after --no-clean --plugin-option=tmpfs:keep_mounted=True -qn --enable-network --shell -- dnf repoquery -q -C --whatprovides 'libgssapi_krb5.so.2(gssapi_krb5_2_MIT)(64bit)'
10-02 16:14 root         DEBUG    Running: mock -r /var/lib/copr-rpmbuild/results/configs/child.cfg --no-cleanup-after --no-clean --plugin-option=tmpfs:keep_mounted=True -qn --enable-network --shell -- dnf repoquery -q -C --whatprovides 'perl-generators'
10-02 16:14 root         DEBUG    Running: mock -r /var/lib/copr-rpmbuild/results/configs/child.cfg --no-cleanup-after --no-clean --plugin-option=tmpfs:keep_mounted=True -qn --enable-network --shell -- dnf repoquery -q -C --whatprovides 'libglib-2.0.so.0()(64bit)'
10-02 16:14 root         DEBUG    Running: mock -r /var/lib/copr-rpmbuild/results/configs/child.cfg --no-cleanup-after --no-clean --plugin-option=tmpfs:keep_mounted=True -qn --enable-network --shell -- dnf repoquery -q -C --whatprovides 'openssl-devel'
10-02 16:14 root         DEBUG    Running: mock -r /var/lib/copr-rpmbuild/results/configs/child.cfg --no-cleanup-after --no-clean --plugin-option=tmpfs:keep_mounted=True -qn --enable-network --shell -- dnf repoquery -q -C --whatprovides 'gtk3-devel'
10-02 16:14 root         DEBUG    Running: mock -r /var/lib/copr-rpmbuild/results/configs/child.cfg --no-cleanup-after --no-clean --plugin-option=tmpfs:keep_mounted=True -qn --enable-network --shell -- dnf repoquery -q -C --whatprovides 'libz.so.1()(64bit)'
10-02 16:14 root         DEBUG    Running: mock -r /var/lib/copr-rpmbuild/results/configs/child.cfg --no-cleanup-after --no-clean --plugin-option=tmpfs:keep_mounted=True -qn --enable-network --shell -- dnf repoquery -q -C --whatprovides 'libedit.so.0()(64bit)'
10-02 16:14 root         DEBUG    Running: mock -r /var/lib/copr-rpmbuild/results/configs/child.cfg --no-cleanup-after --no-clean --plugin-option=tmpfs:keep_mounted=True -qn --enable-network --shell -- dnf repoquery -q -C --whatprovides 'libcrypt.so.2()(64bit)'
10-02 16:14 root         DEBUG    Running: mock -r /var/lib/copr-rpmbuild/results/configs/child.cfg --no-cleanup-after --no-clean --plugin-option=tmpfs:keep_mounted=True -qn --enable-network --shell -- dnf repoquery -q -C --whatprovides 'libc.so.6(GLIBC_2.6)(64bit)'
10-02 16:14 root         DEBUG    Running: mock -r /var/lib/copr-rpmbuild/results/configs/child.cfg --no-cleanup-after --no-clean --plugin-option=tmpfs:keep_mounted=True -qn --enable-network --shell -- dnf repoquery -q -C --whatprovides 'pam-devel'
10-02 16:14 root         DEBUG    Running: mock -r /var/lib/copr-rpmbuild/results/configs/child.cfg --no-cleanup-after --no-clean --plugin-option=tmpfs:keep_mounted=True -qn --enable-network --shell -- dnf repoquery -q -C --whatprovides 'libc.so.6(GLIBC_2.3.4)(64bit)'
10-02 16:14 root         DEBUG    Running: mock -r /var/lib/copr-rpmbuild/results/configs/child.cfg --no-cleanup-after --no-clean --plugin-option=tmpfs:keep_mounted=True -qn --enable-network --shell -- dnf repoquery -q -C --whatprovides 'libc.so.6(GLIBC_2.3)(64bit)'
10-02 16:14 root         DEBUG    Running: mock -r /var/lib/copr-rpmbuild/results/configs/child.cfg --no-cleanup-after --no-clean --plugin-option=tmpfs:keep_mounted=True -qn --enable-network --shell -- dnf repoquery -q -C --whatprovides 'systemd-devel'
10-02 16:14 root         DEBUG    Running: mock -r /var/lib/copr-rpmbuild/results/configs/child.cfg --no-cleanup-after --no-clean --plugin-option=tmpfs:keep_mounted=True -qn --enable-network --shell -- dnf repoquery -q -C --whatprovides 'zlib-devel'
10-02 16:14 root         DEBUG    Running: mock -r /var/lib/copr-rpmbuild/results/configs/child.cfg --no-cleanup-after --no-clean --plugin-option=tmpfs:keep_mounted=True -qn --enable-network --shell -- dnf repoquery -q -C --whatprovides 'libX11-devel'
10-02 16:14 root         DEBUG    Running: mock -r /var/lib/copr-rpmbuild/results/configs/child.cfg --no-cleanup-after --no-clean --plugin-option=tmpfs:keep_mounted=True -qn --enable-network --shell -- dnf repoquery -q -C --whatprovides 'libgcc_s.so.1(GCC_3.0)(64bit)'
10-02 16:14 root         DEBUG    Running: mock -r /var/lib/copr-rpmbuild/results/configs/child.cfg --no-cleanup-after --no-clean --plugin-option=tmpfs:keep_mounted=True -qn --enable-network --shell -- dnf repoquery -q -C --whatprovides 'libkrb5.so.3(krb5_3_MIT)(64bit)'
10-02 16:14 root         DEBUG    Running: mock -r /var/lib/copr-rpmbuild/results/configs/child.cfg --no-cleanup-after --no-clean --plugin-option=tmpfs:keep_mounted=True -qn --enable-network --shell -- dnf repoquery -q -C --whatprovides 'libaudit.so.1()(64bit)'
10-02 16:14 root         DEBUG    Running: mock -r /var/lib/copr-rpmbuild/results/configs/child.cfg --no-cleanup-after --no-clean --plugin-option=tmpfs:keep_mounted=True -qn --enable-network --shell -- dnf repoquery -q -C --whatprovides 'libc.so.6(GLIBC_2.3.2)(64bit)'
10-02 16:15 root         DEBUG    Running: mock -r /var/lib/copr-rpmbuild/results/configs/child.cfg --no-cleanup-after --no-clean --plugin-option=tmpfs:keep_mounted=True -qn --enable-network --shell -- dnf repoquery -q -C --whatprovides 'libc.so.6(GLIBC_2.4)(64bit)'
10-02 16:15 root         DEBUG    Running: mock -r /var/lib/copr-rpmbuild/results/configs/child.cfg --no-cleanup-after --no-clean --plugin-option=tmpfs:keep_mounted=True -qn --enable-network --shell -- dnf repoquery -q -C --whatprovides 'pam'
10-02 16:15 root         DEBUG    Running: mock -r /var/lib/copr-rpmbuild/results/configs/child.cfg --no-cleanup-after --no-clean --plugin-option=tmpfs:keep_mounted=True -qn --enable-network --shell -- dnf repoquery -q -C --whatprovides 'libc.so.6(GLIBC_2.2)(64bit)'
10-02 16:15 root         DEBUG    Running: mock -r /var/lib/copr-rpmbuild/results/configs/child.cfg --no-cleanup-after --no-clean --plugin-option=tmpfs:keep_mounted=True -qn --enable-network --shell -- dnf repoquery -q -C --whatprovides 'libselinux.so.1()(64bit)'
10-02 16:15 root         DEBUG    Running: mock -r /var/lib/copr-rpmbuild/results/configs/child.cfg --no-cleanup-after --no-clean --plugin-option=tmpfs:keep_mounted=True -qn --enable-network --shell -- dnf repoquery -q -C --whatprovides '/usr/bin/bash'
10-02 16:15 root         DEBUG    Running: mock -r /var/lib/copr-rpmbuild/results/configs/child.cfg --no-cleanup-after --no-clean --plugin-option=tmpfs:keep_mounted=True -qn --enable-network --shell -- dnf repoquery -q -C --whatprovides 'libgobject-2.0.so.0()(64bit)'
10-02 16:15 root         DEBUG    Running: mock -r /var/lib/copr-rpmbuild/results/configs/child.cfg --no-cleanup-after --no-clean --plugin-option=tmpfs:keep_mounted=True -qn --enable-network --shell -- dnf repoquery -q -C --whatprovides 'libsystemd.so.0()(64bit)'
10-02 16:15 root         DEBUG    Running: mock -r /var/lib/copr-rpmbuild/results/configs/child.cfg --no-cleanup-after --no-clean --plugin-option=tmpfs:keep_mounted=True -qn --enable-network --shell -- dnf repoquery -q -C --whatprovides 'libc.so.6(GLIBC_2.8)(64bit)'
10-02 16:15 root         DEBUG    Running: mock -r /var/lib/copr-rpmbuild/results/configs/child.cfg --no-cleanup-after --no-clean --plugin-option=tmpfs:keep_mounted=True -qn --enable-network --shell -- dnf repoquery -q -C --whatprovides 'libgcc_s.so.1(GCC_3.3.1)(64bit)'
10-02 16:15 root         DEBUG    Running: mock -r /var/lib/copr-rpmbuild/results/configs/child.cfg --no-cleanup-after --no-clean --plugin-option=tmpfs:keep_mounted=True -qn --enable-network --shell -- dnf repoquery -q -C --whatprovides 'gnupg2'
10-02 16:15 root         DEBUG    Running: mock -r /var/lib/copr-rpmbuild/results/configs/child.cfg --no-cleanup-after --no-clean --plugin-option=tmpfs:keep_mounted=True -qn --enable-network --shell -- dnf repoquery -q -C --whatprovides 'libedit-devel'
10-02 16:15 root         DEBUG    Running: mock -r /var/lib/copr-rpmbuild/results/configs/child.cfg --no-cleanup-after --no-clean --plugin-option=tmpfs:keep_mounted=True -qn --enable-network --shell -- dnf repoquery -q -C --whatprovides 'util-linux'
10-02 16:15 root         DEBUG    Running: mock -r /var/lib/copr-rpmbuild/results/configs/child.cfg --no-cleanup-after --no-clean --plugin-option=tmpfs:keep_mounted=True -qn --enable-network --shell -- dnf repoquery -q -C --whatprovides 'libgtk-3.so.0()(64bit)'
10-02 16:15 root         DEBUG    Running: mock -r /var/lib/copr-rpmbuild/results/configs/child.cfg --no-cleanup-after --no-clean --plugin-option=tmpfs:keep_mounted=True -qn --enable-network --shell -- dnf repoquery -q -C --whatprovides 'libc.so.6(GLIBC_2.17)(64bit)'
10-02 16:15 root         DEBUG    Running: mock -r /var/lib/copr-rpmbuild/results/configs/child.cfg --no-cleanup-after --no-clean --plugin-option=tmpfs:keep_mounted=True -qn --enable-network --shell -- dnf repoquery -q -C --whatprovides 'xauth'
10-02 16:15 root         DEBUG    Running: mock -r /var/lib/copr-rpmbuild/results/configs/child.cfg --no-cleanup-after --no-clean --plugin-option=tmpfs:keep_mounted=True -qn --enable-network --shell -- dnf repoquery -q -C --whatprovides 'libc.so.6()(64bit)'
10-02 16:15 root         DEBUG    Running: mock -r /var/lib/copr-rpmbuild/results/configs/child.cfg --no-cleanup-after --no-clean --plugin-option=tmpfs:keep_mounted=True -qn --enable-network --shell -- dnf repoquery -q -C --whatprovides 'libgssapi_krb5.so.2()(64bit)'
10-02 16:15 root         DEBUG    Running: mock -r /var/lib/copr-rpmbuild/results/configs/child.cfg --no-cleanup-after --no-clean --plugin-option=tmpfs:keep_mounted=True -qn --enable-network --shell -- dnf repoquery -q -C --whatprovides 'libpam.so.0(LIBPAM_1.0)(64bit)'
10-02 16:16 root         DEBUG    Running: mock -r /var/lib/copr-rpmbuild/results/configs/child.cfg --no-cleanup-after --no-clean --plugin-option=tmpfs:keep_mounted=True -qn --enable-network --shell -- dnf repoquery -q -C --whatprovides 'libselinux'
10-02 16:16 root         DEBUG    Running: mock -r /var/lib/copr-rpmbuild/results/configs/child.cfg --no-cleanup-after --no-clean --plugin-option=tmpfs:keep_mounted=True -qn --enable-network --shell -- dnf repoquery -q -C --whatprovides '/bin/sh'
10-02 16:16 root         DEBUG    Running: mock -r /var/lib/copr-rpmbuild/results/configs/child.cfg --no-cleanup-after --no-clean --plugin-option=tmpfs:keep_mounted=True -qn --enable-network --shell -- dnf repoquery -q -C --whatprovides 'libc.so.6(GLIBC_2.2.3)(64bit)'
10-02 16:16 root         DEBUG    Running: mock -r /var/lib/copr-rpmbuild/results/configs/child.cfg --no-cleanup-after --no-clean --plugin-option=tmpfs:keep_mounted=True -qn --enable-network --shell -- dnf repoquery -q -C --whatprovides 'perl-interpreter'
10-02 16:16 root         DEBUG    Running: mock -r /var/lib/copr-rpmbuild/results/configs/child.cfg --no-cleanup-after --no-clean --plugin-option=tmpfs:keep_mounted=True -qn --enable-network --shell -- dnf repoquery -q -C --whatprovides 'audit-libs'
10-02 16:16 root         DEBUG    Running: mock -r /var/lib/copr-rpmbuild/results/configs/child.cfg --no-cleanup-after --no-clean --plugin-option=tmpfs:keep_mounted=True -qn --enable-network --shell -- dnf repoquery -q -C --whatprovides 'audit-libs-devel'
10-02 16:16 root         DEBUG    Running: mock -r /var/lib/copr-rpmbuild/results/configs/child.cfg --no-cleanup-after --no-clean --plugin-option=tmpfs:keep_mounted=True -qn --enable-network --shell -- dnf repoquery -q -C --whatprovides 'libgdk-3.so.0()(64bit)'
10-02 16:16 root         DEBUG    Running: mock -r /var/lib/copr-rpmbuild/results/configs/child.cfg --no-cleanup-after --no-clean --plugin-option=tmpfs:keep_mounted=True -qn --enable-network --shell -- dnf repoquery -q -C --provides 'pam'
10-02 16:16 root         DEBUG    Running: mock -r /var/lib/copr-rpmbuild/results/configs/child.cfg --no-cleanup-after --no-clean --plugin-option=tmpfs:keep_mounted=True -qn --enable-network --shell -- dnf repoquery -q -C --provides 'pam-libs'
10-02 16:16 root         DEBUG    Running: mock -r /var/lib/copr-rpmbuild/results/configs/child.cfg --no-cleanup-after --no-clean --plugin-option=tmpfs:keep_mounted=True -qn --enable-network --shell -- dnf repoquery -q -C --provides 'crypto-policies'
10-02 16:16 root         DEBUG    Running: mock -r /var/lib/copr-rpmbuild/results/configs/child.cfg --no-cleanup-after --no-clean --plugin-option=tmpfs:keep_mounted=True -qn --enable-network --shell -- dnf repoquery -q -C --provides 'gtk3-devel'
10-02 16:16 root         DEBUG    Running: mock -r /var/lib/copr-rpmbuild/results/configs/child.cfg --no-cleanup-after --no-clean --plugin-option=tmpfs:keep_mounted=True -qn --enable-network --shell -- dnf repoquery -q -C --provides 'bash'
10-02 16:16 root         DEBUG    Running: mock -r /var/lib/copr-rpmbuild/results/configs/child.cfg --no-cleanup-after --no-clean --plugin-option=tmpfs:keep_mounted=True -qn --enable-network --shell -- dnf repoquery -q -C --provides 'groff'
10-02 16:16 root         DEBUG    Running: mock -r /var/lib/copr-rpmbuild/results/configs/child.cfg --no-cleanup-after --no-clean --plugin-option=tmpfs:keep_mounted=True -qn --enable-network --shell -- dnf repoquery -q -C --provides 'gnupg2'
10-02 16:16 root         DEBUG    Running: mock -r /var/lib/copr-rpmbuild/results/configs/child.cfg --no-cleanup-after --no-clean --plugin-option=tmpfs:keep_mounted=True -qn --enable-network --shell -- dnf repoquery -q -C --provides 'libedit-devel'
10-02 16:16 root         DEBUG    Running: mock -r /var/lib/copr-rpmbuild/results/configs/child.cfg --no-cleanup-after --no-clean --plugin-option=tmpfs:keep_mounted=True -qn --enable-network --shell -- dnf repoquery -q -C --provides 'util-linux'
10-02 16:16 root         DEBUG    Running: mock -r /var/lib/copr-rpmbuild/results/configs/child.cfg --no-cleanup-after --no-clean --plugin-option=tmpfs:keep_mounted=True -qn --enable-network --shell -- dnf repoquery -q -C --provides 'automake'
10-02 16:16 root         DEBUG    Running: mock -r /var/lib/copr-rpmbuild/results/configs/child.cfg --no-cleanup-after --no-clean --plugin-option=tmpfs:keep_mounted=True -qn --enable-network --shell -- dnf repoquery -q -C --provides 'systemd-libs'
10-02 16:17 root         DEBUG    Running: mock -r /var/lib/copr-rpmbuild/results/configs/child.cfg --no-cleanup-after --no-clean --plugin-option=tmpfs:keep_mounted=True -qn --enable-network --shell -- dnf repoquery -q -C --provides 'glibc'
10-02 16:17 root         DEBUG    Running: mock -r /var/lib/copr-rpmbuild/results/configs/child.cfg --no-cleanup-after --no-clean --plugin-option=tmpfs:keep_mounted=True -qn --enable-network --shell -- dnf repoquery -q -C --provides 'systemd-rpm-macros'
10-02 16:17 root         DEBUG    Running: mock -r /var/lib/copr-rpmbuild/results/configs/child.cfg --no-cleanup-after --no-clean --plugin-option=tmpfs:keep_mounted=True -qn --enable-network --shell -- dnf repoquery -q -C --provides 'perl-podlators'
10-02 16:17 root         DEBUG    Running: mock -r /var/lib/copr-rpmbuild/results/configs/child.cfg --no-cleanup-after --no-clean --plugin-option=tmpfs:keep_mounted=True -qn --enable-network --shell -- dnf repoquery -q -C --provides 'xorg-x11-xauth'
10-02 16:17 root         DEBUG    Running: mock -r /var/lib/copr-rpmbuild/results/configs/child.cfg --no-cleanup-after --no-clean --plugin-option=tmpfs:keep_mounted=True -qn --enable-network --shell -- dnf repoquery -q -C --provides 'libedit'
10-02 16:17 root         DEBUG    Running: mock -r /var/lib/copr-rpmbuild/results/configs/child.cfg --no-cleanup-after --no-clean --plugin-option=tmpfs:keep_mounted=True -qn --enable-network --shell -- dnf repoquery -q -C --provides 'shadow-utils'
10-02 16:17 root         DEBUG    Running: mock -r /var/lib/copr-rpmbuild/results/configs/child.cfg --no-cleanup-after --no-clean --plugin-option=tmpfs:keep_mounted=True -qn --enable-network --shell -- dnf repoquery -q -C --provides 'libcom_err'
10-02 16:17 root         DEBUG    Running: mock -r /var/lib/copr-rpmbuild/results/configs/child.cfg --no-cleanup-after --no-clean --plugin-option=tmpfs:keep_mounted=True -qn --enable-network --shell -- dnf repoquery -q -C --provides 'pam-devel'
10-02 16:17 root         DEBUG    Running: mock -r /var/lib/copr-rpmbuild/results/configs/child.cfg --no-cleanup-after --no-clean --plugin-option=tmpfs:keep_mounted=True -qn --enable-network --shell -- dnf repoquery -q -C --provides 'libselinux'
10-02 16:17 root         DEBUG    Running: mock -r /var/lib/copr-rpmbuild/results/configs/child.cfg --no-cleanup-after --no-clean --plugin-option=tmpfs:keep_mounted=True -qn --enable-network --shell -- dnf repoquery -q -C --provides 'systemd-devel'
10-02 16:17 root         DEBUG    Running: mock -r /var/lib/copr-rpmbuild/results/configs/child.cfg --no-cleanup-after --no-clean --plugin-option=tmpfs:keep_mounted=True -qn --enable-network --shell -- dnf repoquery -q -C --provides 'libX11-devel'
10-02 16:17 root         DEBUG    Running: mock -r /var/lib/copr-rpmbuild/results/configs/child.cfg --no-cleanup-after --no-clean --plugin-option=tmpfs:keep_mounted=True -qn --enable-network --shell -- dnf repoquery -q -C --provides 'ncurses-devel'
10-02 16:17 root         DEBUG    Running: mock -r /var/lib/copr-rpmbuild/results/configs/child.cfg --no-cleanup-after --no-clean --plugin-option=tmpfs:keep_mounted=True -qn --enable-network --shell -- dnf repoquery -q -C --provides 'openssl-devel'
10-02 16:17 root         DEBUG    Running: mock -r /var/lib/copr-rpmbuild/results/configs/child.cfg --no-cleanup-after --no-clean --plugin-option=tmpfs:keep_mounted=True -qn --enable-network --shell -- dnf repoquery -q -C --provides 'krb5-devel'
10-02 16:17 root         DEBUG    Running: mock -r /var/lib/copr-rpmbuild/results/configs/child.cfg --no-cleanup-after --no-clean --plugin-option=tmpfs:keep_mounted=True -qn --enable-network --shell -- dnf repoquery -q -C --provides 'libgcc'
10-02 16:17 root         DEBUG    Running: mock -r /var/lib/copr-rpmbuild/results/configs/child.cfg --no-cleanup-after --no-clean --plugin-option=tmpfs:keep_mounted=True -qn --enable-network --shell -- dnf repoquery -q -C --provides 'gtk3'
10-02 16:17 root         DEBUG    Running: mock -r /var/lib/copr-rpmbuild/results/configs/child.cfg --no-cleanup-after --no-clean --plugin-option=tmpfs:keep_mounted=True -qn --enable-network --shell -- dnf repoquery -q -C --provides 'perl-interpreter'
10-02 16:18 root         DEBUG    Running: mock -r /var/lib/copr-rpmbuild/results/configs/child.cfg --no-cleanup-after --no-clean --plugin-option=tmpfs:keep_mounted=True -qn --enable-network --shell -- dnf repoquery -q -C --provides 'audit-libs'
10-02 16:18 root         DEBUG    Running: mock -r /var/lib/copr-rpmbuild/results/configs/child.cfg --no-cleanup-after --no-clean --plugin-option=tmpfs:keep_mounted=True -qn --enable-network --shell -- dnf repoquery -q -C --provides 'make'
10-02 16:18 root         DEBUG    Running: mock -r /var/lib/copr-rpmbuild/results/configs/child.cfg --no-cleanup-after --no-clean --plugin-option=tmpfs:keep_mounted=True -qn --enable-network --shell -- dnf repoquery -q -C --provides 'perl-generators'
10-02 16:18 root         DEBUG    Running: mock -r /var/lib/copr-rpmbuild/results/configs/child.cfg --no-cleanup-after --no-clean --plugin-option=tmpfs:keep_mounted=True -qn --enable-network --shell -- dnf repoquery -q -C --provides 'autoconf'
10-02 16:18 root         DEBUG    Running: mock -r /var/lib/copr-rpmbuild/results/configs/child.cfg --no-cleanup-after --no-clean --plugin-option=tmpfs:keep_mounted=True -qn --enable-network --shell -- dnf repoquery -q -C --provides 'gcc'
10-02 16:18 root         DEBUG    Running: mock -r /var/lib/copr-rpmbuild/results/configs/child.cfg --no-cleanup-after --no-clean --plugin-option=tmpfs:keep_mounted=True -qn --enable-network --shell -- dnf repoquery -q -C --provides 'zlib-ng-compat-devel'
10-02 16:18 root         DEBUG    Running: mock -r /var/lib/copr-rpmbuild/results/configs/child.cfg --no-cleanup-after --no-clean --plugin-option=tmpfs:keep_mounted=True -qn --enable-network --shell -- dnf repoquery -q -C --provides 'p11-kit-devel'
10-02 16:18 root         DEBUG    Running: mock -r /var/lib/copr-rpmbuild/results/configs/child.cfg --no-cleanup-after --no-clean --plugin-option=tmpfs:keep_mounted=True -qn --enable-network --shell -- dnf repoquery -q -C --provides 'libselinux-devel'
10-02 16:18 root         DEBUG    Running: mock -r /var/lib/copr-rpmbuild/results/configs/child.cfg --no-cleanup-after --no-clean --plugin-option=tmpfs:keep_mounted=True -qn --enable-network --shell -- dnf repoquery -q -C --provides 'glib2'
10-02 16:18 root         DEBUG    Running: mock -r /var/lib/copr-rpmbuild/results/configs/child.cfg --no-cleanup-after --no-clean --plugin-option=tmpfs:keep_mounted=True -qn --enable-network --shell -- dnf repoquery -q -C --provides 'krb5-libs'
10-02 16:18 root         DEBUG    Running: mock -r /var/lib/copr-rpmbuild/results/configs/child.cfg --no-cleanup-after --no-clean --plugin-option=tmpfs:keep_mounted=True -qn --enable-network --shell -- dnf repoquery -q -C --provides 'libxcrypt'
10-02 16:18 root         DEBUG    Running: mock -r /var/lib/copr-rpmbuild/results/configs/child.cfg --no-cleanup-after --no-clean --plugin-option=tmpfs:keep_mounted=True -qn --enable-network --shell -- dnf repoquery -q -C --provides 'audit-libs-devel'
10-02 16:18 root         DEBUG    Running: mock -r /var/lib/copr-rpmbuild/results/configs/child.cfg --no-cleanup-after --no-clean --plugin-option=tmpfs:keep_mounted=True -qn --enable-network --shell -- dnf repoquery -q -C --provides 'openssl-libs'
10-02 16:18 root         DEBUG    Running: mock -r /var/lib/copr-rpmbuild/results/configs/child.cfg --no-cleanup-after --no-clean --plugin-option=tmpfs:keep_mounted=True -qn --enable-network --shell -- dnf repoquery -q -C --provides 'zlib-ng-compat'
10-02 16:18 root         DEBUG    Running: mock -r /var/lib/copr-rpmbuild/results/configs/child.cfg --no-cleanup-after --no-clean --plugin-option=tmpfs:keep_mounted=True -qn --enable-network --shell -- dnf repoquery -q -C --provides 'systemd'
10-02 16:18 root         DEBUG        CheckIfDepsDeprecated completed: 404.850 seconds
10-02 16:18 root         DEBUG    Running check: CheckLicensInDoc
10-02 16:18 root         DEBUG        CheckLicensInDoc completed: 0.149 seconds
10-02 16:18 root         DEBUG    Running check: CheckLicenseField
10-02 16:18 root         DEBUG    Scanning sources in /var/lib/mock/fedora-40-s390x/root/builddir/build/BUILD/hpnssh-9.9p1_hpn18.6.0
10-02 16:20 root         DEBUG    Got license reply, length: 285224
10-02 16:20 root         DEBUG        CheckLicenseField completed: 71.380 seconds
10-02 16:20 root         DEBUG    Running check: CheckLicenseFieldSPDX
10-02 16:20 root         DEBUG    Run command: ['license-validate', '-v', 'BSD-3-Clause AND BSD-2-Clause AND ISC AND SSH-OpenSSH AND ssh-keyscan AND sprintf AND LicenseRef-Fedora-Public-Domain AND X11-distribute-modifications-variant']
10-02 16:20 root         DEBUG        CheckLicenseFieldSPDX completed: 0.320 seconds
10-02 16:20 root         DEBUG    Running check: CheckLicenseInSubpackages
10-02 16:20 root         DEBUG        CheckLicenseInSubpackages completed: 0.000 seconds
10-02 16:20 root         DEBUG    Running check: CheckLocale
10-02 16:20 root         DEBUG        CheckLocale completed: 0.001 seconds
10-02 16:20 root         DEBUG    Running check: CheckMacros
10-02 16:20 root         DEBUG        CheckMacros completed: 0.000 seconds
10-02 16:20 root         DEBUG    Running check: CheckMakeinstall
10-02 16:20 root         DEBUG        CheckMakeinstall completed: 0.000 seconds
10-02 16:20 root         DEBUG    Running check: CheckMultipleLicenses
10-02 16:20 root         DEBUG        CheckMultipleLicenses completed: 0.000 seconds
10-02 16:20 root         DEBUG    Running check: CheckNameCharset
10-02 16:20 root         DEBUG        CheckNameCharset completed: 0.000 seconds
10-02 16:20 root         DEBUG    Running check: CheckNaming
10-02 16:20 root         DEBUG        CheckNaming completed: 0.000 seconds
10-02 16:20 root         DEBUG    Running check: CheckNoConfigInUsr
10-02 16:20 root         DEBUG        CheckNoConfigInUsr completed: 0.000 seconds
10-02 16:20 root         DEBUG    Running check: CheckNoConflicts
10-02 16:20 root         DEBUG        CheckNoConflicts completed: 0.000 seconds
10-02 16:20 root         DEBUG    Running check: CheckNoNameConflict
10-02 16:20 root         DEBUG        CheckNoNameConflict completed: 0.469 seconds
10-02 16:20 root         DEBUG    Running check: CheckObeysFHS
10-02 16:20 root         DEBUG        CheckObeysFHS completed: 0.001 seconds
10-02 16:20 root         DEBUG    Running check: CheckObsoletesForRename
10-02 16:20 root         DEBUG        CheckObsoletesForRename completed: 0.000 seconds
10-02 16:20 root         DEBUG    Running check: CheckOwnDirs
10-02 16:20 root         DEBUG    Running: mock -r /var/lib/copr-rpmbuild/results/configs/child.cfg --no-cleanup-after --no-clean --plugin-option=tmpfs:keep_mounted=True -qn --enable-network --shell -- dnf repoquery -q -C --whatprovides 'libcrypto.so.3()(64bit)'
10-02 16:20 root         DEBUG    Running: mock -r /var/lib/copr-rpmbuild/results/configs/child.cfg --no-cleanup-after --no-clean --plugin-option=tmpfs:keep_mounted=True -qn --enable-network --shell -- dnf repoquery -q -C --whatprovides 'libc.so.6(GLIBC_2.2)(64bit)'
10-02 16:20 root         DEBUG    Running: mock -r /var/lib/copr-rpmbuild/results/configs/child.cfg --no-cleanup-after --no-clean --plugin-option=tmpfs:keep_mounted=True -qn --enable-network --shell -- dnf repoquery -q -C --whatprovides 'libc.so.6(GLIBC_2.25)(64bit)'
10-02 16:20 root         DEBUG    Running: mock -r /var/lib/copr-rpmbuild/results/configs/child.cfg --no-cleanup-after --no-clean --plugin-option=tmpfs:keep_mounted=True -qn --enable-network --shell -- dnf repoquery -q -C --whatprovides 'libz.so.1()(64bit)'
10-02 16:20 root         DEBUG    Running: mock -r /var/lib/copr-rpmbuild/results/configs/child.cfg --no-cleanup-after --no-clean --plugin-option=tmpfs:keep_mounted=True -qn --enable-network --shell -- dnf repoquery -q -C --whatprovides 'libselinux.so.1()(64bit)'
10-02 16:20 root         DEBUG    Running: mock -r /var/lib/copr-rpmbuild/results/configs/child.cfg --no-cleanup-after --no-clean --plugin-option=tmpfs:keep_mounted=True -qn --enable-network --shell -- dnf repoquery -q -C --whatprovides 'libc.so.6(GLIBC_2.8)(64bit)'
10-02 16:20 root         DEBUG    Running: mock -r /var/lib/copr-rpmbuild/results/configs/child.cfg --no-cleanup-after --no-clean --plugin-option=tmpfs:keep_mounted=True -qn --enable-network --shell -- dnf repoquery -q -C --whatprovides 'libgcc_s.so.1(GCC_3.3.1)(64bit)'
10-02 16:20 root         DEBUG    Running: mock -r /var/lib/copr-rpmbuild/results/configs/child.cfg --no-cleanup-after --no-clean --plugin-option=tmpfs:keep_mounted=True -qn --enable-network --shell -- dnf repoquery -q -C --whatprovides 'libc.so.6(GLIBC_2.33)(64bit)'
10-02 16:20 root         DEBUG    Running: mock -r /var/lib/copr-rpmbuild/results/configs/child.cfg --no-cleanup-after --no-clean --plugin-option=tmpfs:keep_mounted=True -qn --enable-network --shell -- dnf repoquery -q -C --whatprovides 'libcrypto.so.3(OPENSSL_3.0.0)(64bit)'
10-02 16:20 root         DEBUG    Running: mock -r /var/lib/copr-rpmbuild/results/configs/child.cfg --no-cleanup-after --no-clean --plugin-option=tmpfs:keep_mounted=True -qn --enable-network --shell -- dnf repoquery -q -C --whatprovides 'libc.so.6(GLIBC_2.17)(64bit)'
10-02 16:20 root         DEBUG    Running: mock -r /var/lib/copr-rpmbuild/results/configs/child.cfg --no-cleanup-after --no-clean --plugin-option=tmpfs:keep_mounted=True -qn --enable-network --shell -- dnf repoquery -q -C --whatprovides 'libgcc_s.so.1()(64bit)'
10-02 16:20 root         DEBUG    Running: mock -r /var/lib/copr-rpmbuild/results/configs/child.cfg --no-cleanup-after --no-clean --plugin-option=tmpfs:keep_mounted=True -qn --enable-network --shell -- dnf repoquery -q -C --whatprovides 'config(hpnssh)'
10-02 16:20 root         DEBUG    Running: mock -r /var/lib/copr-rpmbuild/results/configs/child.cfg --no-cleanup-after --no-clean --plugin-option=tmpfs:keep_mounted=True -qn --enable-network --shell -- dnf repoquery -q -C --whatprovides 'libc.so.6()(64bit)'
10-02 16:20 root         DEBUG    Running: mock -r /var/lib/copr-rpmbuild/results/configs/child.cfg --no-cleanup-after --no-clean --plugin-option=tmpfs:keep_mounted=True -qn --enable-network --shell -- dnf repoquery -q -C --whatprovides 'libc.so.6(GLIBC_2.36)(64bit)'
10-02 16:21 root         DEBUG    Running: mock -r /var/lib/copr-rpmbuild/results/configs/child.cfg --no-cleanup-after --no-clean --plugin-option=tmpfs:keep_mounted=True -qn --enable-network --shell -- dnf repoquery -q -C --whatprovides 'libc.so.6(GLIBC_2.3.4)(64bit)'
10-02 16:21 root         DEBUG    Running: mock -r /var/lib/copr-rpmbuild/results/configs/child.cfg --no-cleanup-after --no-clean --plugin-option=tmpfs:keep_mounted=True -qn --enable-network --shell -- dnf repoquery -q -C --whatprovides 'rtld(GNU_HASH)'
10-02 16:21 root         DEBUG    Running: mock -r /var/lib/copr-rpmbuild/results/configs/child.cfg --no-cleanup-after --no-clean --plugin-option=tmpfs:keep_mounted=True -qn --enable-network --shell -- dnf repoquery -q -C --whatprovides 'libc.so.6(GLIBC_2.3)(64bit)'
10-02 16:21 root         DEBUG    Running: mock -r /var/lib/copr-rpmbuild/results/configs/child.cfg --no-cleanup-after --no-clean --plugin-option=tmpfs:keep_mounted=True -qn --enable-network --shell -- dnf repoquery -q -C --whatprovides 'libselinux'
10-02 16:21 root         DEBUG    Running: mock -r /var/lib/copr-rpmbuild/results/configs/child.cfg --no-cleanup-after --no-clean --plugin-option=tmpfs:keep_mounted=True -qn --enable-network --shell -- dnf repoquery -q -C --whatprovides 'libselinux.so.1(LIBSELINUX_1.0)(64bit)'
10-02 16:21 root         DEBUG    Running: mock -r /var/lib/copr-rpmbuild/results/configs/child.cfg --no-cleanup-after --no-clean --plugin-option=tmpfs:keep_mounted=True -qn --enable-network --shell -- dnf repoquery -q -C --whatprovides '/usr/sbin/nologin'
10-02 16:21 root         DEBUG    Running: mock -r /var/lib/copr-rpmbuild/results/configs/child.cfg --no-cleanup-after --no-clean --plugin-option=tmpfs:keep_mounted=True -qn --enable-network --shell -- dnf repoquery -q -C --whatprovides '/bin/sh'
10-02 16:21 root         DEBUG    Running: mock -r /var/lib/copr-rpmbuild/results/configs/child.cfg --no-cleanup-after --no-clean --plugin-option=tmpfs:keep_mounted=True -qn --enable-network --shell -- dnf repoquery -q -C --whatprovides 'libgcc_s.so.1(GCC_3.0)(64bit)'
10-02 16:21 root         DEBUG    Running: mock -r /var/lib/copr-rpmbuild/results/configs/child.cfg --no-cleanup-after --no-clean --plugin-option=tmpfs:keep_mounted=True -qn --enable-network --shell -- dnf repoquery -q -C --whatprovides 'libc.so.6(GLIBC_2.34)(64bit)'
10-02 16:21 root         DEBUG    Running: mock -r /var/lib/copr-rpmbuild/results/configs/child.cfg --no-cleanup-after --no-clean --plugin-option=tmpfs:keep_mounted=True -qn --enable-network --shell -- dnf repoquery -q -C --whatprovides 'audit-libs'
10-02 16:21 root         DEBUG    Running: mock -r /var/lib/copr-rpmbuild/results/configs/child.cfg --no-cleanup-after --no-clean --plugin-option=tmpfs:keep_mounted=True -qn --enable-network --shell -- dnf repoquery -q -C --whatprovides 'libc.so.6(GLIBC_2.38)(64bit)'
10-02 16:21 root         DEBUG    Running: mock -r /var/lib/copr-rpmbuild/results/configs/child.cfg --no-cleanup-after --no-clean --plugin-option=tmpfs:keep_mounted=True -qn --enable-network --shell -- dnf repoquery -q -C --whatprovides 'libc.so.6(GLIBC_2.3.2)(64bit)'
10-02 16:21 root         DEBUG    Running: mock -r /var/lib/copr-rpmbuild/results/configs/child.cfg --no-cleanup-after --no-clean --plugin-option=tmpfs:keep_mounted=True -qn --enable-network --shell -- dnf repoquery -q -C --whatprovides 'libc.so.6(GLIBC_2.26)(64bit)'
10-02 16:21 root         DEBUG    Running: mock -r /var/lib/copr-rpmbuild/results/configs/child.cfg --no-cleanup-after --no-clean --plugin-option=tmpfs:keep_mounted=True -qn --enable-network --shell -- dnf repoquery -q -C --whatprovides 'libc.so.6(GLIBC_2.4)(64bit)'
10-02 16:21 root         DEBUG    Running: mock -r /var/lib/copr-rpmbuild/results/configs/child.cfg --no-cleanup-after --no-clean --plugin-option=tmpfs:keep_mounted=True -qn --enable-network --shell -- dnf repoquery -q -C --requires --providers-of=requires 'hpnssh' 'libselinux' 'glibc' 'audit-libs' 'bash' 'libgcc' 'openssl-libs' 'zlib-ng-compat' 'util-linux'
10-02 16:21 root         DEBUG    Running: mock -r /var/lib/copr-rpmbuild/results/configs/child.cfg --no-cleanup-after --no-clean --plugin-option=tmpfs:keep_mounted=True -qn --enable-network --shell -- dnf repoquery -C -l 'hpnssh' 'libselinux' 'filesystem' 'glibc' 'bash' 'libgcc' 'openssl-libs' 'audit-libs' 'zlib-ng-compat' 'util-linux'
10-02 16:21 root         DEBUG    Running: mock -r /var/lib/copr-rpmbuild/results/configs/child.cfg --no-cleanup-after --no-clean --plugin-option=tmpfs:keep_mounted=True -qn --enable-network --shell -- dnf repoquery -q -C --whatprovides 'libcrypto.so.3()(64bit)'
10-02 16:22 root         DEBUG    Running: mock -r /var/lib/copr-rpmbuild/results/configs/child.cfg --no-cleanup-after --no-clean --plugin-option=tmpfs:keep_mounted=True -qn --enable-network --shell -- dnf repoquery -q -C --whatprovides 'crypto-policies'
10-02 16:22 root         DEBUG    Running: mock -r /var/lib/copr-rpmbuild/results/configs/child.cfg --no-cleanup-after --no-clean --plugin-option=tmpfs:keep_mounted=True -qn --enable-network --shell -- dnf repoquery -q -C --whatprovides 'libc.so.6(GLIBC_2.2)(64bit)'
10-02 16:22 root         DEBUG    Running: mock -r /var/lib/copr-rpmbuild/results/configs/child.cfg --no-cleanup-after --no-clean --plugin-option=tmpfs:keep_mounted=True -qn --enable-network --shell -- dnf repoquery -q -C --whatprovides 'libc.so.6(GLIBC_2.25)(64bit)'
10-02 16:22 root         DEBUG    Running: mock -r /var/lib/copr-rpmbuild/results/configs/child.cfg --no-cleanup-after --no-clean --plugin-option=tmpfs:keep_mounted=True -qn --enable-network --shell -- dnf repoquery -q -C --whatprovides 'libz.so.1()(64bit)'
10-02 16:22 root         DEBUG    Running: mock -r /var/lib/copr-rpmbuild/results/configs/child.cfg --no-cleanup-after --no-clean --plugin-option=tmpfs:keep_mounted=True -qn --enable-network --shell -- dnf repoquery -q -C --whatprovides 'libselinux.so.1()(64bit)'
10-02 16:22 root         DEBUG    Running: mock -r /var/lib/copr-rpmbuild/results/configs/child.cfg --no-cleanup-after --no-clean --plugin-option=tmpfs:keep_mounted=True -qn --enable-network --shell -- dnf repoquery -q -C --whatprovides 'libc.so.6(GLIBC_2.8)(64bit)'
10-02 16:22 root         DEBUG    Running: mock -r /var/lib/copr-rpmbuild/results/configs/child.cfg --no-cleanup-after --no-clean --plugin-option=tmpfs:keep_mounted=True -qn --enable-network --shell -- dnf repoquery -q -C --whatprovides 'libedit.so.0()(64bit)'
10-02 16:22 root         DEBUG    Running: mock -r /var/lib/copr-rpmbuild/results/configs/child.cfg --no-cleanup-after --no-clean --plugin-option=tmpfs:keep_mounted=True -qn --enable-network --shell -- dnf repoquery -q -C --whatprovides 'libc.so.6(GLIBC_2.33)(64bit)'
10-02 16:22 root         DEBUG    Running: mock -r /var/lib/copr-rpmbuild/results/configs/child.cfg --no-cleanup-after --no-clean --plugin-option=tmpfs:keep_mounted=True -qn --enable-network --shell -- dnf repoquery -q -C --whatprovides 'libgcc_s.so.1(GCC_3.3.1)(64bit)'
10-02 16:22 root         DEBUG    Running: mock -r /var/lib/copr-rpmbuild/results/configs/child.cfg --no-cleanup-after --no-clean --plugin-option=tmpfs:keep_mounted=True -qn --enable-network --shell -- dnf repoquery -q -C --whatprovides 'libcrypto.so.3(OPENSSL_3.0.0)(64bit)'
10-02 16:22 root         DEBUG    Running: mock -r /var/lib/copr-rpmbuild/results/configs/child.cfg --no-cleanup-after --no-clean --plugin-option=tmpfs:keep_mounted=True -qn --enable-network --shell -- dnf repoquery -q -C --whatprovides 'libc.so.6(GLIBC_2.17)(64bit)'
10-02 16:22 root         DEBUG    Running: mock -r /var/lib/copr-rpmbuild/results/configs/child.cfg --no-cleanup-after --no-clean --plugin-option=tmpfs:keep_mounted=True -qn --enable-network --shell -- dnf repoquery -q -C --whatprovides 'libgcc_s.so.1()(64bit)'
10-02 16:22 root         DEBUG    Running: mock -r /var/lib/copr-rpmbuild/results/configs/child.cfg --no-cleanup-after --no-clean --plugin-option=tmpfs:keep_mounted=True -qn --enable-network --shell -- dnf repoquery -q -C --whatprovides 'config(hpnssh)'
10-02 16:22 root         DEBUG    Running: mock -r /var/lib/copr-rpmbuild/results/configs/child.cfg --no-cleanup-after --no-clean --plugin-option=tmpfs:keep_mounted=True -qn --enable-network --shell -- dnf repoquery -q -C --whatprovides 'libc.so.6()(64bit)'
10-02 16:22 root         DEBUG    Running: mock -r /var/lib/copr-rpmbuild/results/configs/child.cfg --no-cleanup-after --no-clean --plugin-option=tmpfs:keep_mounted=True -qn --enable-network --shell -- dnf repoquery -q -C --whatprovides 'libgssapi_krb5.so.2()(64bit)'
10-02 16:22 root         DEBUG    Running: mock -r /var/lib/copr-rpmbuild/results/configs/child.cfg --no-cleanup-after --no-clean --plugin-option=tmpfs:keep_mounted=True -qn --enable-network --shell -- dnf repoquery -q -C --whatprovides 'libc.so.6(GLIBC_2.36)(64bit)'
10-02 16:23 root         DEBUG    Running: mock -r /var/lib/copr-rpmbuild/results/configs/child.cfg --no-cleanup-after --no-clean --plugin-option=tmpfs:keep_mounted=True -qn --enable-network --shell -- dnf repoquery -q -C --whatprovides 'libc.so.6(GLIBC_2.3.4)(64bit)'
10-02 16:23 root         DEBUG    Running: mock -r /var/lib/copr-rpmbuild/results/configs/child.cfg --no-cleanup-after --no-clean --plugin-option=tmpfs:keep_mounted=True -qn --enable-network --shell -- dnf repoquery -q -C --whatprovides 'rtld(GNU_HASH)'
10-02 16:23 root         DEBUG    Running: mock -r /var/lib/copr-rpmbuild/results/configs/child.cfg --no-cleanup-after --no-clean --plugin-option=tmpfs:keep_mounted=True -qn --enable-network --shell -- dnf repoquery -q -C --whatprovides 'libc.so.6(GLIBC_2.3)(64bit)'
10-02 16:23 root         DEBUG    Running: mock -r /var/lib/copr-rpmbuild/results/configs/child.cfg --no-cleanup-after --no-clean --plugin-option=tmpfs:keep_mounted=True -qn --enable-network --shell -- dnf repoquery -q -C --whatprovides 'libselinux'
10-02 16:23 root         DEBUG    Running: mock -r /var/lib/copr-rpmbuild/results/configs/child.cfg --no-cleanup-after --no-clean --plugin-option=tmpfs:keep_mounted=True -qn --enable-network --shell -- dnf repoquery -q -C --whatprovides '/usr/bin/sh'
10-02 16:23 root         DEBUG    Running: mock -r /var/lib/copr-rpmbuild/results/configs/child.cfg --no-cleanup-after --no-clean --plugin-option=tmpfs:keep_mounted=True -qn --enable-network --shell -- dnf repoquery -q -C --whatprovides 'libselinux.so.1(LIBSELINUX_1.0)(64bit)'
10-02 16:23 root         DEBUG    Running: mock -r /var/lib/copr-rpmbuild/results/configs/child.cfg --no-cleanup-after --no-clean --plugin-option=tmpfs:keep_mounted=True -qn --enable-network --shell -- dnf repoquery -q -C --whatprovides 'hpnssh(s390-64)'
10-02 16:23 root         DEBUG    Running: mock -r /var/lib/copr-rpmbuild/results/configs/child.cfg --no-cleanup-after --no-clean --plugin-option=tmpfs:keep_mounted=True -qn --enable-network --shell -- dnf repoquery -q -C --whatprovides '/usr/sbin/nologin'
10-02 16:23 root         DEBUG    Running: mock -r /var/lib/copr-rpmbuild/results/configs/child.cfg --no-cleanup-after --no-clean --plugin-option=tmpfs:keep_mounted=True -qn --enable-network --shell -- dnf repoquery -q -C --whatprovides 'libgssapi_krb5.so.2(gssapi_krb5_2_MIT)(64bit)'
10-02 16:23 root         DEBUG    Running: mock -r /var/lib/copr-rpmbuild/results/configs/child.cfg --no-cleanup-after --no-clean --plugin-option=tmpfs:keep_mounted=True -qn --enable-network --shell -- dnf repoquery -q -C --whatprovides '/bin/sh'
10-02 16:23 root         DEBUG    Running: mock -r /var/lib/copr-rpmbuild/results/configs/child.cfg --no-cleanup-after --no-clean --plugin-option=tmpfs:keep_mounted=True -qn --enable-network --shell -- dnf repoquery -q -C --whatprovides 'libc.so.6(GLIBC_2.2.3)(64bit)'
10-02 16:23 root         DEBUG    Running: mock -r /var/lib/copr-rpmbuild/results/configs/child.cfg --no-cleanup-after --no-clean --plugin-option=tmpfs:keep_mounted=True -qn --enable-network --shell -- dnf repoquery -q -C --whatprovides 'libgcc_s.so.1(GCC_3.0)(64bit)'
10-02 16:23 root         DEBUG    Running: mock -r /var/lib/copr-rpmbuild/results/configs/child.cfg --no-cleanup-after --no-clean --plugin-option=tmpfs:keep_mounted=True -qn --enable-network --shell -- dnf repoquery -q -C --whatprovides 'libc.so.6(GLIBC_2.34)(64bit)'
10-02 16:23 root         DEBUG    Running: mock -r /var/lib/copr-rpmbuild/results/configs/child.cfg --no-cleanup-after --no-clean --plugin-option=tmpfs:keep_mounted=True -qn --enable-network --shell -- dnf repoquery -q -C --whatprovides 'audit-libs'
10-02 16:23 root         DEBUG    Running: mock -r /var/lib/copr-rpmbuild/results/configs/child.cfg --no-cleanup-after --no-clean --plugin-option=tmpfs:keep_mounted=True -qn --enable-network --shell -- dnf repoquery -q -C --whatprovides 'config(hpnssh-clients)'
10-02 16:24 root         DEBUG    Running: mock -r /var/lib/copr-rpmbuild/results/configs/child.cfg --no-cleanup-after --no-clean --plugin-option=tmpfs:keep_mounted=True -qn --enable-network --shell -- dnf repoquery -q -C --whatprovides 'libc.so.6(GLIBC_2.38)(64bit)'
10-02 16:24 root         DEBUG    Running: mock -r /var/lib/copr-rpmbuild/results/configs/child.cfg --no-cleanup-after --no-clean --plugin-option=tmpfs:keep_mounted=True -qn --enable-network --shell -- dnf repoquery -q -C --whatprovides 'libc.so.6(GLIBC_2.3.2)(64bit)'
10-02 16:24 root         DEBUG    Running: mock -r /var/lib/copr-rpmbuild/results/configs/child.cfg --no-cleanup-after --no-clean --plugin-option=tmpfs:keep_mounted=True -qn --enable-network --shell -- dnf repoquery -q -C --whatprovides 'libc.so.6(GLIBC_2.26)(64bit)'
10-02 16:24 root         DEBUG    Running: mock -r /var/lib/copr-rpmbuild/results/configs/child.cfg --no-cleanup-after --no-clean --plugin-option=tmpfs:keep_mounted=True -qn --enable-network --shell -- dnf repoquery -q -C --whatprovides 'libc.so.6(GLIBC_2.4)(64bit)'
10-02 16:24 root         DEBUG    Running: mock -r /var/lib/copr-rpmbuild/results/configs/child.cfg --no-cleanup-after --no-clean --plugin-option=tmpfs:keep_mounted=True -qn --enable-network --shell -- dnf repoquery -q -C --requires --providers-of=requires 'hpnssh' 'libselinux' 'krb5-libs' 'crypto-policies' 'glibc' 'audit-libs' 'hpnssh-clients' 'bash' 'libgcc' 'libedit' 'openssl-libs' 'zlib-ng-compat' 'util-linux'
10-02 16:24 root         DEBUG    Running: mock -r /var/lib/copr-rpmbuild/results/configs/child.cfg --no-cleanup-after --no-clean --plugin-option=tmpfs:keep_mounted=True -qn --enable-network --shell -- dnf repoquery -C -l 'hpnssh' 'libselinux' 'filesystem' 'krb5-libs' 'crypto-policies' 'glibc' 'hpnssh-clients' 'bash' 'libgcc' 'libedit' 'openssl-libs' 'audit-libs' 'zlib-ng-compat' 'util-linux'
10-02 16:24 root         DEBUG    Running: mock -r /var/lib/copr-rpmbuild/results/configs/child.cfg --no-cleanup-after --no-clean --plugin-option=tmpfs:keep_mounted=True -qn --enable-network --shell -- dnf repoquery -q -C --whatprovides 'pam'
10-02 16:24 root         DEBUG    Running: mock -r /var/lib/copr-rpmbuild/results/configs/child.cfg --no-cleanup-after --no-clean --plugin-option=tmpfs:keep_mounted=True -qn --enable-network --shell -- dnf repoquery -q -C --whatprovides 'libpam.so.0()(64bit)'
10-02 16:24 root         DEBUG    Running: mock -r /var/lib/copr-rpmbuild/results/configs/child.cfg --no-cleanup-after --no-clean --plugin-option=tmpfs:keep_mounted=True -qn --enable-network --shell -- dnf repoquery -q -C --whatprovides 'libcrypto.so.3()(64bit)'
10-02 16:24 root         DEBUG    Running: mock -r /var/lib/copr-rpmbuild/results/configs/child.cfg --no-cleanup-after --no-clean --plugin-option=tmpfs:keep_mounted=True -qn --enable-network --shell -- dnf repoquery -q -C --whatprovides 'crypto-policies'
10-02 16:24 root         DEBUG    Running: mock -r /var/lib/copr-rpmbuild/results/configs/child.cfg --no-cleanup-after --no-clean --plugin-option=tmpfs:keep_mounted=True -qn --enable-network --shell -- dnf repoquery -q -C --whatprovides 'libc.so.6(GLIBC_2.2)(64bit)'
10-02 16:24 root         DEBUG    Running: mock -r /var/lib/copr-rpmbuild/results/configs/child.cfg --no-cleanup-after --no-clean --plugin-option=tmpfs:keep_mounted=True -qn --enable-network --shell -- dnf repoquery -q -C --whatprovides 'libc.so.6(GLIBC_2.25)(64bit)'
10-02 16:25 root         DEBUG    Running: mock -r /var/lib/copr-rpmbuild/results/configs/child.cfg --no-cleanup-after --no-clean --plugin-option=tmpfs:keep_mounted=True -qn --enable-network --shell -- dnf repoquery -q -C --whatprovides 'libsystemd.so.0(LIBSYSTEMD_209)(64bit)'
10-02 16:25 root         DEBUG    Running: mock -r /var/lib/copr-rpmbuild/results/configs/child.cfg --no-cleanup-after --no-clean --plugin-option=tmpfs:keep_mounted=True -qn --enable-network --shell -- dnf repoquery -q -C --whatprovides 'libz.so.1()(64bit)'
10-02 16:25 root         DEBUG    Running: mock -r /var/lib/copr-rpmbuild/results/configs/child.cfg --no-cleanup-after --no-clean --plugin-option=tmpfs:keep_mounted=True -qn --enable-network --shell -- dnf repoquery -q -C --whatprovides 'libselinux.so.1()(64bit)'
10-02 16:25 root         DEBUG    Running: mock -r /var/lib/copr-rpmbuild/results/configs/child.cfg --no-cleanup-after --no-clean --plugin-option=tmpfs:keep_mounted=True -qn --enable-network --shell -- dnf repoquery -q -C --whatprovides '/usr/bin/bash'
10-02 16:25 root         DEBUG    Running: mock -r /var/lib/copr-rpmbuild/results/configs/child.cfg --no-cleanup-after --no-clean --plugin-option=tmpfs:keep_mounted=True -qn --enable-network --shell -- dnf repoquery -q -C --whatprovides 'libsystemd.so.0()(64bit)'
10-02 16:25 root         DEBUG    Running: mock -r /var/lib/copr-rpmbuild/results/configs/child.cfg --no-cleanup-after --no-clean --plugin-option=tmpfs:keep_mounted=True -qn --enable-network --shell -- dnf repoquery -q -C --whatprovides 'libc.so.6(GLIBC_2.8)(64bit)'
10-02 16:25 root         DEBUG    Running: mock -r /var/lib/copr-rpmbuild/results/configs/child.cfg --no-cleanup-after --no-clean --plugin-option=tmpfs:keep_mounted=True -qn --enable-network --shell -- dnf repoquery -q -C --whatprovides 'libgcc_s.so.1(GCC_3.3.1)(64bit)'
10-02 16:25 root         DEBUG    Running: mock -r /var/lib/copr-rpmbuild/results/configs/child.cfg --no-cleanup-after --no-clean --plugin-option=tmpfs:keep_mounted=True -qn --enable-network --shell -- dnf repoquery -q -C --whatprovides 'libc.so.6(GLIBC_2.33)(64bit)'
10-02 16:25 root         DEBUG    Running: mock -r /var/lib/copr-rpmbuild/results/configs/child.cfg --no-cleanup-after --no-clean --plugin-option=tmpfs:keep_mounted=True -qn --enable-network --shell -- dnf repoquery -q -C --whatprovides 'libcrypt.so.2()(64bit)'
10-02 16:25 root         DEBUG    Running: mock -r /var/lib/copr-rpmbuild/results/configs/child.cfg --no-cleanup-after --no-clean --plugin-option=tmpfs:keep_mounted=True -qn --enable-network --shell -- dnf repoquery -q -C --whatprovides 'libcrypto.so.3(OPENSSL_3.0.0)(64bit)'
10-02 16:25 root         DEBUG    Running: mock -r /var/lib/copr-rpmbuild/results/configs/child.cfg --no-cleanup-after --no-clean --plugin-option=tmpfs:keep_mounted=True -qn --enable-network --shell -- dnf repoquery -q -C --whatprovides 'libc.so.6(GLIBC_2.17)(64bit)'
10-02 16:25 root         DEBUG    Running: mock -r /var/lib/copr-rpmbuild/results/configs/child.cfg --no-cleanup-after --no-clean --plugin-option=tmpfs:keep_mounted=True -qn --enable-network --shell -- dnf repoquery -q -C --whatprovides 'libgcc_s.so.1()(64bit)'
10-02 16:25 root         DEBUG    Running: mock -r /var/lib/copr-rpmbuild/results/configs/child.cfg --no-cleanup-after --no-clean --plugin-option=tmpfs:keep_mounted=True -qn --enable-network --shell -- dnf repoquery -q -C --whatprovides 'config(hpnssh)'
10-02 16:25 root         DEBUG    Running: mock -r /var/lib/copr-rpmbuild/results/configs/child.cfg --no-cleanup-after --no-clean --plugin-option=tmpfs:keep_mounted=True -qn --enable-network --shell -- dnf repoquery -q -C --whatprovides 'libc.so.6()(64bit)'
10-02 16:26 root         DEBUG    Running: mock -r /var/lib/copr-rpmbuild/results/configs/child.cfg --no-cleanup-after --no-clean --plugin-option=tmpfs:keep_mounted=True -qn --enable-network --shell -- dnf repoquery -q -C --whatprovides 'libc.so.6(GLIBC_2.6)(64bit)'
10-02 16:26 root         DEBUG    Running: mock -r /var/lib/copr-rpmbuild/results/configs/child.cfg --no-cleanup-after --no-clean --plugin-option=tmpfs:keep_mounted=True -qn --enable-network --shell -- dnf repoquery -q -C --whatprovides 'libc.so.6(GLIBC_2.36)(64bit)'
10-02 16:26 root         DEBUG    Running: mock -r /var/lib/copr-rpmbuild/results/configs/child.cfg --no-cleanup-after --no-clean --plugin-option=tmpfs:keep_mounted=True -qn --enable-network --shell -- dnf repoquery -q -C --whatprovides 'libgssapi_krb5.so.2()(64bit)'
10-02 16:26 root         DEBUG    Running: mock -r /var/lib/copr-rpmbuild/results/configs/child.cfg --no-cleanup-after --no-clean --plugin-option=tmpfs:keep_mounted=True -qn --enable-network --shell -- dnf repoquery -q -C --whatprovides 'libpam.so.0(LIBPAM_1.0)(64bit)'
10-02 16:26 root         DEBUG    Running: mock -r /var/lib/copr-rpmbuild/results/configs/child.cfg --no-cleanup-after --no-clean --plugin-option=tmpfs:keep_mounted=True -qn --enable-network --shell -- dnf repoquery -q -C --whatprovides 'libc.so.6(GLIBC_2.3.4)(64bit)'
10-02 16:26 root         DEBUG    Running: mock -r /var/lib/copr-rpmbuild/results/configs/child.cfg --no-cleanup-after --no-clean --plugin-option=tmpfs:keep_mounted=True -qn --enable-network --shell -- dnf repoquery -q -C --whatprovides 'rtld(GNU_HASH)'
10-02 16:26 root         DEBUG    Running: mock -r /var/lib/copr-rpmbuild/results/configs/child.cfg --no-cleanup-after --no-clean --plugin-option=tmpfs:keep_mounted=True -qn --enable-network --shell -- dnf repoquery -q -C --whatprovides 'libc.so.6(GLIBC_2.3)(64bit)'
10-02 16:26 root         DEBUG    Running: mock -r /var/lib/copr-rpmbuild/results/configs/child.cfg --no-cleanup-after --no-clean --plugin-option=tmpfs:keep_mounted=True -qn --enable-network --shell -- dnf repoquery -q -C --whatprovides 'libkrb5.so.3()(64bit)'
10-02 16:26 root         DEBUG    Running: mock -r /var/lib/copr-rpmbuild/results/configs/child.cfg --no-cleanup-after --no-clean --plugin-option=tmpfs:keep_mounted=True -qn --enable-network --shell -- dnf repoquery -q -C --whatprovides 'libselinux'
10-02 16:26 root         DEBUG    Running: mock -r /var/lib/copr-rpmbuild/results/configs/child.cfg --no-cleanup-after --no-clean --plugin-option=tmpfs:keep_mounted=True -qn --enable-network --shell -- dnf repoquery -q -C --whatprovides 'libselinux.so.1(LIBSELINUX_1.0)(64bit)'
10-02 16:26 root         DEBUG    Running: mock -r /var/lib/copr-rpmbuild/results/configs/child.cfg --no-cleanup-after --no-clean --plugin-option=tmpfs:keep_mounted=True -qn --enable-network --shell -- dnf repoquery -q -C --whatprovides 'hpnssh(s390-64)'
10-02 16:26 root         DEBUG    Running: mock -r /var/lib/copr-rpmbuild/results/configs/child.cfg --no-cleanup-after --no-clean --plugin-option=tmpfs:keep_mounted=True -qn --enable-network --shell -- dnf repoquery -q -C --whatprovides '/usr/sbin/nologin'
10-02 16:26 root         DEBUG    Running: mock -r /var/lib/copr-rpmbuild/results/configs/child.cfg --no-cleanup-after --no-clean --plugin-option=tmpfs:keep_mounted=True -qn --enable-network --shell -- dnf repoquery -q -C --whatprovides 'libgssapi_krb5.so.2(gssapi_krb5_2_MIT)(64bit)'
10-02 16:26 root         DEBUG    Running: mock -r /var/lib/copr-rpmbuild/results/configs/child.cfg --no-cleanup-after --no-clean --plugin-option=tmpfs:keep_mounted=True -qn --enable-network --shell -- dnf repoquery -q -C --whatprovides '/bin/sh'
10-02 16:27 root         DEBUG    Running: mock -r /var/lib/copr-rpmbuild/results/configs/child.cfg --no-cleanup-after --no-clean --plugin-option=tmpfs:keep_mounted=True -qn --enable-network --shell -- dnf repoquery -q -C --whatprovides '/usr/sbin/useradd'
10-02 16:27 root         DEBUG    Running: mock -r /var/lib/copr-rpmbuild/results/configs/child.cfg --no-cleanup-after --no-clean --plugin-option=tmpfs:keep_mounted=True -qn --enable-network --shell -- dnf repoquery -q -C --whatprovides 'libgcc_s.so.1(GCC_3.0)(64bit)'
10-02 16:27 root         DEBUG    Running: mock -r /var/lib/copr-rpmbuild/results/configs/child.cfg --no-cleanup-after --no-clean --plugin-option=tmpfs:keep_mounted=True -qn --enable-network --shell -- dnf repoquery -q -C --whatprovides 'libkrb5.so.3(krb5_3_MIT)(64bit)'
10-02 16:27 root         DEBUG    Running: mock -r /var/lib/copr-rpmbuild/results/configs/child.cfg --no-cleanup-after --no-clean --plugin-option=tmpfs:keep_mounted=True -qn --enable-network --shell -- dnf repoquery -q -C --whatprovides 'libc.so.6(GLIBC_2.34)(64bit)'
10-02 16:27 root         DEBUG    Running: mock -r /var/lib/copr-rpmbuild/results/configs/child.cfg --no-cleanup-after --no-clean --plugin-option=tmpfs:keep_mounted=True -qn --enable-network --shell -- dnf repoquery -q -C --whatprovides 'audit-libs'
10-02 16:27 root         DEBUG    Running: mock -r /var/lib/copr-rpmbuild/results/configs/child.cfg --no-cleanup-after --no-clean --plugin-option=tmpfs:keep_mounted=True -qn --enable-network --shell -- dnf repoquery -q -C --whatprovides 'libcrypt.so.2(XCRYPT_2.0)(64bit)'
10-02 16:27 root         DEBUG    Running: mock -r /var/lib/copr-rpmbuild/results/configs/child.cfg --no-cleanup-after --no-clean --plugin-option=tmpfs:keep_mounted=True -qn --enable-network --shell -- dnf repoquery -q -C --whatprovides 'libc.so.6(GLIBC_2.38)(64bit)'
10-02 16:27 root         DEBUG    Running: mock -r /var/lib/copr-rpmbuild/results/configs/child.cfg --no-cleanup-after --no-clean --plugin-option=tmpfs:keep_mounted=True -qn --enable-network --shell -- dnf repoquery -q -C --whatprovides 'libaudit.so.1()(64bit)'
10-02 16:27 root         DEBUG    Running: mock -r /var/lib/copr-rpmbuild/results/configs/child.cfg --no-cleanup-after --no-clean --plugin-option=tmpfs:keep_mounted=True -qn --enable-network --shell -- dnf repoquery -q -C --whatprovides 'libc.so.6(GLIBC_2.3.2)(64bit)'
10-02 16:27 root         DEBUG    Running: mock -r /var/lib/copr-rpmbuild/results/configs/child.cfg --no-cleanup-after --no-clean --plugin-option=tmpfs:keep_mounted=True -qn --enable-network --shell -- dnf repoquery -q -C --whatprovides 'libc.so.6(GLIBC_2.26)(64bit)'
10-02 16:27 root         DEBUG    Running: mock -r /var/lib/copr-rpmbuild/results/configs/child.cfg --no-cleanup-after --no-clean --plugin-option=tmpfs:keep_mounted=True -qn --enable-network --shell -- dnf repoquery -q -C --whatprovides 'libc.so.6(GLIBC_2.4)(64bit)'
10-02 16:27 root         DEBUG    Running: mock -r /var/lib/copr-rpmbuild/results/configs/child.cfg --no-cleanup-after --no-clean --plugin-option=tmpfs:keep_mounted=True -qn --enable-network --shell -- dnf repoquery -q -C --whatprovides 'libcom_err.so.2()(64bit)'
10-02 16:27 root         DEBUG    Running: mock -r /var/lib/copr-rpmbuild/results/configs/child.cfg --no-cleanup-after --no-clean --plugin-option=tmpfs:keep_mounted=True -qn --enable-network --shell -- dnf repoquery -q -C --whatprovides 'libc.so.6(GLIBC_2.2.4)(64bit)'
10-02 16:28 root         DEBUG    Running: mock -r /var/lib/copr-rpmbuild/results/configs/child.cfg --no-cleanup-after --no-clean --plugin-option=tmpfs:keep_mounted=True -qn --enable-network --shell -- dnf repoquery -q -C --whatprovides 'config(hpnssh-server)'
10-02 16:28 root         DEBUG    Running: mock -r /var/lib/copr-rpmbuild/results/configs/child.cfg --no-cleanup-after --no-clean --plugin-option=tmpfs:keep_mounted=True -qn --enable-network --shell -- dnf repoquery -q -C --whatprovides 'systemd'
10-02 16:28 root         DEBUG    Running: mock -r /var/lib/copr-rpmbuild/results/configs/child.cfg --no-cleanup-after --no-clean --plugin-option=tmpfs:keep_mounted=True -qn --enable-network --shell -- dnf repoquery -q -C --requires --providers-of=requires 'pam' 'pam-libs' 'crypto-policies' 'bash' 'hpnssh-server' 'util-linux' 'systemd-libs' 'glibc' 'shadow-utils' 'libcom_err' 'hpnssh' 'libselinux' 'libgcc' 'audit-libs' 'krb5-libs' 'libxcrypt' 'openssl-libs' 'zlib-ng-compat' 'systemd'
10-02 16:28 root         DEBUG    Running: mock -r /var/lib/copr-rpmbuild/results/configs/child.cfg --no-cleanup-after --no-clean --plugin-option=tmpfs:keep_mounted=True -qn --enable-network --shell -- dnf repoquery -C -l 'pam' 'filesystem' 'pam-libs' 'crypto-policies' 'bash' 'hpnssh-server' 'util-linux' 'systemd-libs' 'glibc' 'shadow-utils' 'libcom_err' 'hpnssh' 'libselinux' 'libgcc' 'audit-libs' 'krb5-libs' 'libxcrypt' 'openssl-libs' 'zlib-ng-compat' 'systemd'
10-02 16:28 root         DEBUG    Running: mock -r /var/lib/copr-rpmbuild/results/configs/child.cfg --no-cleanup-after --no-clean --plugin-option=tmpfs:keep_mounted=True -qn --enable-network --shell -- dnf repoquery -q -C --whatprovides 'libpam.so.0()(64bit)'
10-02 16:28 root         DEBUG    Running: mock -r /var/lib/copr-rpmbuild/results/configs/child.cfg --no-cleanup-after --no-clean --plugin-option=tmpfs:keep_mounted=True -qn --enable-network --shell -- dnf repoquery -q -C --whatprovides 'libcrypto.so.3()(64bit)'
10-02 16:28 root         DEBUG    Running: mock -r /var/lib/copr-rpmbuild/results/configs/child.cfg --no-cleanup-after --no-clean --plugin-option=tmpfs:keep_mounted=True -qn --enable-network --shell -- dnf repoquery -q -C --whatprovides 'libc.so.6(GLIBC_2.2)(64bit)'
10-02 16:28 root         DEBUG    Running: mock -r /var/lib/copr-rpmbuild/results/configs/child.cfg --no-cleanup-after --no-clean --plugin-option=tmpfs:keep_mounted=True -qn --enable-network --shell -- dnf repoquery -q -C --whatprovides 'config(hpnssh-keycat)'
10-02 16:28 root         DEBUG    Running: mock -r /var/lib/copr-rpmbuild/results/configs/child.cfg --no-cleanup-after --no-clean --plugin-option=tmpfs:keep_mounted=True -qn --enable-network --shell -- dnf repoquery -q -C --whatprovides 'libc.so.6(GLIBC_2.25)(64bit)'
10-02 16:28 root         DEBUG    Running: mock -r /var/lib/copr-rpmbuild/results/configs/child.cfg --no-cleanup-after --no-clean --plugin-option=tmpfs:keep_mounted=True -qn --enable-network --shell -- dnf repoquery -q -C --whatprovides 'libz.so.1()(64bit)'
10-02 16:28 root         DEBUG    Running: mock -r /var/lib/copr-rpmbuild/results/configs/child.cfg --no-cleanup-after --no-clean --plugin-option=tmpfs:keep_mounted=True -qn --enable-network --shell -- dnf repoquery -q -C --whatprovides 'libselinux.so.1()(64bit)'
10-02 16:28 root         DEBUG    Running: mock -r /var/lib/copr-rpmbuild/results/configs/child.cfg --no-cleanup-after --no-clean --plugin-option=tmpfs:keep_mounted=True -qn --enable-network --shell -- dnf repoquery -q -C --whatprovides 'libc.so.6(GLIBC_2.8)(64bit)'
10-02 16:28 root         DEBUG    Running: mock -r /var/lib/copr-rpmbuild/results/configs/child.cfg --no-cleanup-after --no-clean --plugin-option=tmpfs:keep_mounted=True -qn --enable-network --shell -- dnf repoquery -q -C --whatprovides 'libgcc_s.so.1(GCC_3.3.1)(64bit)'
10-02 16:28 root         DEBUG    Running: mock -r /var/lib/copr-rpmbuild/results/configs/child.cfg --no-cleanup-after --no-clean --plugin-option=tmpfs:keep_mounted=True -qn --enable-network --shell -- dnf repoquery -q -C --whatprovides 'libc.so.6(GLIBC_2.33)(64bit)'
10-02 16:28 root         DEBUG    Running: mock -r /var/lib/copr-rpmbuild/results/configs/child.cfg --no-cleanup-after --no-clean --plugin-option=tmpfs:keep_mounted=True -qn --enable-network --shell -- dnf repoquery -q -C --whatprovides 'libcrypto.so.3(OPENSSL_3.0.0)(64bit)'
10-02 16:29 root         DEBUG    Running: mock -r /var/lib/copr-rpmbuild/results/configs/child.cfg --no-cleanup-after --no-clean --plugin-option=tmpfs:keep_mounted=True -qn --enable-network --shell -- dnf repoquery -q -C --whatprovides 'libc.so.6(GLIBC_2.17)(64bit)'
10-02 16:29 root         DEBUG    Running: mock -r /var/lib/copr-rpmbuild/results/configs/child.cfg --no-cleanup-after --no-clean --plugin-option=tmpfs:keep_mounted=True -qn --enable-network --shell -- dnf repoquery -q -C --whatprovides 'libgcc_s.so.1()(64bit)'
10-02 16:29 root         DEBUG    Running: mock -r /var/lib/copr-rpmbuild/results/configs/child.cfg --no-cleanup-after --no-clean --plugin-option=tmpfs:keep_mounted=True -qn --enable-network --shell -- dnf repoquery -q -C --whatprovides 'config(hpnssh)'
10-02 16:29 root         DEBUG    Running: mock -r /var/lib/copr-rpmbuild/results/configs/child.cfg --no-cleanup-after --no-clean --plugin-option=tmpfs:keep_mounted=True -qn --enable-network --shell -- dnf repoquery -q -C --whatprovides 'libc.so.6()(64bit)'
10-02 16:29 root         DEBUG    Running: mock -r /var/lib/copr-rpmbuild/results/configs/child.cfg --no-cleanup-after --no-clean --plugin-option=tmpfs:keep_mounted=True -qn --enable-network --shell -- dnf repoquery -q -C --whatprovides 'libpam.so.0(LIBPAM_1.0)(64bit)'
10-02 16:29 root         DEBUG    Running: mock -r /var/lib/copr-rpmbuild/results/configs/child.cfg --no-cleanup-after --no-clean --plugin-option=tmpfs:keep_mounted=True -qn --enable-network --shell -- dnf repoquery -q -C --whatprovides 'libc.so.6(GLIBC_2.36)(64bit)'
10-02 16:29 root         DEBUG    Running: mock -r /var/lib/copr-rpmbuild/results/configs/child.cfg --no-cleanup-after --no-clean --plugin-option=tmpfs:keep_mounted=True -qn --enable-network --shell -- dnf repoquery -q -C --whatprovides 'libc.so.6(GLIBC_2.3.4)(64bit)'
10-02 16:29 root         DEBUG    Running: mock -r /var/lib/copr-rpmbuild/results/configs/child.cfg --no-cleanup-after --no-clean --plugin-option=tmpfs:keep_mounted=True -qn --enable-network --shell -- dnf repoquery -q -C --whatprovides 'rtld(GNU_HASH)'
10-02 16:29 root         DEBUG    Running: mock -r /var/lib/copr-rpmbuild/results/configs/child.cfg --no-cleanup-after --no-clean --plugin-option=tmpfs:keep_mounted=True -qn --enable-network --shell -- dnf repoquery -q -C --whatprovides 'libc.so.6(GLIBC_2.3)(64bit)'
10-02 16:29 root         DEBUG    Running: mock -r /var/lib/copr-rpmbuild/results/configs/child.cfg --no-cleanup-after --no-clean --plugin-option=tmpfs:keep_mounted=True -qn --enable-network --shell -- dnf repoquery -q -C --whatprovides 'libselinux'
10-02 16:29 root         DEBUG    Running: mock -r /var/lib/copr-rpmbuild/results/configs/child.cfg --no-cleanup-after --no-clean --plugin-option=tmpfs:keep_mounted=True -qn --enable-network --shell -- dnf repoquery -q -C --whatprovides 'hpnssh(s390-64)'
10-02 16:29 root         DEBUG    Running: mock -r /var/lib/copr-rpmbuild/results/configs/child.cfg --no-cleanup-after --no-clean --plugin-option=tmpfs:keep_mounted=True -qn --enable-network --shell -- dnf repoquery -q -C --whatprovides '/usr/sbin/nologin'
10-02 16:29 root         DEBUG    Running: mock -r /var/lib/copr-rpmbuild/results/configs/child.cfg --no-cleanup-after --no-clean --plugin-option=tmpfs:keep_mounted=True -qn --enable-network --shell -- dnf repoquery -q -C --whatprovides 'libselinux.so.1(LIBSELINUX_1.0)(64bit)'
10-02 16:30 root         DEBUG    Running: mock -r /var/lib/copr-rpmbuild/results/configs/child.cfg --no-cleanup-after --no-clean --plugin-option=tmpfs:keep_mounted=True -qn --enable-network --shell -- dnf repoquery -q -C --whatprovides '/bin/sh'
10-02 16:30 root         DEBUG    Running: mock -r /var/lib/copr-rpmbuild/results/configs/child.cfg --no-cleanup-after --no-clean --plugin-option=tmpfs:keep_mounted=True -qn --enable-network --shell -- dnf repoquery -q -C --whatprovides 'libgcc_s.so.1(GCC_3.0)(64bit)'
10-02 16:30 root         DEBUG    Running: mock -r /var/lib/copr-rpmbuild/results/configs/child.cfg --no-cleanup-after --no-clean --plugin-option=tmpfs:keep_mounted=True -qn --enable-network --shell -- dnf repoquery -q -C --whatprovides 'audit-libs'
10-02 16:30 root         DEBUG    Running: mock -r /var/lib/copr-rpmbuild/results/configs/child.cfg --no-cleanup-after --no-clean --plugin-option=tmpfs:keep_mounted=True -qn --enable-network --shell -- dnf repoquery -q -C --whatprovides 'libc.so.6(GLIBC_2.34)(64bit)'
10-02 16:30 root         DEBUG    Running: mock -r /var/lib/copr-rpmbuild/results/configs/child.cfg --no-cleanup-after --no-clean --plugin-option=tmpfs:keep_mounted=True -qn --enable-network --shell -- dnf repoquery -q -C --whatprovides 'libc.so.6(GLIBC_2.38)(64bit)'
10-02 16:30 root         DEBUG    Running: mock -r /var/lib/copr-rpmbuild/results/configs/child.cfg --no-cleanup-after --no-clean --plugin-option=tmpfs:keep_mounted=True -qn --enable-network --shell -- dnf repoquery -q -C --whatprovides 'libc.so.6(GLIBC_2.3.2)(64bit)'
10-02 16:30 root         DEBUG    Running: mock -r /var/lib/copr-rpmbuild/results/configs/child.cfg --no-cleanup-after --no-clean --plugin-option=tmpfs:keep_mounted=True -qn --enable-network --shell -- dnf repoquery -q -C --whatprovides 'libc.so.6(GLIBC_2.26)(64bit)'
10-02 16:30 root         DEBUG    Running: mock -r /var/lib/copr-rpmbuild/results/configs/child.cfg --no-cleanup-after --no-clean --plugin-option=tmpfs:keep_mounted=True -qn --enable-network --shell -- dnf repoquery -q -C --whatprovides 'libc.so.6(GLIBC_2.4)(64bit)'
10-02 16:30 root         DEBUG    Running: mock -r /var/lib/copr-rpmbuild/results/configs/child.cfg --no-cleanup-after --no-clean --plugin-option=tmpfs:keep_mounted=True -qn --enable-network --shell -- dnf repoquery -q -C --requires --providers-of=requires 'hpnssh' 'libselinux' 'pam-libs' 'glibc' 'audit-libs' 'bash' 'libgcc' 'hpnssh-keycat' 'openssl-libs' 'zlib-ng-compat' 'util-linux'
10-02 16:30 root         DEBUG    Running: mock -r /var/lib/copr-rpmbuild/results/configs/child.cfg --no-cleanup-after --no-clean --plugin-option=tmpfs:keep_mounted=True -qn --enable-network --shell -- dnf repoquery -C -l 'hpnssh' 'libselinux' 'filesystem' 'pam-libs' 'glibc' 'bash' 'libgcc' 'openssl-libs' 'hpnssh-keycat' 'audit-libs' 'zlib-ng-compat' 'util-linux'
10-02 16:30 root         DEBUG    Running: mock -r /var/lib/copr-rpmbuild/results/configs/child.cfg --no-cleanup-after --no-clean --plugin-option=tmpfs:keep_mounted=True -qn --enable-network --shell -- dnf repoquery -q -C --whatprovides 'libcrypto.so.3()(64bit)'
10-02 16:30 root         DEBUG    Running: mock -r /var/lib/copr-rpmbuild/results/configs/child.cfg --no-cleanup-after --no-clean --plugin-option=tmpfs:keep_mounted=True -qn --enable-network --shell -- dnf repoquery -q -C --whatprovides 'libc.so.6(GLIBC_2.2)(64bit)'
10-02 16:31 root         DEBUG    Running: mock -r /var/lib/copr-rpmbuild/results/configs/child.cfg --no-cleanup-after --no-clean --plugin-option=tmpfs:keep_mounted=True -qn --enable-network --shell -- dnf repoquery -q -C --whatprovides 'libc.so.6(GLIBC_2.25)(64bit)'
10-02 16:31 root         DEBUG    Running: mock -r /var/lib/copr-rpmbuild/results/configs/child.cfg --no-cleanup-after --no-clean --plugin-option=tmpfs:keep_mounted=True -qn --enable-network --shell -- dnf repoquery -q -C --whatprovides 'libz.so.1()(64bit)'
10-02 16:31 root         DEBUG    Running: mock -r /var/lib/copr-rpmbuild/results/configs/child.cfg --no-cleanup-after --no-clean --plugin-option=tmpfs:keep_mounted=True -qn --enable-network --shell -- dnf repoquery -q -C --whatprovides 'libselinux.so.1()(64bit)'
10-02 16:31 root         DEBUG    Running: mock -r /var/lib/copr-rpmbuild/results/configs/child.cfg --no-cleanup-after --no-clean --plugin-option=tmpfs:keep_mounted=True -qn --enable-network --shell -- dnf repoquery -q -C --whatprovides 'libgobject-2.0.so.0()(64bit)'
10-02 16:31 root         DEBUG    Running: mock -r /var/lib/copr-rpmbuild/results/configs/child.cfg --no-cleanup-after --no-clean --plugin-option=tmpfs:keep_mounted=True -qn --enable-network --shell -- dnf repoquery -q -C --whatprovides 'libc.so.6(GLIBC_2.8)(64bit)'
10-02 16:31 root         DEBUG    Running: mock -r /var/lib/copr-rpmbuild/results/configs/child.cfg --no-cleanup-after --no-clean --plugin-option=tmpfs:keep_mounted=True -qn --enable-network --shell -- dnf repoquery -q -C --whatprovides 'libgcc_s.so.1(GCC_3.3.1)(64bit)'
10-02 16:31 root         DEBUG    Running: mock -r /var/lib/copr-rpmbuild/results/configs/child.cfg --no-cleanup-after --no-clean --plugin-option=tmpfs:keep_mounted=True -qn --enable-network --shell -- dnf repoquery -q -C --whatprovides 'libc.so.6(GLIBC_2.33)(64bit)'
10-02 16:31 root         DEBUG    Running: mock -r /var/lib/copr-rpmbuild/results/configs/child.cfg --no-cleanup-after --no-clean --plugin-option=tmpfs:keep_mounted=True -qn --enable-network --shell -- dnf repoquery -q -C --whatprovides 'libgtk-3.so.0()(64bit)'
10-02 16:31 root         DEBUG    Running: mock -r /var/lib/copr-rpmbuild/results/configs/child.cfg --no-cleanup-after --no-clean --plugin-option=tmpfs:keep_mounted=True -qn --enable-network --shell -- dnf repoquery -q -C --whatprovides 'libcrypto.so.3(OPENSSL_3.0.0)(64bit)'
10-02 16:31 root         DEBUG    Running: mock -r /var/lib/copr-rpmbuild/results/configs/child.cfg --no-cleanup-after --no-clean --plugin-option=tmpfs:keep_mounted=True -qn --enable-network --shell -- dnf repoquery -q -C --whatprovides 'libc.so.6(GLIBC_2.17)(64bit)'
10-02 16:31 root         DEBUG    Running: mock -r /var/lib/copr-rpmbuild/results/configs/child.cfg --no-cleanup-after --no-clean --plugin-option=tmpfs:keep_mounted=True -qn --enable-network --shell -- dnf repoquery -q -C --whatprovides 'libgcc_s.so.1()(64bit)'
10-02 16:31 root         DEBUG    Running: mock -r /var/lib/copr-rpmbuild/results/configs/child.cfg --no-cleanup-after --no-clean --plugin-option=tmpfs:keep_mounted=True -qn --enable-network --shell -- dnf repoquery -q -C --whatprovides 'config(hpnssh)'
10-02 16:31 root         DEBUG    Running: mock -r /var/lib/copr-rpmbuild/results/configs/child.cfg --no-cleanup-after --no-clean --plugin-option=tmpfs:keep_mounted=True -qn --enable-network --shell -- dnf repoquery -q -C --whatprovides 'libc.so.6()(64bit)'
10-02 16:32 root         DEBUG    Running: mock -r /var/lib/copr-rpmbuild/results/configs/child.cfg --no-cleanup-after --no-clean --plugin-option=tmpfs:keep_mounted=True -qn --enable-network --shell -- dnf repoquery -q -C --whatprovides 'libc.so.6(GLIBC_2.36)(64bit)'
10-02 16:32 root         DEBUG    Running: mock -r /var/lib/copr-rpmbuild/results/configs/child.cfg --no-cleanup-after --no-clean --plugin-option=tmpfs:keep_mounted=True -qn --enable-network --shell -- dnf repoquery -q -C --whatprovides 'libc.so.6(GLIBC_2.4)(64bit)'
10-02 16:32 root         DEBUG    Running: mock -r /var/lib/copr-rpmbuild/results/configs/child.cfg --no-cleanup-after --no-clean --plugin-option=tmpfs:keep_mounted=True -qn --enable-network --shell -- dnf repoquery -q -C --whatprovides 'libc.so.6(GLIBC_2.3.4)(64bit)'
10-02 16:32 root         DEBUG    Running: mock -r /var/lib/copr-rpmbuild/results/configs/child.cfg --no-cleanup-after --no-clean --plugin-option=tmpfs:keep_mounted=True -qn --enable-network --shell -- dnf repoquery -q -C --whatprovides 'rtld(GNU_HASH)'
10-02 16:32 root         DEBUG    Running: mock -r /var/lib/copr-rpmbuild/results/configs/child.cfg --no-cleanup-after --no-clean --plugin-option=tmpfs:keep_mounted=True -qn --enable-network --shell -- dnf repoquery -q -C --whatprovides 'libc.so.6(GLIBC_2.3)(64bit)'
10-02 16:32 root         DEBUG    Running: mock -r /var/lib/copr-rpmbuild/results/configs/child.cfg --no-cleanup-after --no-clean --plugin-option=tmpfs:keep_mounted=True -qn --enable-network --shell -- dnf repoquery -q -C --whatprovides 'libselinux'
10-02 16:32 root         DEBUG    Running: mock -r /var/lib/copr-rpmbuild/results/configs/child.cfg --no-cleanup-after --no-clean --plugin-option=tmpfs:keep_mounted=True -qn --enable-network --shell -- dnf repoquery -q -C --whatprovides 'libselinux.so.1(LIBSELINUX_1.0)(64bit)'
10-02 16:32 root         DEBUG    Running: mock -r /var/lib/copr-rpmbuild/results/configs/child.cfg --no-cleanup-after --no-clean --plugin-option=tmpfs:keep_mounted=True -qn --enable-network --shell -- dnf repoquery -q -C --whatprovides '/usr/sbin/nologin'
10-02 16:32 root         DEBUG    Running: mock -r /var/lib/copr-rpmbuild/results/configs/child.cfg --no-cleanup-after --no-clean --plugin-option=tmpfs:keep_mounted=True -qn --enable-network --shell -- dnf repoquery -q -C --whatprovides '/bin/sh'
10-02 16:32 root         DEBUG    Running: mock -r /var/lib/copr-rpmbuild/results/configs/child.cfg --no-cleanup-after --no-clean --plugin-option=tmpfs:keep_mounted=True -qn --enable-network --shell -- dnf repoquery -q -C --whatprovides 'libgcc_s.so.1(GCC_3.0)(64bit)'
10-02 16:32 root         DEBUG    Running: mock -r /var/lib/copr-rpmbuild/results/configs/child.cfg --no-cleanup-after --no-clean --plugin-option=tmpfs:keep_mounted=True -qn --enable-network --shell -- dnf repoquery -q -C --whatprovides 'audit-libs'
10-02 16:32 root         DEBUG    Running: mock -r /var/lib/copr-rpmbuild/results/configs/child.cfg --no-cleanup-after --no-clean --plugin-option=tmpfs:keep_mounted=True -qn --enable-network --shell -- dnf repoquery -q -C --whatprovides 'libc.so.6(GLIBC_2.34)(64bit)'
10-02 16:32 root         DEBUG    Running: mock -r /var/lib/copr-rpmbuild/results/configs/child.cfg --no-cleanup-after --no-clean --plugin-option=tmpfs:keep_mounted=True -qn --enable-network --shell -- dnf repoquery -q -C --whatprovides 'libc.so.6(GLIBC_2.38)(64bit)'
10-02 16:32 root         DEBUG    Running: mock -r /var/lib/copr-rpmbuild/results/configs/child.cfg --no-cleanup-after --no-clean --plugin-option=tmpfs:keep_mounted=True -qn --enable-network --shell -- dnf repoquery -q -C --whatprovides 'libglib-2.0.so.0()(64bit)'
10-02 16:32 root         DEBUG    Running: mock -r /var/lib/copr-rpmbuild/results/configs/child.cfg --no-cleanup-after --no-clean --plugin-option=tmpfs:keep_mounted=True -qn --enable-network --shell -- dnf repoquery -q -C --whatprovides 'libc.so.6(GLIBC_2.3.2)(64bit)'
10-02 16:33 root         DEBUG    Running: mock -r /var/lib/copr-rpmbuild/results/configs/child.cfg --no-cleanup-after --no-clean --plugin-option=tmpfs:keep_mounted=True -qn --enable-network --shell -- dnf repoquery -q -C --whatprovides 'libc.so.6(GLIBC_2.26)(64bit)'
10-02 16:33 root         DEBUG    Running: mock -r /var/lib/copr-rpmbuild/results/configs/child.cfg --no-cleanup-after --no-clean --plugin-option=tmpfs:keep_mounted=True -qn --enable-network --shell -- dnf repoquery -q -C --whatprovides 'libgdk-3.so.0()(64bit)'
10-02 16:33 root         DEBUG    Running: mock -r /var/lib/copr-rpmbuild/results/configs/child.cfg --no-cleanup-after --no-clean --plugin-option=tmpfs:keep_mounted=True -qn --enable-network --shell -- dnf repoquery -q -C --requires --providers-of=requires 'hpnssh' 'libselinux' 'glib2' 'glibc' 'audit-libs' 'bash' 'gtk3' 'libgcc' 'openssl-libs' 'zlib-ng-compat' 'util-linux'
10-02 16:33 root         DEBUG    Running: mock -r /var/lib/copr-rpmbuild/results/configs/child.cfg --no-cleanup-after --no-clean --plugin-option=tmpfs:keep_mounted=True -qn --enable-network --shell -- dnf repoquery -C -l 'hpnssh' 'libselinux' 'glib2' 'filesystem' 'glibc' 'bash' 'gtk3' 'libgcc' 'openssl-libs' 'audit-libs' 'zlib-ng-compat' 'util-linux'
10-02 16:33 root         DEBUG    Running: mock -r /var/lib/copr-rpmbuild/results/configs/child.cfg --no-cleanup-after --no-clean --plugin-option=tmpfs:keep_mounted=True -qn --enable-network --shell -- dnf repoquery -C -l 'filesystem'
10-02 16:33 root         DEBUG    Running: mock -r /var/lib/copr-rpmbuild/results/configs/child.cfg --no-cleanup-after --no-clean --plugin-option=tmpfs:keep_mounted=True -qn --enable-network --shell -- dnf repoquery -C -l 'filesystem'
10-02 16:33 root         DEBUG        CheckOwnDirs completed: 797.620 seconds
10-02 16:33 root         DEBUG    Running check: CheckOwnOther
10-02 16:33 root         DEBUG        CheckOwnOther completed: 0.000 seconds
10-02 16:33 root         DEBUG    Running check: CheckRelocatable
10-02 16:33 root         DEBUG        CheckRelocatable completed: 0.001 seconds
10-02 16:33 root         DEBUG    Running check: CheckRequires
10-02 16:33 root         DEBUG        CheckRequires completed: 0.000 seconds
10-02 16:33 root         DEBUG    Running check: CheckSourceMD5
10-02 16:33 root         DEBUG    Skipping md5-test for /var/lib/copr-rpmbuild/results/hpnssh/srpm-unpacked/sshd-suse.pam
10-02 16:33 root         DEBUG    Skipping md5-test for /var/lib/copr-rpmbuild/results/hpnssh/srpm-unpacked/series
10-02 16:33 root         DEBUG    Skipping md5-test for /var/lib/copr-rpmbuild/results/hpnssh/srpm-unpacked/hpnsshd.sysuser
10-02 16:33 root         DEBUG    Skipping md5-test for /var/lib/copr-rpmbuild/results/hpnssh/srpm-unpacked/hpnssh-agent.socket
10-02 16:33 root         DEBUG    Skipping md5-test for /var/lib/copr-rpmbuild/results/hpnssh/srpm-unpacked/hpnssh-agent.service
10-02 16:33 root         DEBUG    Skipping md5-test for /var/lib/copr-rpmbuild/results/hpnssh/srpm-unpacked/hpnsshd-keygen.target
10-02 16:33 root         DEBUG    Skipping md5-test for /var/lib/copr-rpmbuild/results/hpnssh/srpm-unpacked/hpnsshd-keygen
10-02 16:33 root         DEBUG    Skipping md5-test for /var/lib/copr-rpmbuild/results/hpnssh/srpm-unpacked/hpnsshd-keygen@.service
10-02 16:33 root         DEBUG    Skipping md5-test for /var/lib/copr-rpmbuild/results/hpnssh/srpm-unpacked/hpnsshd.service
10-02 16:33 root         DEBUG    Skipping md5-test for /var/lib/copr-rpmbuild/results/hpnssh/srpm-unpacked/hpnsshd.socket
10-02 16:33 root         DEBUG    Skipping md5-test for /var/lib/copr-rpmbuild/results/hpnssh/srpm-unpacked/hpnsshd@.service
10-02 16:33 root         DEBUG    Skipping md5-test for /var/lib/copr-rpmbuild/results/hpnssh/srpm-unpacked/hpnsshd.sysconfig
10-02 16:33 root         DEBUG    Skipping md5-test for /var/lib/copr-rpmbuild/results/hpnssh/srpm-unpacked/hpnssh-keycat.pam
10-02 16:33 root         DEBUG    Checking sha256 for /var/lib/copr-rpmbuild/results/hpnssh/srpm-unpacked/CJR-GPG-KEY.gpg
10-02 16:33 root         DEBUG    Checking source sha256 : /var/lib/copr-rpmbuild/results/hpnssh/upstream/CJR-GPG-KEY.gpg
10-02 16:33 root         DEBUG    Skipping md5-test for /var/lib/copr-rpmbuild/results/hpnssh/srpm-unpacked/hpnsshd.pam
10-02 16:33 root         DEBUG    Skipping md5-test for /var/lib/copr-rpmbuild/results/hpnssh/srpm-unpacked/hpnssh-9.9p1_hpn18.6.0.tar.gz.asc
10-02 16:33 root         DEBUG    Skipping md5-test for /var/lib/copr-rpmbuild/results/hpnssh/srpm-unpacked/hpnssh-9.9p1_hpn18.6.0.tar.gz
10-02 16:33 root         DEBUG    Cannot unpack /var/lib/copr-rpmbuild/results/hpnssh/srpm-unpacked/sshd-suse.pam
10-02 16:33 root         DEBUG    Status: 1, stdout: , stderr: .
10-02 16:33 root         DEBUG    Cannot unpack /var/lib/copr-rpmbuild/results/hpnssh/srpm-unpacked/sshd-suse.pam
10-02 16:33 root         DEBUG    Status: 1, stdout: , stderr: .
10-02 16:33 root         DEBUG    Cannot unpack sshd-suse.pam, so probably not an archive. Copying instead
10-02 16:33 root         DEBUG     Diff cmd: /usr/bin/diff -U2 -r /var/lib/copr-rpmbuild/results/hpnssh/upstream-unpacked/Source17 /var/lib/copr-rpmbuild/results/hpnssh/srpm-unpacked/sshd-suse.pam-extract
10-02 16:33 root         DEBUG    Cannot unpack /var/lib/copr-rpmbuild/results/hpnssh/srpm-unpacked/series
10-02 16:33 root         DEBUG    Status: 1, stdout: , stderr: .
10-02 16:33 root         DEBUG    Cannot unpack /var/lib/copr-rpmbuild/results/hpnssh/srpm-unpacked/series
10-02 16:33 root         DEBUG    Status: 1, stdout: , stderr: .
10-02 16:33 root         DEBUG    Cannot unpack series, so probably not an archive. Copying instead
10-02 16:33 root         DEBUG     Diff cmd: /usr/bin/diff -U2 -r /var/lib/copr-rpmbuild/results/hpnssh/upstream-unpacked/Source16 /var/lib/copr-rpmbuild/results/hpnssh/srpm-unpacked/series-extract
10-02 16:33 root         DEBUG    Cannot unpack /var/lib/copr-rpmbuild/results/hpnssh/srpm-unpacked/hpnsshd.sysuser
10-02 16:33 root         DEBUG    Status: 1, stdout: , stderr: .
10-02 16:33 root         DEBUG    Cannot unpack /var/lib/copr-rpmbuild/results/hpnssh/srpm-unpacked/hpnsshd.sysuser
10-02 16:33 root         DEBUG    Status: 1, stdout: , stderr: .
10-02 16:33 root         DEBUG    Cannot unpack hpnsshd.sysuser, so probably not an archive. Copying instead
10-02 16:33 root         DEBUG     Diff cmd: /usr/bin/diff -U2 -r /var/lib/copr-rpmbuild/results/hpnssh/upstream-unpacked/Source14 /var/lib/copr-rpmbuild/results/hpnssh/srpm-unpacked/hpnsshd.sysuser-extract
10-02 16:33 root         DEBUG    Cannot unpack /var/lib/copr-rpmbuild/results/hpnssh/srpm-unpacked/hpnssh-agent.socket
10-02 16:33 root         DEBUG    Status: 1, stdout: , stderr: .
10-02 16:33 root         DEBUG    Cannot unpack /var/lib/copr-rpmbuild/results/hpnssh/srpm-unpacked/hpnssh-agent.socket
10-02 16:33 root         DEBUG    Status: 1, stdout: , stderr: .
10-02 16:33 root         DEBUG    Cannot unpack hpnssh-agent.socket, so probably not an archive. Copying instead
10-02 16:33 root         DEBUG     Diff cmd: /usr/bin/diff -U2 -r /var/lib/copr-rpmbuild/results/hpnssh/upstream-unpacked/Source13 /var/lib/copr-rpmbuild/results/hpnssh/srpm-unpacked/hpnssh-agent.socket-extract
10-02 16:33 root         DEBUG    Cannot unpack /var/lib/copr-rpmbuild/results/hpnssh/srpm-unpacked/hpnssh-agent.service
10-02 16:33 root         DEBUG    Status: 1, stdout: , stderr: .
10-02 16:33 root         DEBUG    Cannot unpack /var/lib/copr-rpmbuild/results/hpnssh/srpm-unpacked/hpnssh-agent.service
10-02 16:33 root         DEBUG    Status: 1, stdout: , stderr: .
10-02 16:33 root         DEBUG    Cannot unpack hpnssh-agent.service, so probably not an archive. Copying instead
10-02 16:33 root         DEBUG     Diff cmd: /usr/bin/diff -U2 -r /var/lib/copr-rpmbuild/results/hpnssh/upstream-unpacked/Source12 /var/lib/copr-rpmbuild/results/hpnssh/srpm-unpacked/hpnssh-agent.service-extract
10-02 16:33 root         DEBUG    Cannot unpack /var/lib/copr-rpmbuild/results/hpnssh/srpm-unpacked/hpnsshd-keygen.target
10-02 16:33 root         DEBUG    Status: 1, stdout: , stderr: .
10-02 16:33 root         DEBUG    Cannot unpack /var/lib/copr-rpmbuild/results/hpnssh/srpm-unpacked/hpnsshd-keygen.target
10-02 16:33 root         DEBUG    Status: 1, stdout: , stderr: .
10-02 16:33 root         DEBUG    Cannot unpack hpnsshd-keygen.target, so probably not an archive. Copying instead
10-02 16:33 root         DEBUG     Diff cmd: /usr/bin/diff -U2 -r /var/lib/copr-rpmbuild/results/hpnssh/upstream-unpacked/Source11 /var/lib/copr-rpmbuild/results/hpnssh/srpm-unpacked/hpnsshd-keygen.target-extract
10-02 16:33 root         DEBUG    Cannot unpack /var/lib/copr-rpmbuild/results/hpnssh/srpm-unpacked/hpnsshd-keygen
10-02 16:33 root         DEBUG    Status: 1, stdout: , stderr: .
10-02 16:33 root         DEBUG    Cannot unpack /var/lib/copr-rpmbuild/results/hpnssh/srpm-unpacked/hpnsshd-keygen
10-02 16:33 root         DEBUG    Status: 1, stdout: , stderr: .
10-02 16:33 root         DEBUG    Cannot unpack hpnsshd-keygen, so probably not an archive. Copying instead
10-02 16:33 root         DEBUG     Diff cmd: /usr/bin/diff -U2 -r /var/lib/copr-rpmbuild/results/hpnssh/upstream-unpacked/Source10 /var/lib/copr-rpmbuild/results/hpnssh/srpm-unpacked/hpnsshd-keygen-extract
10-02 16:33 root         DEBUG    Cannot unpack /var/lib/copr-rpmbuild/results/hpnssh/srpm-unpacked/hpnsshd-keygen@.service
10-02 16:33 root         DEBUG    Status: 1, stdout: , stderr: .
10-02 16:33 root         DEBUG    Cannot unpack /var/lib/copr-rpmbuild/results/hpnssh/srpm-unpacked/hpnsshd-keygen@.service
10-02 16:33 root         DEBUG    Status: 1, stdout: , stderr: .
10-02 16:33 root         DEBUG    Cannot unpack hpnsshd-keygen@.service, so probably not an archive. Copying instead
10-02 16:33 root         DEBUG     Diff cmd: /usr/bin/diff -U2 -r /var/lib/copr-rpmbuild/results/hpnssh/upstream-unpacked/Source9 /var/lib/copr-rpmbuild/results/hpnssh/srpm-unpacked/hpnsshd-keygen@.service-extract
10-02 16:33 root         DEBUG    Cannot unpack /var/lib/copr-rpmbuild/results/hpnssh/srpm-unpacked/hpnsshd.service
10-02 16:33 root         DEBUG    Status: 1, stdout: , stderr: .
10-02 16:33 root         DEBUG    Cannot unpack /var/lib/copr-rpmbuild/results/hpnssh/srpm-unpacked/hpnsshd.service
10-02 16:33 root         DEBUG    Status: 1, stdout: , stderr: .
10-02 16:33 root         DEBUG    Cannot unpack hpnsshd.service, so probably not an archive. Copying instead
10-02 16:33 root         DEBUG     Diff cmd: /usr/bin/diff -U2 -r /var/lib/copr-rpmbuild/results/hpnssh/upstream-unpacked/Source8 /var/lib/copr-rpmbuild/results/hpnssh/srpm-unpacked/hpnsshd.service-extract
10-02 16:33 root         DEBUG    Cannot unpack /var/lib/copr-rpmbuild/results/hpnssh/srpm-unpacked/hpnsshd.socket
10-02 16:33 root         DEBUG    Status: 1, stdout: , stderr: .
10-02 16:33 root         DEBUG    Cannot unpack /var/lib/copr-rpmbuild/results/hpnssh/srpm-unpacked/hpnsshd.socket
10-02 16:33 root         DEBUG    Status: 1, stdout: , stderr: .
10-02 16:33 root         DEBUG    Cannot unpack hpnsshd.socket, so probably not an archive. Copying instead
10-02 16:33 root         DEBUG     Diff cmd: /usr/bin/diff -U2 -r /var/lib/copr-rpmbuild/results/hpnssh/upstream-unpacked/Source7 /var/lib/copr-rpmbuild/results/hpnssh/srpm-unpacked/hpnsshd.socket-extract
10-02 16:33 root         DEBUG    Cannot unpack /var/lib/copr-rpmbuild/results/hpnssh/srpm-unpacked/hpnsshd@.service
10-02 16:33 root         DEBUG    Status: 1, stdout: , stderr: .
10-02 16:33 root         DEBUG    Cannot unpack /var/lib/copr-rpmbuild/results/hpnssh/srpm-unpacked/hpnsshd@.service
10-02 16:33 root         DEBUG    Status: 1, stdout: , stderr: .
10-02 16:33 root         DEBUG    Cannot unpack hpnsshd@.service, so probably not an archive. Copying instead
10-02 16:33 root         DEBUG     Diff cmd: /usr/bin/diff -U2 -r /var/lib/copr-rpmbuild/results/hpnssh/upstream-unpacked/Source6 /var/lib/copr-rpmbuild/results/hpnssh/srpm-unpacked/hpnsshd@.service-extract
10-02 16:33 root         DEBUG    Cannot unpack /var/lib/copr-rpmbuild/results/hpnssh/srpm-unpacked/hpnsshd.sysconfig
10-02 16:33 root         DEBUG    Status: 1, stdout: , stderr: .
10-02 16:33 root         DEBUG    Cannot unpack /var/lib/copr-rpmbuild/results/hpnssh/srpm-unpacked/hpnsshd.sysconfig
10-02 16:33 root         DEBUG    Status: 1, stdout: , stderr: .
10-02 16:33 root         DEBUG    Cannot unpack hpnsshd.sysconfig, so probably not an archive. Copying instead
10-02 16:33 root         DEBUG     Diff cmd: /usr/bin/diff -U2 -r /var/lib/copr-rpmbuild/results/hpnssh/upstream-unpacked/Source5 /var/lib/copr-rpmbuild/results/hpnssh/srpm-unpacked/hpnsshd.sysconfig-extract
10-02 16:33 root         DEBUG    Cannot unpack /var/lib/copr-rpmbuild/results/hpnssh/srpm-unpacked/hpnssh-keycat.pam
10-02 16:33 root         DEBUG    Status: 1, stdout: , stderr: .
10-02 16:33 root         DEBUG    Cannot unpack /var/lib/copr-rpmbuild/results/hpnssh/srpm-unpacked/hpnssh-keycat.pam
10-02 16:33 root         DEBUG    Status: 1, stdout: , stderr: .
10-02 16:33 root         DEBUG    Cannot unpack hpnssh-keycat.pam, so probably not an archive. Copying instead
10-02 16:33 root         DEBUG     Diff cmd: /usr/bin/diff -U2 -r /var/lib/copr-rpmbuild/results/hpnssh/upstream-unpacked/Source4 /var/lib/copr-rpmbuild/results/hpnssh/srpm-unpacked/hpnssh-keycat.pam-extract
10-02 16:33 root         DEBUG    Cannot unpack /var/lib/copr-rpmbuild/results/hpnssh/upstream/CJR-GPG-KEY.gpg
10-02 16:33 root         DEBUG    Status: 1, stdout: , stderr: .
10-02 16:33 root         DEBUG    Cannot unpack /var/lib/copr-rpmbuild/results/hpnssh/srpm-unpacked/CJR-GPG-KEY.gpg
10-02 16:33 root         DEBUG    Status: 1, stdout: , stderr: .
10-02 16:33 root         DEBUG    Cannot unpack CJR-GPG-KEY.gpg, so probably not an archive. Copying instead
10-02 16:33 root         DEBUG     Diff cmd: /usr/bin/diff -U2 -r /var/lib/copr-rpmbuild/results/hpnssh/upstream-unpacked/Source3 /var/lib/copr-rpmbuild/results/hpnssh/srpm-unpacked/CJR-GPG-KEY.gpg-extract
10-02 16:33 root         DEBUG        CheckSourceMD5 completed: 0.729 seconds
10-02 16:33 root         DEBUG    Running check: CheckSourcedirMacroUse
10-02 16:33 root         DEBUG        CheckSourcedirMacroUse completed: 0.000 seconds
10-02 16:33 root         DEBUG    Running check: CheckSpecLegibility
10-02 16:33 root         DEBUG        CheckSpecLegibility completed: 0.000 seconds
10-02 16:33 root         DEBUG    Running check: CheckSpecName
10-02 16:33 root         DEBUG        CheckSpecName completed: 0.000 seconds
10-02 16:33 root         DEBUG    Running check: CheckStaticLibs
10-02 16:33 root         DEBUG        CheckStaticLibs completed: 0.001 seconds
10-02 16:33 root         DEBUG    Running check: CheckSystemdUnitdirScriplets
10-02 16:33 root         DEBUG        CheckSystemdUnitdirScriplets completed: 0.002 seconds
10-02 16:33 root         DEBUG    Running check: CheckSystemdUserunitdirScriplets
10-02 16:33 root         DEBUG        CheckSystemdUserunitdirScriplets completed: 0.001 seconds
10-02 16:33 root         DEBUG    Running check: CheckUTF8Filenames
10-02 16:33 root         DEBUG        CheckUTF8Filenames completed: 0.000 seconds
10-02 16:33 root         DEBUG    Running check: CheckUpdateIconCache
10-02 16:33 root         DEBUG        CheckUpdateIconCache completed: 0.001 seconds
10-02 16:33 root         DEBUG    Running check: CheckUsefulDebuginfo
10-02 16:33 root         DEBUG        CheckUsefulDebuginfo completed: 0.001 seconds
10-02 16:33 root         DEBUG    Running check: CheckBuildInMock
10-02 16:33 root         DEBUG        CheckBuildInMock completed: 0.000 seconds
10-02 16:33 root         DEBUG    Running check: CheckBuildroot
10-02 16:33 root         DEBUG        CheckBuildroot completed: 0.001 seconds
10-02 16:33 root         DEBUG    Running check: CheckBundledFonts
10-02 16:33 root         DEBUG        CheckBundledFonts completed: 0.003 seconds
10-02 16:33 root         DEBUG    Running check: CheckClean
10-02 16:33 root         DEBUG        CheckClean completed: 0.001 seconds
10-02 16:33 root         DEBUG    Running check: CheckContainsLicenseText
10-02 16:33 root         DEBUG        CheckContainsLicenseText completed: 0.000 seconds
10-02 16:33 root         DEBUG    Running check: CheckFileRequires
10-02 16:33 root         DEBUG        CheckFileRequires completed: 0.000 seconds
10-02 16:33 root         DEBUG    Running check: CheckFinalRequiresProvides
10-02 16:33 root         DEBUG        CheckFinalRequiresProvides completed: 0.000 seconds
10-02 16:33 root         DEBUG    Running check: CheckFullVerReqSub
10-02 16:33 root         DEBUG        CheckFullVerReqSub completed: 0.000 seconds
10-02 16:33 root         DEBUG    Running check: CheckFunctionAsDescribed
10-02 16:33 root         DEBUG        CheckFunctionAsDescribed completed: 0.000 seconds
10-02 16:33 root         DEBUG    Running check: CheckIllegalSpecTags
10-02 16:33 root         DEBUG        CheckIllegalSpecTags completed: 0.003 seconds
10-02 16:33 root         DEBUG    Running check: CheckLatestVersionIsPackaged
10-02 16:33 root         DEBUG        CheckLatestVersionIsPackaged completed: 0.000 seconds
10-02 16:33 root         DEBUG    Running check: CheckLicenseUpstream
10-02 16:33 root         DEBUG        CheckLicenseUpstream completed: 0.000 seconds
10-02 16:33 root         DEBUG    Running check: CheckManPages
10-02 16:33 root         DEBUG        CheckManPages completed: 0.000 seconds
10-02 16:33 root         DEBUG    Running check: CheckParallelMake
10-02 16:33 root         DEBUG        CheckParallelMake completed: 0.000 seconds
10-02 16:33 root         DEBUG    Running check: CheckPatchComments
10-02 16:33 root         DEBUG        CheckPatchComments completed: 0.000 seconds
10-02 16:33 root         DEBUG    Running check: CheckPkgConfigFiles
10-02 16:33 root         DEBUG        CheckPkgConfigFiles completed: 0.001 seconds
10-02 16:33 root         DEBUG    Running check: CheckRubyPlugin
10-02 16:33 root         DEBUG        CheckRubyPlugin completed: 0.000 seconds
10-02 16:33 root         DEBUG    Running check: CheckScriptletSanity
10-02 16:33 root         DEBUG        CheckScriptletSanity completed: 0.000 seconds
10-02 16:33 root         DEBUG    Running check: CheckSourceComment
10-02 16:33 root         DEBUG        CheckSourceComment completed: 0.000 seconds
10-02 16:33 root         DEBUG    Running check: CheckSourceDownloads
10-02 16:33 root         DEBUG        CheckSourceDownloads completed: 0.000 seconds
10-02 16:33 root         DEBUG    Running check: CheckSourceUrl
10-02 16:33 root         DEBUG        CheckSourceUrl completed: 0.000 seconds
10-02 16:33 root         DEBUG    Running check: CheckSourceVerification
10-02 16:33 root         DEBUG        CheckSourceVerification completed: 0.001 seconds
10-02 16:33 root         DEBUG    Running check: CheckSpecAsInSRPM
10-02 16:33 root         DEBUG        CheckSpecAsInSRPM completed: 0.000 seconds
10-02 16:33 root         DEBUG    Running check: CheckSupportAllArchs
10-02 16:33 root         DEBUG        CheckSupportAllArchs completed: 0.000 seconds
10-02 16:33 root         DEBUG    Running check: CheckTestSuites
10-02 16:33 root         DEBUG        CheckTestSuites completed: 0.000 seconds
10-02 16:33 root         DEBUG    Running check: CheckTimeStamps
10-02 16:33 root         DEBUG        CheckTimeStamps completed: 0.000 seconds
10-02 16:33 root         DEBUG    Running check: CheckTmpfiles
10-02 16:33 root         DEBUG        CheckTmpfiles completed: 0.002 seconds
10-02 16:33 root         DEBUG    Running check: CheckUpdateMimeDatabase
10-02 16:33 root         DEBUG        CheckUpdateMimeDatabase completed: 0.001 seconds
10-02 16:33 root         DEBUG    Running check: CheckUseGlobal
10-02 16:33 root         DEBUG        CheckUseGlobal completed: 0.001 seconds
10-02 16:33 root         DEBUG    Running check: SugarActivityCheckBuildRequires
10-02 16:33 root         DEBUG        SugarActivityCheckBuildRequires completed: 0.001 seconds
10-02 16:33 root         DEBUG    Running check: SugarActivityCheckNaming
10-02 16:33 root         DEBUG        SugarActivityCheckNaming completed: 0.001 seconds
10-02 16:33 root         DEBUG    Running check: SugarActivityCheckRuntimeDeps
10-02 16:33 root         DEBUG        SugarActivityCheckRuntimeDeps completed: 0.001 seconds
10-02 16:33 root         DEBUG    Running check: CheckAddMavenDepmap
10-02 16:33 root         DEBUG        CheckAddMavenDepmap completed: 0.001 seconds
10-02 16:33 root         DEBUG    Running check: CheckBundledJars
10-02 16:33 root         DEBUG        CheckBundledJars completed: 0.003 seconds
10-02 16:33 root         DEBUG    Running check: CheckJPackageRequires
10-02 16:33 root         DEBUG        CheckJPackageRequires completed: 0.003 seconds
10-02 16:33 root         DEBUG    Running check: CheckJavadoc
10-02 16:33 root         DEBUG        CheckJavadoc completed: 0.003 seconds
10-02 16:33 root         DEBUG    Running check: CheckJavadocJPackageRequires
10-02 16:33 root         DEBUG        CheckJavadocJPackageRequires completed: 0.003 seconds
10-02 16:33 root         DEBUG    Running check: CheckJavadocdirName
10-02 16:33 root         DEBUG        CheckJavadocdirName completed: 0.003 seconds
10-02 16:33 root         DEBUG    Running check: CheckMvnRpmbuild
10-02 16:33 root         DEBUG        CheckMvnRpmbuild completed: 0.012 seconds
10-02 16:33 root         DEBUG    Running check: CheckNewStyleMaven
10-02 16:33 root         DEBUG        CheckNewStyleMaven completed: 0.000 seconds
10-02 16:33 root         DEBUG    Running check: CheckNoArch
10-02 16:33 root         DEBUG        CheckNoArch completed: 0.002 seconds
10-02 16:33 root         DEBUG    Running check: CheckNoOldMavenDepmap
10-02 16:33 root         DEBUG        CheckNoOldMavenDepmap completed: 0.003 seconds
10-02 16:33 root         DEBUG    Running check: CheckNoRequiresPost
10-02 16:33 root         DEBUG        CheckNoRequiresPost completed: 0.001 seconds
10-02 16:33 root         DEBUG    Running check: CheckNotJavaApplicable
10-02 16:33 root         DEBUG        CheckNotJavaApplicable completed: 0.000 seconds
10-02 16:33 root         DEBUG    Running check: CheckPomInstalled
10-02 16:33 root         DEBUG        CheckPomInstalled completed: 0.002 seconds
10-02 16:33 root         DEBUG    Running check: CheckTestSkip
10-02 16:33 root         DEBUG        CheckTestSkip completed: 0.000 seconds
10-02 16:33 root         DEBUG    Running check: CheckUpdateDepmap
10-02 16:33 root         DEBUG        CheckUpdateDepmap completed: 0.000 seconds
10-02 16:33 root         DEBUG    Running check: CheckUpstremBuildMethod
10-02 16:33 root         DEBUG        CheckUpstremBuildMethod completed: 0.002 seconds
10-02 16:33 root         DEBUG    Running check: CheckUseMavenpomdirMacro
10-02 16:33 root         DEBUG        CheckUseMavenpomdirMacro completed: 0.001 seconds
10-02 16:33 root         DEBUG    Running check: CheckAutotoolsObsoletedMacros
10-02 16:33 root         DEBUG    autotools used: automake
10-02 16:33 root         DEBUG    Adding files in : /var/lib/copr-rpmbuild/results/hpnssh/srpm-unpacked/sshd-suse.pam
10-02 16:33 root         DEBUG    Loaded 1 files
10-02 16:33 root         DEBUG    Adding files in : /var/lib/copr-rpmbuild/results/hpnssh/srpm-unpacked/series
10-02 16:33 root         DEBUG    Loaded 1 files
10-02 16:33 root         DEBUG    Adding files in : /var/lib/copr-rpmbuild/results/hpnssh/srpm-unpacked/hpnsshd.sysuser
10-02 16:33 root         DEBUG    Loaded 1 files
10-02 16:33 root         DEBUG    Adding files in : /var/lib/copr-rpmbuild/results/hpnssh/srpm-unpacked/hpnssh-agent.socket
10-02 16:33 root         DEBUG    Loaded 1 files
10-02 16:33 root         DEBUG    Adding files in : /var/lib/copr-rpmbuild/results/hpnssh/srpm-unpacked/hpnssh-agent.service
10-02 16:33 root         DEBUG    Loaded 1 files
10-02 16:33 root         DEBUG    Adding files in : /var/lib/copr-rpmbuild/results/hpnssh/srpm-unpacked/hpnsshd-keygen.target
10-02 16:33 root         DEBUG    Loaded 1 files
10-02 16:33 root         DEBUG    Adding files in : /var/lib/copr-rpmbuild/results/hpnssh/srpm-unpacked/hpnsshd-keygen
10-02 16:33 root         DEBUG    Loaded 1 files
10-02 16:33 root         DEBUG    Adding files in : /var/lib/copr-rpmbuild/results/hpnssh/srpm-unpacked/hpnsshd-keygen@.service
10-02 16:33 root         DEBUG    Loaded 1 files
10-02 16:33 root         DEBUG    Adding files in : /var/lib/copr-rpmbuild/results/hpnssh/srpm-unpacked/hpnsshd.service
10-02 16:33 root         DEBUG    Loaded 1 files
10-02 16:33 root         DEBUG    Adding files in : /var/lib/copr-rpmbuild/results/hpnssh/srpm-unpacked/hpnsshd.socket
10-02 16:33 root         DEBUG    Loaded 1 files
10-02 16:33 root         DEBUG    Adding files in : /var/lib/copr-rpmbuild/results/hpnssh/srpm-unpacked/hpnsshd@.service
10-02 16:33 root         DEBUG    Loaded 1 files
10-02 16:33 root         DEBUG    Adding files in : /var/lib/copr-rpmbuild/results/hpnssh/srpm-unpacked/hpnsshd.sysconfig
10-02 16:33 root         DEBUG    Loaded 1 files
10-02 16:33 root         DEBUG    Adding files in : /var/lib/copr-rpmbuild/results/hpnssh/srpm-unpacked/hpnssh-keycat.pam
10-02 16:33 root         DEBUG    Loaded 1 files
10-02 16:33 root         DEBUG    Adding files in : /var/lib/copr-rpmbuild/results/hpnssh/upstream/CJR-GPG-KEY.gpg
10-02 16:33 root         DEBUG    Loaded 1 files
10-02 16:33 root         DEBUG    Cannot unpack /var/lib/copr-rpmbuild/results/hpnssh/srpm-unpacked/hpnsshd.pam
10-02 16:33 root         DEBUG    Status: 1, stdout: , stderr: .
10-02 16:33 root         DEBUG    Adding files in : /var/lib/copr-rpmbuild/results/hpnssh/srpm-unpacked/hpnsshd.pam
10-02 16:33 root         DEBUG    Loaded 1 files
10-02 16:33 root         DEBUG    Adding files in : /var/lib/copr-rpmbuild/results/hpnssh/srpm-unpacked/hpnssh-9.9p1_hpn18.6.0.tar.gz.asc
10-02 16:33 root         DEBUG    Loaded 0 files
10-02 16:33 root         DEBUG    Adding files in : /var/lib/copr-rpmbuild/results/hpnssh/srpm-unpacked/hpnssh-9.9p1_hpn18.6.0.tar.gz
10-02 16:33 root         DEBUG    Loaded 0 files
10-02 16:33 root         DEBUG        CheckAutotoolsObsoletedMacros completed: 0.026 seconds
10-02 16:33 root         DEBUG    Running check: fonts-disable
10-02 16:33 root         DEBUG        fonts-disable completed: 0.000 seconds
10-02 16:33 root         DEBUG    Running check: generic-excludearch
10-02 16:33 root         INFO      ExclusiveArch dependency checking disabled, enable with EXARCH flag

10-02 16:33 root         DEBUG        generic-excludearch completed: 0.004 seconds
10-02 16:33 root         DEBUG    Running check: generic-large-docs
10-02 16:33 root         DEBUG        generic-large-docs completed: 0.021 seconds
10-02 16:33 root         DEBUG    Running check: java-check-bundled-jars
10-02 16:33 root         DEBUG        java-check-bundled-jars completed: 0.002 seconds
10-02 16:33 root         DEBUG    Running check: fonts-fc-query
10-02 16:33 root         DEBUG        fonts-fc-query completed: 0.000 seconds
10-02 16:33 root         DEBUG    Running check: fonts-repo-audit
10-02 16:33 root         DEBUG        fonts-repo-audit completed: 0.000 seconds
10-02 16:33 root         DEBUG    Running check: generic-large-data
10-02 16:33 root         DEBUG        generic-large-data completed: 0.013 seconds
10-02 16:33 root         DEBUG    Running check: generic-srv-opt
10-02 16:33 root         DEBUG        generic-srv-opt completed: 0.004 seconds
10-02 16:33 root         DEBUG    Running check: perl-url-tag
10-02 16:33 root         DEBUG        perl-url-tag completed: 0.001 seconds
10-02 16:33 root         DEBUG    Running check: php-compatinfo
10-02 16:33 root         DEBUG        php-compatinfo completed: 0.000 seconds
10-02 16:33 root         DEBUG    Running check: python-check-eggs
10-02 16:33 root         DEBUG        python-check-eggs completed: 0.000 seconds
10-02 16:33 root         DEBUG    Running check: python-dont-download-deps
10-02 16:33 root         DEBUG        python-dont-download-deps completed: 0.001 seconds
10-02 16:33 root         DEBUG    Running check: python-egg-info
10-02 16:33 root         DEBUG        python-egg-info completed: 0.001 seconds
10-02 16:33 root         DEBUG    Running check: python-meet-guidelines
10-02 16:33 root         DEBUG        python-meet-guidelines completed: 0.001 seconds
10-02 16:33 root         DEBUG    Running check: CheckBuildCompilerFlags
10-02 16:33 root         DEBUG        CheckBuildCompilerFlags completed: 0.000 seconds
10-02 16:33 root         DEBUG    Running check: CheckDaemonCompileFlags
10-02 16:33 root         DEBUG        CheckDaemonCompileFlags completed: 0.013 seconds
10-02 16:33 root         DEBUG    Running check: CheckUpdateDesktopDatabase
10-02 16:33 root         DEBUG        CheckUpdateDesktopDatabase completed: 0.001 seconds
10-02 16:33 root         DEBUG    Running check: CheckSystemdScripts
10-02 16:33 root         DEBUG        CheckSystemdScripts completed: 0.000 seconds
10-02 16:33 root         DEBUG    Report completed:  1460.276 seconds