Warning: Permanently added '2620:52:3:1:dead:beef:cafe:c1c9' (ED25519) to the list of known hosts.
You can reproduce this build on your computer by running:
sudo dnf install copr-rpmbuild
/usr/bin/copr-rpmbuild --verbose --drop-resultdir --task-url https://copr.fedorainfracloud.org/backend/get-build-task/7348899-epel-9-x86_64 --chroot epel-9-x86_64
Version: 0.72
PID: 9980
Logging PID: 9981
Task:
{'allow_user_ssh': False,
'appstream': False,
'background': False,
'build_id': 7348899,
'buildroot_pkgs': ['javapackages-tools-compat', 'make'],
'chroot': 'epel-9-x86_64',
'enable_net': True,
'fedora_review': False,
'git_hash': 'a31fe8005cac5d4f4268f69b90f107a18da70fea',
'git_repo': 'https://copr-dist-git.fedorainfracloud.org/git/sbluhm/uyuni-server-releasetest/sitemesh',
'isolation': 'default',
'memory_reqs': 2048,
'modules': {'toggle': [{'enable': 'nodejs:20'}]},
'package_name': 'sitemesh',
'package_version': '2.1-0.12.54.uyuni3',
'project_dirname': 'uyuni-server-releasetest',
'project_name': 'uyuni-server-releasetest',
'project_owner': 'sbluhm',
'repo_priority': None,
'repos': [{'baseurl': 'https://download.copr.fedorainfracloud.org/results/sbluhm/uyuni-server-releasetest/epel-9-x86_64/',
'id': 'copr_base',
'name': 'Copr repository',
'priority': None},
{'baseurl': 'https://download.opensuse.org/repositories/home:/sbluhm:/branches:/systemsmanagement:/Uyuni:/Master/EL_9/',
'id': 'https_download_opensuse_org_repositories_home_sbluhm_branches_systemsmanagement_Uyuni_Master_EL_9',
'name': 'Additional repo '
'https_download_opensuse_org_repositories_home_sbluhm_branches_systemsmanagement_Uyuni_Master_EL_9'},
{'baseurl': 'https://download.opensuse.org/repositories/home:/sbluhm:/branches:/systemsmanagement:/Uyuni:/Master:/Other/EL_9/',
'id': 'https_download_opensuse_org_repositories_home_sbluhm_branches_systemsmanagement_Uyuni_Master_Other_EL_9',
'name': 'Additional repo '
'https_download_opensuse_org_repositories_home_sbluhm_branches_systemsmanagement_Uyuni_Master_Other_EL_9'},
{'baseurl': 'https://download.opensuse.org/repositories/home:/sbluhm:/branches:/systemsmanagement:/Uyuni:/Master:/Other:/EL/EL_9/',
'id': 'https_download_opensuse_org_repositories_home_sbluhm_branches_systemsmanagement_Uyuni_Master_Other_EL_EL_9',
'name': 'Additional repo '
'https_download_opensuse_org_repositories_home_sbluhm_branches_systemsmanagement_Uyuni_Master_Other_EL_EL_9'},
{'baseurl': 'https://raw.githubusercontent.com/sbluhm/spacewalk-support/master/packages/',
'id': 'https_raw_githubusercontent_com_sbluhm_spacewalk_support_master_packages',
'name': 'Additional repo https_raw_githubusercontent_com_sbluhm_spacewalk_support_master_packages'}],
'sandbox': 'sbluhm/uyuni-server-releasetest--sbluhm',
'source_json': {},
'source_type': None,
'ssh_public_keys': None,
'submitter': 'sbluhm',
'tags': [],
'task_id': '7348899-epel-9-x86_64',
'timeout': 18000,
'uses_devel_repo': False,
'with_opts': [],
'without_opts': []}
Running: git clone https://copr-dist-git.fedorainfracloud.org/git/sbluhm/uyuni-server-releasetest/sitemesh /var/lib/copr-rpmbuild/workspace/workdir-ogpg3sbx/sitemesh --depth 500 --no-single-branch --recursive
cmd: ['git', 'clone', 'https://copr-dist-git.fedorainfracloud.org/git/sbluhm/uyuni-server-releasetest/sitemesh', '/var/lib/copr-rpmbuild/workspace/workdir-ogpg3sbx/sitemesh', '--depth', '500', '--no-single-branch', '--recursive']
cwd: .
rc: 0
stdout:
stderr: Cloning into '/var/lib/copr-rpmbuild/workspace/workdir-ogpg3sbx/sitemesh'...
Running: git checkout a31fe8005cac5d4f4268f69b90f107a18da70fea --
cmd: ['git', 'checkout', 'a31fe8005cac5d4f4268f69b90f107a18da70fea', '--']
cwd: /var/lib/copr-rpmbuild/workspace/workdir-ogpg3sbx/sitemesh
rc: 0
stdout:
stderr: Note: switching to 'a31fe8005cac5d4f4268f69b90f107a18da70fea'.
You are in 'detached HEAD' state. You can look around, make experimental
changes and commit them, and you can discard any commits you make in this
state without impacting any branches by switching back to a branch.
If you want to create a new branch to retain commits you create, you may
do so (now or later) by using -c with the switch command. Example:
git switch -c
Or undo this operation with:
git switch -
Turn off this advice by setting config variable advice.detachedHead to false
HEAD is now at a31fe80 automatic import of sitemesh
Running: copr-distgit-client sources
/usr/bin/tail: INFO: Reading stdout from command: curl --help all
INFO: Calling: curl -H Pragma: -o sitemesh-2.1-sources.zip --location --connect-timeout 60 --retry 3 --retry-delay 10 --remote-time --show-error --fail --retry-all-errors https://copr-dist-git.fedorainfracloud.org/repo/pkgs/sbluhm/uyuni-server-releasetest/sitemesh/sitemesh-2.1-sources.zip/md5/dde3f9c3df1846e6d99c815849435420/sitemesh-2.1-sources.zip
/var/lib/copr-rpmbuild/main.log: file truncated
% Total % Received % Xferd Average Speed Time Time Time Current
Dload Upload Total Spent Left Speed
100 2773k 100 2773k 0 0 18.8M 0 --:--:-- --:--:-- --:--:-- 18.9M
INFO: Reading stdout from command: md5sum sitemesh-2.1-sources.zip
Running (timeout=18000): unbuffer mock --spec /var/lib/copr-rpmbuild/workspace/workdir-ogpg3sbx/sitemesh/sitemesh.spec --sources /var/lib/copr-rpmbuild/workspace/workdir-ogpg3sbx/sitemesh --resultdir /var/lib/copr-rpmbuild/results --uniqueext 1714022811.608410 -r /var/lib/copr-rpmbuild/results/configs/child.cfg
INFO: mock.py version 5.5 starting (python version = 3.12.1, NVR = mock-5.5-1.fc39), args: /usr/libexec/mock/mock --spec /var/lib/copr-rpmbuild/workspace/workdir-ogpg3sbx/sitemesh/sitemesh.spec --sources /var/lib/copr-rpmbuild/workspace/workdir-ogpg3sbx/sitemesh --resultdir /var/lib/copr-rpmbuild/results --uniqueext 1714022811.608410 -r /var/lib/copr-rpmbuild/results/configs/child.cfg
Start(bootstrap): init plugins
INFO: tmpfs initialized
INFO: selinux enabled
INFO: chroot_scan: initialized
INFO: compress_logs: initialized
Finish(bootstrap): init plugins
Start: init plugins
INFO: tmpfs initialized
INFO: selinux enabled
INFO: chroot_scan: initialized
INFO: compress_logs: initialized
Finish: init plugins
INFO: Signal handler active
Start: run
INFO: Start(/var/lib/copr-rpmbuild/workspace/workdir-ogpg3sbx/sitemesh/sitemesh.spec) Config(rhel+epel-9-x86_64)
Start: clean chroot
Finish: clean chroot
Mock Version: 5.5
INFO: Mock Version: 5.5
Start(bootstrap): chroot init
INFO: mounting tmpfs at /var/lib/mock/rhel+epel-9-x86_64-bootstrap-1714022811.608410/root.
INFO: calling preinit hooks
INFO: enabled root cache
INFO: enabled package manager cache
Start(bootstrap): cleaning package manager metadata
Finish(bootstrap): cleaning package manager metadata
INFO: Guessed host environment type: unknown
INFO: Using bootstrap image: registry.access.redhat.com/ubi9/ubi
INFO: Pulling image: registry.access.redhat.com/ubi9/ubi
INFO: Copy content of container registry.access.redhat.com/ubi9/ubi to /var/lib/mock/rhel+epel-9-x86_64-bootstrap-1714022811.608410/root
INFO: Checking that registry.access.redhat.com/ubi9/ubi image matches host's architecture
INFO: mounting registry.access.redhat.com/ubi9/ubi with podman image mount
INFO: image registry.access.redhat.com/ubi9/ubi as /var/lib/containers/storage/overlay/797935172f3203db6f4f21a5a7e377a375701b34693a5a68b5813722d90c7601/merged
INFO: umounting image registry.access.redhat.com/ubi9/ubi (/var/lib/containers/storage/overlay/797935172f3203db6f4f21a5a7e377a375701b34693a5a68b5813722d90c7601/merged) with podman image umount
INFO: Package manager dnf detected and used (fallback)
INFO: Not updating bootstrap chroot, bootstrap_image_ready=True
Start(bootstrap): creating root cache
Finish(bootstrap): creating root cache
Finish(bootstrap): chroot init
Start: chroot init
INFO: mounting tmpfs at /var/lib/mock/rhel+epel-9-x86_64-1714022811.608410/root.
INFO: calling preinit hooks
INFO: enabled root cache
INFO: enabled package manager cache
Start: cleaning package manager metadata
Finish: cleaning package manager metadata
INFO: enabled HW Info plugin
INFO: Package manager dnf detected and used (direct choice)
INFO: Buildroot is handled by package management downloaded with a bootstrap image:
rpm-4.16.1.3-27.el9_3.x86_64
python3-dnf-4.14.0-8.el9.noarch
python3-dnf-plugins-core-4.3.0-11.el9_3.noarch
yum-4.14.0-8.el9.noarch
Start: installing minimal buildroot with dnf
No matches found for the following disable plugin patterns: local, spacewalk, versionlock
Updating Subscription Management repositories.
Unable to read consumer identity
This system is not registered with an entitlement server. You can use subscription-manager to register.
Copr repository 31 kB/s | 1.8 kB 00:00
Copr repository 392 kB/s | 60 kB 00:00
Additional repo https_download_opensuse_org_rep 5.1 kB/s | 1.7 kB 00:00
Additional repo https_download_opensuse_org_rep 5.1 kB/s | 1.7 kB 00:00
Additional repo https_download_opensuse_org_rep 5.1 kB/s | 1.7 kB 00:00
Additional repo https_raw_githubusercontent_com 40 kB/s | 3.0 kB 00:00
Red Hat Enterprise Linux - BaseOS 18 kB/s | 4.1 kB 00:00
Red Hat Enterprise Linux - AppStream 19 kB/s | 4.5 kB 00:00
Red Hat Enterprise Linux - CodeReady Linux Buil 18 kB/s | 4.5 kB 00:00
Extra Packages for Enterprise Linux 9 - x86_64 75 kB/s | 9.7 kB 00:00
Dependencies resolved.
================================================================================
Package Architecture Version Repository Size
================================================================================
Enabling module streams:
nodejs 20
Transaction Summary
================================================================================
Complete!
No matches found for the following disable plugin patterns: local, spacewalk, versionlock
Updating Subscription Management repositories.
Unable to read consumer identity
This system is not registered with an entitlement server. You can use subscription-manager to register.
Copr repository 23 kB/s | 1.8 kB 00:00
Copr repository 343 kB/s | 61 kB 00:00
Additional repo https_download_opensuse_org_rep 5.0 kB/s | 1.7 kB 00:00
Additional repo https_download_opensuse_org_rep 4.9 kB/s | 1.7 kB 00:00
Additional repo https_download_opensuse_org_rep 5.1 kB/s | 1.7 kB 00:00
Additional repo https_raw_githubusercontent_com 45 kB/s | 3.0 kB 00:00
Red Hat Enterprise Linux - BaseOS 29 kB/s | 4.1 kB 00:00
Red Hat Enterprise Linux - AppStream 29 kB/s | 4.5 kB 00:00
Red Hat Enterprise Linux - CodeReady Linux Buil 33 kB/s | 4.5 kB 00:00
Extra Packages for Enterprise Linux 9 - x86_64 27 kB/s | 9.7 kB 00:00
Dependencies resolved.
================================================================================
Package Arch Version Repo Size
================================================================================
Installing:
bash x86_64 5.1.8-6.el9_1 baseos 1.7 M
bzip2 x86_64 1.0.8-8.el9 baseos 60 k
coreutils x86_64 8.32-34.el9 baseos 1.2 M
cpio x86_64 2.13-16.el9 baseos 279 k
diffutils x86_64 3.7-12.el9 baseos 402 k
epel-rpm-macros noarch 9-14.el9 epel 15 k
findutils x86_64 1:4.8.0-6.el9 baseos 550 k
gawk x86_64 5.1.0-6.el9 baseos 1.0 M
glibc-minimal-langpack x86_64 2.34-83.el9_3.12 baseos 31 k
grep x86_64 3.6-5.el9 baseos 273 k
gzip x86_64 1.12-1.el9 baseos 167 k
info x86_64 6.7-15.el9 baseos 228 k
patch x86_64 2.7.6-16.el9 appstream 130 k
redhat-release x86_64 9.3-0.5.el9 baseos 44 k
redhat-rpm-config noarch 201-1.el9 appstream 76 k
rpm-build x86_64 4.16.1.3-27.el9_3 appstream 70 k
sed x86_64 4.8-9.el9 baseos 309 k
tar x86_64 2:1.34-6.el9_1 baseos 889 k
unzip x86_64 6.0-56.el9 baseos 186 k
util-linux x86_64 2.37.4-15.el9 baseos 2.3 M
which x86_64 2.21-29.el9 baseos 45 k
xz x86_64 5.2.5-8.el9_0 baseos 230 k
Installing dependencies:
alternatives x86_64 1.24-1.el9 baseos 42 k
ansible-srpm-macros noarch 1-12.el9 epel 21 k
audit-libs x86_64 3.0.7-104.el9 baseos 120 k
basesystem noarch 11-13.el9 baseos 8.0 k
binutils x86_64 2.35.2-42.el9_3.1 baseos 4.6 M
binutils-gold x86_64 2.35.2-42.el9_3.1 baseos 734 k
bzip2-libs x86_64 1.0.8-8.el9 baseos 42 k
ca-certificates noarch 2023.2.60_v7.0.306-90.1.el9_2 baseos 846 k
coreutils-common x86_64 8.32-34.el9 baseos 2.0 M
cracklib x86_64 2.9.6-27.el9 baseos 99 k
cracklib-dicts x86_64 2.9.6-27.el9 baseos 3.6 M
crypto-policies noarch 20230731-1.git94f0e2c.el9_3.1 baseos 87 k
curl x86_64 7.76.1-26.el9_3.3 baseos 298 k
cyrus-sasl-lib x86_64 2.1.27-21.el9 baseos 774 k
debugedit x86_64 5.0-4.el9 appstream 81 k
dwz x86_64 0.14-3.el9 appstream 130 k
ed x86_64 1.14.2-12.el9 baseos 78 k
efi-srpm-macros noarch 6-2.el9_0 appstream 24 k
elfutils x86_64 0.189-3.el9 baseos 540 k
elfutils-debuginfod-client
x86_64 0.189-3.el9 baseos 39 k
elfutils-default-yama-scope
noarch 0.189-3.el9 baseos 13 k
elfutils-libelf x86_64 0.189-3.el9 baseos 196 k
elfutils-libs x86_64 0.189-3.el9 baseos 258 k
file x86_64 5.39-14.el9 baseos 52 k
file-libs x86_64 5.39-14.el9 baseos 593 k
filesystem x86_64 3.16-2.el9 baseos 4.7 M
fonts-srpm-macros noarch 1:2.0.5-7.el9.1 appstream 29 k
forge-srpm-macros noarch 0.3.1-1.el9 epel 19 k
fpc-srpm-macros noarch 1.3-7.el9 epel 7.5 k
gdb-minimal x86_64 10.2-11.1.el9_3 appstream 3.5 M
gdbm-libs x86_64 1:1.19-4.el9 baseos 56 k
ghc-srpm-macros noarch 1.5.0-6.el9 appstream 9.0 k
glibc x86_64 2.34-83.el9_3.12 baseos 1.9 M
glibc-common x86_64 2.34-83.el9_3.12 baseos 315 k
glibc-gconv-extra x86_64 2.34-83.el9_3.12 baseos 1.7 M
gmp x86_64 1:6.2.0-13.el9 baseos 319 k
go-srpm-macros noarch 3.2.0-2.el9 appstream 28 k
go-srpm-macros-epel noarch 3.3.0.5-1.el9 epel 27 k
groff-base x86_64 1.22.4-10.el9 baseos 1.1 M
kernel-srpm-macros noarch 1.0-13.el9 appstream 17 k
keyutils-libs x86_64 1.6.3-1.el9 baseos 34 k
krb5-libs x86_64 1.21.1-1.el9 baseos 770 k
libacl x86_64 2.3.1-3.el9 baseos 26 k
libarchive x86_64 3.5.3-4.el9 baseos 392 k
libattr x86_64 2.5.1-3.el9 baseos 20 k
libblkid x86_64 2.37.4-15.el9 baseos 110 k
libbrotli x86_64 1.0.9-6.el9 baseos 317 k
libcap x86_64 2.48-9.el9_2 baseos 74 k
libcap-ng x86_64 0.8.2-7.el9 baseos 36 k
libcom_err x86_64 1.46.5-3.el9 baseos 29 k
libcurl x86_64 7.76.1-26.el9_3.3 baseos 286 k
libdb x86_64 5.3.28-53.el9 baseos 740 k
libeconf x86_64 0.4.1-3.el9_2 baseos 30 k
libevent x86_64 2.1.12-6.el9 baseos 268 k
libfdisk x86_64 2.37.4-15.el9 baseos 157 k
libffi x86_64 3.4.2-8.el9 baseos 40 k
libgcc x86_64 11.4.1-2.1.el9 baseos 98 k
libgcrypt x86_64 1.10.0-10.el9_2 baseos 508 k
libgomp x86_64 11.4.1-2.1.el9 baseos 273 k
libgpg-error x86_64 1.42-5.el9 baseos 220 k
libidn2 x86_64 2.3.0-7.el9 baseos 105 k
libmount x86_64 2.37.4-15.el9 baseos 136 k
libnghttp2 x86_64 1.43.0-5.el9_3.1 baseos 75 k
libpkgconf x86_64 1.7.3-10.el9 baseos 37 k
libpsl x86_64 0.21.1-5.el9 baseos 66 k
libpwquality x86_64 1.4.4-8.el9 baseos 123 k
libselinux x86_64 3.5-1.el9 baseos 88 k
libsemanage x86_64 3.5-2.el9 baseos 121 k
libsepol x86_64 3.5-1.el9 baseos 317 k
libsigsegv x86_64 2.13-4.el9 baseos 30 k
libsmartcols x86_64 2.37.4-15.el9 baseos 66 k
libssh x86_64 0.10.4-12.el9_3 baseos 218 k
libssh-config noarch 0.10.4-12.el9_3 baseos 11 k
libstdc++ x86_64 11.4.1-2.1.el9 baseos 744 k
libtasn1 x86_64 4.16.0-8.el9_1 baseos 77 k
libunistring x86_64 0.9.10-15.el9 baseos 499 k
libutempter x86_64 1.2.1-6.el9 baseos 30 k
libuuid x86_64 2.37.4-15.el9 baseos 31 k
libverto x86_64 0.3.2-3.el9 baseos 24 k
libxcrypt x86_64 4.4.18-3.el9 baseos 120 k
libxml2 x86_64 2.9.13-5.el9_3 baseos 751 k
libzstd x86_64 1.5.1-2.el9 baseos 332 k
lua-libs x86_64 5.4.4-4.el9 baseos 132 k
lua-srpm-macros noarch 1-6.el9 appstream 10 k
lz4-libs x86_64 1.9.3-5.el9 baseos 69 k
mpfr x86_64 4.1.0-7.el9 baseos 329 k
ncurses x86_64 6.2-10.20210508.el9 baseos 410 k
ncurses-base noarch 6.2-10.20210508.el9 baseos 99 k
ncurses-libs x86_64 6.2-10.20210508.el9 baseos 332 k
ocaml-srpm-macros noarch 6-6.el9 appstream 9.1 k
openblas-srpm-macros noarch 2-11.el9 appstream 8.6 k
openldap x86_64 2.6.3-1.el9 baseos 287 k
openssl x86_64 1:3.0.7-25.el9_3 baseos 1.2 M
openssl-libs x86_64 1:3.0.7-25.el9_3 baseos 2.2 M
p11-kit x86_64 0.24.1-2.el9 baseos 387 k
p11-kit-trust x86_64 0.24.1-2.el9 baseos 148 k
pam x86_64 1.5.1-15.el9 baseos 623 k
pcre x86_64 8.44-3.el9.3 baseos 202 k
pcre2 x86_64 10.40-2.el9 baseos 239 k
pcre2-syntax noarch 10.40-2.el9 baseos 147 k
perl-AutoLoader noarch 5.74-480.el9 appstream 23 k
perl-B x86_64 1.80-480.el9 appstream 185 k
perl-Carp noarch 1.50-460.el9 appstream 31 k
perl-Class-Struct noarch 0.66-480.el9 appstream 24 k
perl-Data-Dumper x86_64 2.174-462.el9 appstream 59 k
perl-Digest noarch 1.19-4.el9 appstream 29 k
perl-Digest-MD5 x86_64 2.58-4.el9 appstream 39 k
perl-Encode x86_64 4:3.08-462.el9 appstream 1.7 M
perl-Errno x86_64 1.30-480.el9 appstream 17 k
perl-Exporter noarch 5.74-461.el9 appstream 34 k
perl-Fcntl x86_64 1.13-480.el9 appstream 23 k
perl-File-Basename noarch 2.85-480.el9 appstream 19 k
perl-File-Path noarch 2.18-4.el9 appstream 38 k
perl-File-Temp noarch 1:0.231.100-4.el9 appstream 63 k
perl-File-stat noarch 1.09-480.el9 appstream 19 k
perl-FileHandle noarch 2.03-480.el9 appstream 17 k
perl-Getopt-Long noarch 1:2.52-4.el9 appstream 64 k
perl-Getopt-Std noarch 1.12-480.el9 appstream 17 k
perl-HTTP-Tiny noarch 0.076-461.el9 appstream 57 k
perl-IO x86_64 1.43-480.el9 appstream 94 k
perl-IO-Socket-IP noarch 0.41-5.el9 appstream 45 k
perl-IO-Socket-SSL noarch 2.073-1.el9 appstream 223 k
perl-IPC-Open3 noarch 1.21-480.el9 appstream 25 k
perl-MIME-Base64 x86_64 3.16-4.el9 appstream 34 k
perl-Mozilla-CA noarch 20200520-6.el9 appstream 14 k
perl-Net-SSLeay x86_64 1.92-2.el9 appstream 392 k
perl-POSIX x86_64 1.94-480.el9 appstream 99 k
perl-PathTools x86_64 3.78-461.el9 appstream 92 k
perl-Pod-Escapes noarch 1:1.07-460.el9 appstream 22 k
perl-Pod-Perldoc noarch 3.28.01-461.el9 appstream 92 k
perl-Pod-Simple noarch 1:3.42-4.el9 appstream 229 k
perl-Pod-Usage noarch 4:2.01-4.el9 appstream 43 k
perl-Scalar-List-Utils x86_64 4:1.56-461.el9 appstream 77 k
perl-SelectSaver noarch 1.02-480.el9 appstream 13 k
perl-Socket x86_64 4:2.031-4.el9 appstream 58 k
perl-Storable x86_64 1:3.21-460.el9 appstream 98 k
perl-Symbol noarch 1.08-480.el9 appstream 16 k
perl-Term-ANSIColor noarch 5.01-461.el9 appstream 51 k
perl-Term-Cap noarch 1.17-460.el9 appstream 24 k
perl-Text-ParseWords noarch 3.30-460.el9 appstream 18 k
perl-Text-Tabs+Wrap noarch 2013.0523-460.el9 appstream 25 k
perl-Time-Local noarch 2:1.300-7.el9 appstream 37 k
perl-URI noarch 5.09-3.el9 appstream 125 k
perl-base noarch 2.27-480.el9 appstream 18 k
perl-constant noarch 1.33-461.el9 appstream 25 k
perl-if noarch 0.60.800-480.el9 appstream 16 k
perl-interpreter x86_64 4:5.32.1-480.el9 appstream 75 k
perl-libnet noarch 3.13-4.el9 appstream 134 k
perl-libs x86_64 4:5.32.1-480.el9 appstream 2.2 M
perl-mro x86_64 1.23-480.el9 appstream 31 k
perl-overload noarch 1.31-480.el9 appstream 47 k
perl-overloading noarch 0.02-480.el9 appstream 15 k
perl-parent noarch 1:0.238-460.el9 appstream 16 k
perl-podlators noarch 1:4.14-460.el9 appstream 118 k
perl-srpm-macros noarch 1-41.el9 appstream 9.4 k
perl-subs noarch 1.03-480.el9 appstream 13 k
perl-vars noarch 1.05-480.el9 appstream 15 k
pkgconf x86_64 1.7.3-10.el9 baseos 45 k
pkgconf-m4 noarch 1.7.3-10.el9 baseos 16 k
pkgconf-pkg-config x86_64 1.7.3-10.el9 baseos 12 k
popt x86_64 1.18-8.el9 baseos 69 k
publicsuffix-list-dafsa noarch 20210518-3.el9 baseos 59 k
pyproject-srpm-macros noarch 1.9.0-1.el9 appstream 16 k
python-srpm-macros noarch 3.9-52.el9 appstream 24 k
qt5-srpm-macros noarch 5.15.9-1.el9 appstream 9.1 k
qt6-srpm-macros noarch 6.5.2-3.el9 epel 8.9 k
readline x86_64 8.1-4.el9 baseos 215 k
rpm x86_64 4.16.1.3-27.el9_3 baseos 541 k
rpm-build-libs x86_64 4.16.1.3-27.el9_3 baseos 90 k
rpm-libs x86_64 4.16.1.3-27.el9_3 baseos 310 k
rpmautospec-rpm-macros noarch 0.6.3-1.el9 epel 9.9 k
rust-srpm-macros noarch 17-4.el9 appstream 11 k
rust-srpm-macros-epel noarch 26.2-1.el9 epel 10 k
setup noarch 2.13.7-9.el9 baseos 150 k
shadow-utils x86_64 2:4.9-8.el9 baseos 1.2 M
sqlite-libs x86_64 3.34.1-7.el9_3 baseos 622 k
systemd-libs x86_64 252-18.el9 baseos 659 k
tzdata noarch 2024a-1.el9 baseos 842 k
util-linux-core x86_64 2.37.4-15.el9 baseos 466 k
xz-libs x86_64 5.2.5-8.el9_0 baseos 94 k
zip x86_64 3.0-35.el9 baseos 270 k
zlib x86_64 1.2.11-40.el9 baseos 93 k
zstd x86_64 1.5.1-2.el9 baseos 552 k
Transaction Summary
================================================================================
Install 205 Packages
Total size: 67 M
Installed size: 213 M
Downloading Packages:
[SKIPPED] basesystem-11-13.el9.noarch.rpm: Already downloaded
[SKIPPED] bzip2-1.0.8-8.el9.x86_64.rpm: Already downloaded
[SKIPPED] bzip2-libs-1.0.8-8.el9.x86_64.rpm: Already downloaded
[SKIPPED] cpio-2.13-16.el9.x86_64.rpm: Already downloaded
[SKIPPED] cracklib-2.9.6-27.el9.x86_64.rpm: Already downloaded
[SKIPPED] ed-1.14.2-12.el9.x86_64.rpm: Already downloaded
[SKIPPED] filesystem-3.16-2.el9.x86_64.rpm: Already downloaded
[SKIPPED] grep-3.6-5.el9.x86_64.rpm: Already downloaded
[SKIPPED] groff-base-1.22.4-10.el9.x86_64.rpm: Already downloaded
[SKIPPED] info-6.7-15.el9.x86_64.rpm: Already downloaded
[SKIPPED] libacl-2.3.1-3.el9.x86_64.rpm: Already downloaded
[SKIPPED] libattr-2.5.1-3.el9.x86_64.rpm: Already downloaded
[SKIPPED] libbrotli-1.0.9-6.el9.x86_64.rpm: Already downloaded
[SKIPPED] libcap-ng-0.8.2-7.el9.x86_64.rpm: Already downloaded
[SKIPPED] libdb-5.3.28-53.el9.x86_64.rpm: Already downloaded
[SKIPPED] libevent-2.1.12-6.el9.x86_64.rpm: Already downloaded
[SKIPPED] libgpg-error-1.42-5.el9.x86_64.rpm: Already downloaded
[SKIPPED] libidn2-2.3.0-7.el9.x86_64.rpm: Already downloaded
[SKIPPED] libpsl-0.21.1-5.el9.x86_64.rpm: Already downloaded
[SKIPPED] libpwquality-1.4.4-8.el9.x86_64.rpm: Already downloaded
[SKIPPED] libsigsegv-2.13-4.el9.x86_64.rpm: Already downloaded
[SKIPPED] libunistring-0.9.10-15.el9.x86_64.rpm: Already downloaded
[SKIPPED] libutempter-1.2.1-6.el9.x86_64.rpm: Already downloaded
[SKIPPED] libverto-0.3.2-3.el9.x86_64.rpm: Already downloaded
[SKIPPED] libxcrypt-4.4.18-3.el9.x86_64.rpm: Already downloaded
[SKIPPED] libzstd-1.5.1-2.el9.x86_64.rpm: Already downloaded
[SKIPPED] lz4-libs-1.9.3-5.el9.x86_64.rpm: Already downloaded
[SKIPPED] mpfr-4.1.0-7.el9.x86_64.rpm: Already downloaded
[SKIPPED] p11-kit-0.24.1-2.el9.x86_64.rpm: Already downloaded
[SKIPPED] pcre-8.44-3.el9.3.x86_64.rpm: Already downloaded
[SKIPPED] popt-1.18-8.el9.x86_64.rpm: Already downloaded
[SKIPPED] publicsuffix-list-dafsa-20210518-3.el9.noarch.rpm: Already downloaded
[SKIPPED] readline-8.1-4.el9.x86_64.rpm: Already downloaded
[SKIPPED] sed-4.8-9.el9.x86_64.rpm: Already downloaded
[SKIPPED] unzip-6.0-56.el9.x86_64.rpm: Already downloaded
[SKIPPED] cracklib-dicts-2.9.6-27.el9.x86_64.rpm: Already downloaded
[SKIPPED] diffutils-3.7-12.el9.x86_64.rpm: Already downloaded
[SKIPPED] gawk-5.1.0-6.el9.x86_64.rpm: Already downloaded
[SKIPPED] gdbm-libs-1.19-4.el9.x86_64.rpm: Already downloaded
[SKIPPED] libcom_err-1.46.5-3.el9.x86_64.rpm: Already downloaded
[SKIPPED] p11-kit-trust-0.24.1-2.el9.x86_64.rpm: Already downloaded
[SKIPPED] pcre2-syntax-10.40-2.el9.noarch.rpm: Already downloaded
[SKIPPED] xz-5.2.5-8.el9_0.x86_64.rpm: Already downloaded
[SKIPPED] xz-libs-5.2.5-8.el9_0.x86_64.rpm: Already downloaded
[SKIPPED] zstd-1.5.1-2.el9.x86_64.rpm: Already downloaded
[SKIPPED] bash-5.1.8-6.el9_1.x86_64.rpm: Already downloaded
[SKIPPED] cyrus-sasl-lib-2.1.27-21.el9.x86_64.rpm: Already downloaded
[SKIPPED] gzip-1.12-1.el9.x86_64.rpm: Already downloaded
[SKIPPED] libselinux-3.5-1.el9.x86_64.rpm: Already downloaded
[SKIPPED] libtasn1-4.16.0-8.el9_1.x86_64.rpm: Already downloaded
[SKIPPED] pcre2-10.40-2.el9.x86_64.rpm: Already downloaded
[SKIPPED] tar-1.34-6.el9_1.x86_64.rpm: Already downloaded
[SKIPPED] ca-certificates-2023.2.60_v7.0.306-90.1.el9_2.noarch.rpm: Already downloaded
[SKIPPED] coreutils-8.32-34.el9.x86_64.rpm: Already downloaded
[SKIPPED] coreutils-common-8.32-34.el9.x86_64.rpm: Already downloaded
[SKIPPED] keyutils-libs-1.6.3-1.el9.x86_64.rpm: Already downloaded
[SKIPPED] libarchive-3.5.3-4.el9.x86_64.rpm: Already downloaded
[SKIPPED] libcap-2.48-9.el9_2.x86_64.rpm: Already downloaded
[SKIPPED] libeconf-0.4.1-3.el9_2.x86_64.rpm: Already downloaded
[SKIPPED] libgcrypt-1.10.0-10.el9_2.x86_64.rpm: Already downloaded
[SKIPPED] libpkgconf-1.7.3-10.el9.x86_64.rpm: Already downloaded
[SKIPPED] libsepol-3.5-1.el9.x86_64.rpm: Already downloaded
[SKIPPED] pkgconf-1.7.3-10.el9.x86_64.rpm: Already downloaded
[SKIPPED] pkgconf-m4-1.7.3-10.el9.noarch.rpm: Already downloaded
[SKIPPED] pkgconf-pkg-config-1.7.3-10.el9.x86_64.rpm: Already downloaded
[SKIPPED] setup-2.13.7-9.el9.noarch.rpm: Already downloaded
[SKIPPED] zip-3.0-35.el9.x86_64.rpm: Already downloaded
[SKIPPED] alternatives-1.24-1.el9.x86_64.rpm: Already downloaded
[SKIPPED] audit-libs-3.0.7-104.el9.x86_64.rpm: Already downloaded
[SKIPPED] crypto-policies-20230731-1.git94f0e2c.el9_3.1.noarch.rpm: Already downloaded
[SKIPPED] elfutils-0.189-3.el9.x86_64.rpm: Already downloaded
[SKIPPED] elfutils-debuginfod-client-0.189-3.el9.x86_64.rpm: Already downloaded
[SKIPPED] elfutils-default-yama-scope-0.189-3.el9.noarch.rpm: Already downloaded
[SKIPPED] elfutils-libelf-0.189-3.el9.x86_64.rpm: Already downloaded
[SKIPPED] elfutils-libs-0.189-3.el9.x86_64.rpm: Already downloaded
[SKIPPED] file-5.39-14.el9.x86_64.rpm: Already downloaded
[SKIPPED] file-libs-5.39-14.el9.x86_64.rpm: Already downloaded
[SKIPPED] findutils-4.8.0-6.el9.x86_64.rpm: Already downloaded
[SKIPPED] gmp-6.2.0-13.el9.x86_64.rpm: Already downloaded
[SKIPPED] krb5-libs-1.21.1-1.el9.x86_64.rpm: Already downloaded
[SKIPPED] libblkid-2.37.4-15.el9.x86_64.rpm: Already downloaded
[SKIPPED] libfdisk-2.37.4-15.el9.x86_64.rpm: Already downloaded
[SKIPPED] libffi-3.4.2-8.el9.x86_64.rpm: Already downloaded
[SKIPPED] libgcc-11.4.1-2.1.el9.x86_64.rpm: Already downloaded
[SKIPPED] libgomp-11.4.1-2.1.el9.x86_64.rpm: Already downloaded
[SKIPPED] libmount-2.37.4-15.el9.x86_64.rpm: Already downloaded
[SKIPPED] libnghttp2-1.43.0-5.el9_3.1.x86_64.rpm: Already downloaded
[SKIPPED] libsemanage-3.5-2.el9.x86_64.rpm: Already downloaded
[SKIPPED] libsmartcols-2.37.4-15.el9.x86_64.rpm: Already downloaded
[SKIPPED] libstdc++-11.4.1-2.1.el9.x86_64.rpm: Already downloaded
[SKIPPED] libuuid-2.37.4-15.el9.x86_64.rpm: Already downloaded
[SKIPPED] lua-libs-5.4.4-4.el9.x86_64.rpm: Already downloaded
[SKIPPED] ncurses-6.2-10.20210508.el9.x86_64.rpm: Already downloaded
[SKIPPED] ncurses-base-6.2-10.20210508.el9.noarch.rpm: Already downloaded
[SKIPPED] ncurses-libs-6.2-10.20210508.el9.x86_64.rpm: Already downloaded
[SKIPPED] openldap-2.6.3-1.el9.x86_64.rpm: Already downloaded
[SKIPPED] pam-1.5.1-15.el9.x86_64.rpm: Already downloaded
[SKIPPED] redhat-release-9.3-0.5.el9.x86_64.rpm: Already downloaded
[SKIPPED] shadow-utils-4.9-8.el9.x86_64.rpm: Already downloaded
[SKIPPED] systemd-libs-252-18.el9.x86_64.rpm: Already downloaded
[SKIPPED] util-linux-2.37.4-15.el9.x86_64.rpm: Already downloaded
[SKIPPED] util-linux-core-2.37.4-15.el9.x86_64.rpm: Already downloaded
[SKIPPED] which-2.21-29.el9.x86_64.rpm: Already downloaded
[SKIPPED] zlib-1.2.11-40.el9.x86_64.rpm: Already downloaded
[SKIPPED] libxml2-2.9.13-5.el9_3.x86_64.rpm: Already downloaded
[SKIPPED] openssl-3.0.7-25.el9_3.x86_64.rpm: Already downloaded
[SKIPPED] openssl-libs-3.0.7-25.el9_3.x86_64.rpm: Already downloaded
[SKIPPED] rpm-4.16.1.3-27.el9_3.x86_64.rpm: Already downloaded
[SKIPPED] rpm-build-libs-4.16.1.3-27.el9_3.x86_64.rpm: Already downloaded
[SKIPPED] rpm-libs-4.16.1.3-27.el9_3.x86_64.rpm: Already downloaded
[SKIPPED] sqlite-libs-3.34.1-7.el9_3.x86_64.rpm: Already downloaded
[SKIPPED] tzdata-2024a-1.el9.noarch.rpm: Already downloaded
[SKIPPED] binutils-2.35.2-42.el9_3.1.x86_64.rpm: Already downloaded
[SKIPPED] binutils-gold-2.35.2-42.el9_3.1.x86_64.rpm: Already downloaded
[SKIPPED] curl-7.76.1-26.el9_3.3.x86_64.rpm: Already downloaded
[SKIPPED] glibc-2.34-83.el9_3.12.x86_64.rpm: Already downloaded
[SKIPPED] glibc-common-2.34-83.el9_3.12.x86_64.rpm: Already downloaded
[SKIPPED] glibc-gconv-extra-2.34-83.el9_3.12.x86_64.rpm: Already downloaded
[SKIPPED] glibc-minimal-langpack-2.34-83.el9_3.12.x86_64.rpm: Already downloaded
[SKIPPED] libcurl-7.76.1-26.el9_3.3.x86_64.rpm: Already downloaded
[SKIPPED] libssh-0.10.4-12.el9_3.x86_64.rpm: Already downloaded
[SKIPPED] libssh-config-0.10.4-12.el9_3.noarch.rpm: Already downloaded
[SKIPPED] ghc-srpm-macros-1.5.0-6.el9.noarch.rpm: Already downloaded
[SKIPPED] lua-srpm-macros-1-6.el9.noarch.rpm: Already downloaded
[SKIPPED] perl-Data-Dumper-2.174-462.el9.x86_64.rpm: Already downloaded
[SKIPPED] perl-Digest-MD5-2.58-4.el9.x86_64.rpm: Already downloaded
[SKIPPED] perl-Encode-3.08-462.el9.x86_64.rpm: Already downloaded
[SKIPPED] perl-IO-Socket-SSL-2.073-1.el9.noarch.rpm: Already downloaded
[SKIPPED] perl-Mozilla-CA-20200520-6.el9.noarch.rpm: Already downloaded
[SKIPPED] perl-Pod-Simple-3.42-4.el9.noarch.rpm: Already downloaded
[SKIPPED] perl-Term-Cap-1.17-460.el9.noarch.rpm: Already downloaded
[SKIPPED] perl-Time-Local-1.300-7.el9.noarch.rpm: Already downloaded
[SKIPPED] rust-srpm-macros-17-4.el9.noarch.rpm: Already downloaded
[SKIPPED] perl-Pod-Escapes-1.07-460.el9.noarch.rpm: Already downloaded
[SKIPPED] perl-Storable-3.21-460.el9.x86_64.rpm: Already downloaded
[SKIPPED] perl-podlators-4.14-460.el9.noarch.rpm: Already downloaded
[SKIPPED] python-srpm-macros-3.9-52.el9.noarch.rpm: Already downloaded
[SKIPPED] dwz-0.14-3.el9.x86_64.rpm: Already downloaded
[SKIPPED] perl-Exporter-5.74-461.el9.noarch.rpm: Already downloaded
[SKIPPED] perl-File-Temp-0.231.100-4.el9.noarch.rpm: Already downloaded
[SKIPPED] perl-Getopt-Long-2.52-4.el9.noarch.rpm: Already downloaded
[SKIPPED] perl-MIME-Base64-3.16-4.el9.x86_64.rpm: Already downloaded
[SKIPPED] perl-Text-Tabs+Wrap-2013.0523-460.el9.noarch.rpm: Already downloaded
[SKIPPED] perl-parent-0.238-460.el9.noarch.rpm: Already downloaded
[SKIPPED] perl-srpm-macros-1-41.el9.noarch.rpm: Already downloaded
[SKIPPED] efi-srpm-macros-6-2.el9_0.noarch.rpm: Already downloaded
[SKIPPED] openblas-srpm-macros-2-11.el9.noarch.rpm: Already downloaded
[SKIPPED] perl-Digest-1.19-4.el9.noarch.rpm: Already downloaded
[SKIPPED] perl-File-Path-2.18-4.el9.noarch.rpm: Already downloaded
[SKIPPED] perl-IO-Socket-IP-0.41-5.el9.noarch.rpm: Already downloaded
[SKIPPED] perl-Pod-Usage-2.01-4.el9.noarch.rpm: Already downloaded
[SKIPPED] perl-Scalar-List-Utils-1.56-461.el9.x86_64.rpm: Already downloaded
[SKIPPED] perl-Socket-2.031-4.el9.x86_64.rpm: Already downloaded
[SKIPPED] perl-Term-ANSIColor-5.01-461.el9.noarch.rpm: Already downloaded
[SKIPPED] perl-Text-ParseWords-3.30-460.el9.noarch.rpm: Already downloaded
[SKIPPED] perl-URI-5.09-3.el9.noarch.rpm: Already downloaded
[SKIPPED] perl-constant-1.33-461.el9.noarch.rpm: Already downloaded
[SKIPPED] fonts-srpm-macros-2.0.5-7.el9.1.noarch.rpm: Already downloaded
[SKIPPED] ocaml-srpm-macros-6-6.el9.noarch.rpm: Already downloaded
[SKIPPED] patch-2.7.6-16.el9.x86_64.rpm: Already downloaded
[SKIPPED] perl-Pod-Perldoc-3.28.01-461.el9.noarch.rpm: Already downloaded
[SKIPPED] perl-libnet-3.13-4.el9.noarch.rpm: Already downloaded
[SKIPPED] perl-Carp-1.50-460.el9.noarch.rpm: Already downloaded
[SKIPPED] perl-PathTools-3.78-461.el9.x86_64.rpm: Already downloaded
[SKIPPED] perl-Net-SSLeay-1.92-2.el9.x86_64.rpm: Already downloaded
[SKIPPED] perl-AutoLoader-5.74-480.el9.noarch.rpm: Already downloaded
[SKIPPED] perl-B-1.80-480.el9.x86_64.rpm: Already downloaded
[SKIPPED] perl-Class-Struct-0.66-480.el9.noarch.rpm: Already downloaded
[SKIPPED] perl-Errno-1.30-480.el9.x86_64.rpm: Already downloaded
[SKIPPED] perl-Fcntl-1.13-480.el9.x86_64.rpm: Already downloaded
[SKIPPED] perl-File-Basename-2.85-480.el9.noarch.rpm: Already downloaded
[SKIPPED] perl-File-stat-1.09-480.el9.noarch.rpm: Already downloaded
[SKIPPED] perl-FileHandle-2.03-480.el9.noarch.rpm: Already downloaded
[SKIPPED] perl-IPC-Open3-1.21-480.el9.noarch.rpm: Already downloaded
[SKIPPED] perl-POSIX-1.94-480.el9.x86_64.rpm: Already downloaded
[SKIPPED] perl-Symbol-1.08-480.el9.noarch.rpm: Already downloaded
[SKIPPED] perl-interpreter-5.32.1-480.el9.x86_64.rpm: Already downloaded
[SKIPPED] perl-libs-5.32.1-480.el9.x86_64.rpm: Already downloaded
[SKIPPED] perl-mro-1.23-480.el9.x86_64.rpm: Already downloaded
[SKIPPED] perl-overload-1.31-480.el9.noarch.rpm: Already downloaded
[SKIPPED] perl-overloading-0.02-480.el9.noarch.rpm: Already downloaded
[SKIPPED] perl-Getopt-Std-1.12-480.el9.noarch.rpm: Already downloaded
[SKIPPED] perl-IO-1.43-480.el9.x86_64.rpm: Already downloaded
[SKIPPED] perl-SelectSaver-1.02-480.el9.noarch.rpm: Already downloaded
[SKIPPED] perl-base-2.27-480.el9.noarch.rpm: Already downloaded
[SKIPPED] perl-if-0.60.800-480.el9.noarch.rpm: Already downloaded
[SKIPPED] perl-subs-1.03-480.el9.noarch.rpm: Already downloaded
[SKIPPED] perl-vars-1.05-480.el9.noarch.rpm: Already downloaded
[SKIPPED] debugedit-5.0-4.el9.x86_64.rpm: Already downloaded
[SKIPPED] pyproject-srpm-macros-1.9.0-1.el9.noarch.rpm: Already downloaded
[SKIPPED] redhat-rpm-config-201-1.el9.noarch.rpm: Already downloaded
[SKIPPED] go-srpm-macros-3.2.0-2.el9.noarch.rpm: Already downloaded
[SKIPPED] kernel-srpm-macros-1.0-13.el9.noarch.rpm: Already downloaded
[SKIPPED] perl-HTTP-Tiny-0.076-461.el9.noarch.rpm: Already downloaded
[SKIPPED] qt5-srpm-macros-5.15.9-1.el9.noarch.rpm: Already downloaded
[SKIPPED] rpm-build-4.16.1.3-27.el9_3.x86_64.rpm: Already downloaded
[SKIPPED] gdb-minimal-10.2-11.1.el9_3.x86_64.rpm: Already downloaded
[SKIPPED] ansible-srpm-macros-1-12.el9.noarch.rpm: Already downloaded
[SKIPPED] epel-rpm-macros-9-14.el9.noarch.rpm: Already downloaded
[SKIPPED] forge-srpm-macros-0.3.1-1.el9.noarch.rpm: Already downloaded
[SKIPPED] fpc-srpm-macros-1.3-7.el9.noarch.rpm: Already downloaded
[SKIPPED] go-srpm-macros-epel-3.3.0.5-1.el9.noarch.rpm: Already downloaded
[SKIPPED] qt6-srpm-macros-6.5.2-3.el9.noarch.rpm: Already downloaded
[SKIPPED] rpmautospec-rpm-macros-0.6.3-1.el9.noarch.rpm: Already downloaded
[SKIPPED] rust-srpm-macros-epel-26.2-1.el9.noarch.rpm: Already downloaded
Red Hat Enterprise Linux - BaseOS 3.5 MB/s | 3.6 kB 00:00
Importing GPG key 0xFD431D51:
Userid : "Red Hat, Inc. (release key 2) "
Fingerprint: 567E 347A D004 4ADE 55BA 8A5F 199E 2F91 FD43 1D51
From : /usr/share/distribution-gpg-keys/redhat/RPM-GPG-KEY-redhat9-release
Key imported successfully
Importing GPG key 0x5A6340B3:
Userid : "Red Hat, Inc. (auxiliary key 3) "
Fingerprint: 7E46 2425 8C40 6535 D56D 6F13 5054 E4A4 5A63 40B3
From : /usr/share/distribution-gpg-keys/redhat/RPM-GPG-KEY-redhat9-release
Key imported successfully
Extra Packages for Enterprise Linux 9 - x86_64 1.6 MB/s | 1.6 kB 00:00
Importing GPG key 0x3228467C:
Userid : "Fedora (epel9) "
Fingerprint: FF8A D134 4597 106E CE81 3B91 8A38 72BF 3228 467C
From : /usr/share/distribution-gpg-keys/epel/RPM-GPG-KEY-EPEL-9
Key imported successfully
Running transaction check
Transaction check succeeded.
Running transaction test
Transaction test succeeded.
Running transaction
Running scriptlet: filesystem-3.16-2.el9.x86_64 1/1
Preparing : 1/1
Installing : libgcc-11.4.1-2.1.el9.x86_64 1/205
Running scriptlet: libgcc-11.4.1-2.1.el9.x86_64 1/205
Installing : crypto-policies-20230731-1.git94f0e2c.el9_3.1.no 2/205
Running scriptlet: crypto-policies-20230731-1.git94f0e2c.el9_3.1.no 2/205
Installing : rust-srpm-macros-17-4.el9.noarch 3/205
Installing : redhat-release-9.3-0.5.el9.x86_64 4/205
Installing : setup-2.13.7-9.el9.noarch 5/205
warning: /etc/hosts created as /etc/hosts.rpmnew
Running scriptlet: setup-2.13.7-9.el9.noarch 5/205
Installing : filesystem-3.16-2.el9.x86_64 6/205
Installing : basesystem-11-13.el9.noarch 7/205
Installing : rust-srpm-macros-epel-26.2-1.el9.noarch 8/205
Installing : qt6-srpm-macros-6.5.2-3.el9.noarch 9/205
Installing : fpc-srpm-macros-1.3-7.el9.noarch 10/205
Installing : ansible-srpm-macros-1-12.el9.noarch 11/205
Installing : qt5-srpm-macros-5.15.9-1.el9.noarch 12/205
Installing : pyproject-srpm-macros-1.9.0-1.el9.noarch 13/205
Installing : ocaml-srpm-macros-6-6.el9.noarch 14/205
Installing : openblas-srpm-macros-2-11.el9.noarch 15/205
Installing : perl-srpm-macros-1-41.el9.noarch 16/205
Installing : ghc-srpm-macros-1.5.0-6.el9.noarch 17/205
Installing : libssh-config-0.10.4-12.el9_3.noarch 18/205
Installing : tzdata-2024a-1.el9.noarch 19/205
Installing : ncurses-base-6.2-10.20210508.el9.noarch 20/205
Installing : bash-5.1.8-6.el9_1.x86_64 21/205
Running scriptlet: bash-5.1.8-6.el9_1.x86_64 21/205
Installing : ncurses-libs-6.2-10.20210508.el9.x86_64 22/205
Installing : glibc-common-2.34-83.el9_3.12.x86_64 23/205
Installing : glibc-gconv-extra-2.34-83.el9_3.12.x86_64 24/205
Running scriptlet: glibc-gconv-extra-2.34-83.el9_3.12.x86_64 24/205
Installing : glibc-minimal-langpack-2.34-83.el9_3.12.x86_64 25/205
Running scriptlet: glibc-2.34-83.el9_3.12.x86_64 26/205
Installing : glibc-2.34-83.el9_3.12.x86_64 26/205
Running scriptlet: glibc-2.34-83.el9_3.12.x86_64 26/205
Installing : zlib-1.2.11-40.el9.x86_64 27/205
Installing : xz-libs-5.2.5-8.el9_0.x86_64 28/205
Installing : bzip2-libs-1.0.8-8.el9.x86_64 29/205
Installing : libxcrypt-4.4.18-3.el9.x86_64 30/205
Installing : libzstd-1.5.1-2.el9.x86_64 31/205
Installing : elfutils-libelf-0.189-3.el9.x86_64 32/205
Installing : libstdc++-11.4.1-2.1.el9.x86_64 33/205
Installing : libuuid-2.37.4-15.el9.x86_64 34/205
Installing : libattr-2.5.1-3.el9.x86_64 35/205
Installing : libacl-2.3.1-3.el9.x86_64 36/205
Installing : popt-1.18-8.el9.x86_64 37/205
Installing : libcap-2.48-9.el9_2.x86_64 38/205
Installing : lz4-libs-1.9.3-5.el9.x86_64 39/205
Installing : readline-8.1-4.el9.x86_64 40/205
Installing : libcom_err-1.46.5-3.el9.x86_64 41/205
Installing : gmp-1:6.2.0-13.el9.x86_64 42/205
Installing : mpfr-4.1.0-7.el9.x86_64 43/205
Installing : dwz-0.14-3.el9.x86_64 44/205
Installing : unzip-6.0-56.el9.x86_64 45/205
Installing : file-libs-5.39-14.el9.x86_64 46/205
Installing : file-5.39-14.el9.x86_64 47/205
Installing : sqlite-libs-3.34.1-7.el9_3.x86_64 48/205
Installing : libcap-ng-0.8.2-7.el9.x86_64 49/205
Installing : audit-libs-3.0.7-104.el9.x86_64 50/205
Installing : libsigsegv-2.13-4.el9.x86_64 51/205
Installing : gawk-5.1.0-6.el9.x86_64 52/205
Installing : libunistring-0.9.10-15.el9.x86_64 53/205
Installing : libidn2-2.3.0-7.el9.x86_64 54/205
Installing : libsepol-3.5-1.el9.x86_64 55/205
Installing : alternatives-1.24-1.el9.x86_64 56/205
Installing : libsmartcols-2.37.4-15.el9.x86_64 57/205
Installing : lua-libs-5.4.4-4.el9.x86_64 58/205
Installing : zip-3.0-35.el9.x86_64 59/205
Installing : zstd-1.5.1-2.el9.x86_64 60/205
Running scriptlet: groff-base-1.22.4-10.el9.x86_64 61/205
Installing : groff-base-1.22.4-10.el9.x86_64 61/205
Running scriptlet: groff-base-1.22.4-10.el9.x86_64 61/205
Installing : bzip2-1.0.8-8.el9.x86_64 62/205
Installing : libxml2-2.9.13-5.el9_3.x86_64 63/205
Installing : info-6.7-15.el9.x86_64 64/205
Installing : ed-1.14.2-12.el9.x86_64 65/205
Installing : cpio-2.13-16.el9.x86_64 66/205
Installing : libbrotli-1.0.9-6.el9.x86_64 67/205
Installing : libdb-5.3.28-53.el9.x86_64 68/205
Installing : libgpg-error-1.42-5.el9.x86_64 69/205
Installing : libgcrypt-1.10.0-10.el9_2.x86_64 70/205
Installing : libverto-0.3.2-3.el9.x86_64 71/205
Installing : pcre-8.44-3.el9.3.x86_64 72/205
Installing : grep-3.6-5.el9.x86_64 73/205
Installing : xz-5.2.5-8.el9_0.x86_64 74/205
Installing : diffutils-3.7-12.el9.x86_64 75/205
Installing : gdbm-libs-1:1.19-4.el9.x86_64 76/205
Installing : libtasn1-4.16.0-8.el9_1.x86_64 77/205
Installing : keyutils-libs-1.6.3-1.el9.x86_64 78/205
Installing : libeconf-0.4.1-3.el9_2.x86_64 79/205
Installing : libpkgconf-1.7.3-10.el9.x86_64 80/205
Installing : pkgconf-1.7.3-10.el9.x86_64 81/205
Installing : libffi-3.4.2-8.el9.x86_64 82/205
Installing : p11-kit-0.24.1-2.el9.x86_64 83/205
Installing : p11-kit-trust-0.24.1-2.el9.x86_64 84/205
Running scriptlet: p11-kit-trust-0.24.1-2.el9.x86_64 84/205
Installing : libgomp-11.4.1-2.1.el9.x86_64 85/205
Installing : libnghttp2-1.43.0-5.el9_3.1.x86_64 86/205
Installing : ncurses-6.2-10.20210508.el9.x86_64 87/205
Installing : elfutils-default-yama-scope-0.189-3.el9.noarch 88/205
Running scriptlet: elfutils-default-yama-scope-0.189-3.el9.noarch 88/205
Installing : elfutils-libs-0.189-3.el9.x86_64 89/205
Installing : pkgconf-m4-1.7.3-10.el9.noarch 90/205
Installing : pkgconf-pkg-config-1.7.3-10.el9.x86_64 91/205
Installing : coreutils-common-8.32-34.el9.x86_64 92/205
Installing : pcre2-syntax-10.40-2.el9.noarch 93/205
Installing : pcre2-10.40-2.el9.x86_64 94/205
Installing : libselinux-3.5-1.el9.x86_64 95/205
Installing : sed-4.8-9.el9.x86_64 96/205
Installing : findutils-1:4.8.0-6.el9.x86_64 97/205
Installing : openssl-libs-1:3.0.7-25.el9_3.x86_64 98/205
Installing : coreutils-8.32-34.el9.x86_64 99/205
Running scriptlet: ca-certificates-2023.2.60_v7.0.306-90.1.el9_2.no 100/205
Installing : ca-certificates-2023.2.60_v7.0.306-90.1.el9_2.no 100/205
Running scriptlet: ca-certificates-2023.2.60_v7.0.306-90.1.el9_2.no 100/205
Installing : libblkid-2.37.4-15.el9.x86_64 101/205
Running scriptlet: libblkid-2.37.4-15.el9.x86_64 101/205
Installing : krb5-libs-1.21.1-1.el9.x86_64 102/205
Installing : libmount-2.37.4-15.el9.x86_64 103/205
Installing : gzip-1.12-1.el9.x86_64 104/205
Installing : cracklib-2.9.6-27.el9.x86_64 105/205
Installing : systemd-libs-252-18.el9.x86_64 106/205
Running scriptlet: systemd-libs-252-18.el9.x86_64 106/205
Installing : util-linux-core-2.37.4-15.el9.x86_64 107/205
Running scriptlet: util-linux-core-2.37.4-15.el9.x86_64 107/205
Installing : cracklib-dicts-2.9.6-27.el9.x86_64 108/205
Installing : cyrus-sasl-lib-2.1.27-21.el9.x86_64 109/205
Installing : libssh-0.10.4-12.el9_3.x86_64 110/205
Installing : libfdisk-2.37.4-15.el9.x86_64 111/205
Installing : perl-Digest-1.19-4.el9.noarch 112/205
Installing : perl-Digest-MD5-2.58-4.el9.x86_64 113/205
Installing : perl-FileHandle-2.03-480.el9.noarch 114/205
Installing : perl-B-1.80-480.el9.x86_64 115/205
Installing : perl-Data-Dumper-2.174-462.el9.x86_64 116/205
Installing : perl-libnet-3.13-4.el9.noarch 117/205
Installing : perl-AutoLoader-5.74-480.el9.noarch 118/205
Installing : perl-base-2.27-480.el9.noarch 119/205
Installing : perl-URI-5.09-3.el9.noarch 120/205
Installing : perl-Time-Local-2:1.300-7.el9.noarch 121/205
Installing : perl-Mozilla-CA-20200520-6.el9.noarch 122/205
Installing : perl-IO-Socket-IP-0.41-5.el9.noarch 123/205
Installing : perl-if-0.60.800-480.el9.noarch 124/205
Installing : perl-Pod-Escapes-1:1.07-460.el9.noarch 125/205
Installing : perl-Text-Tabs+Wrap-2013.0523-460.el9.noarch 126/205
Installing : perl-File-Path-2.18-4.el9.noarch 127/205
Installing : perl-IO-Socket-SSL-2.073-1.el9.noarch 128/205
Installing : perl-Net-SSLeay-1.92-2.el9.x86_64 129/205
Installing : perl-Term-ANSIColor-5.01-461.el9.noarch 130/205
Installing : perl-Class-Struct-0.66-480.el9.noarch 131/205
Installing : perl-POSIX-1.94-480.el9.x86_64 132/205
Installing : perl-IPC-Open3-1.21-480.el9.noarch 133/205
Installing : perl-subs-1.03-480.el9.noarch 134/205
Installing : perl-Term-Cap-1.17-460.el9.noarch 135/205
Installing : perl-File-Temp-1:0.231.100-4.el9.noarch 136/205
Installing : perl-Pod-Simple-1:3.42-4.el9.noarch 137/205
Installing : perl-HTTP-Tiny-0.076-461.el9.noarch 138/205
Installing : perl-Socket-4:2.031-4.el9.x86_64 139/205
Installing : perl-Symbol-1.08-480.el9.noarch 140/205
Installing : perl-File-stat-1.09-480.el9.noarch 141/205
Installing : perl-SelectSaver-1.02-480.el9.noarch 142/205
Installing : perl-podlators-1:4.14-460.el9.noarch 143/205
Installing : perl-Pod-Perldoc-3.28.01-461.el9.noarch 144/205
Installing : perl-Text-ParseWords-3.30-460.el9.noarch 145/205
Installing : perl-Fcntl-1.13-480.el9.x86_64 146/205
Installing : perl-mro-1.23-480.el9.x86_64 147/205
Installing : perl-overloading-0.02-480.el9.noarch 148/205
Installing : perl-Pod-Usage-4:2.01-4.el9.noarch 149/205
Installing : perl-IO-1.43-480.el9.x86_64 150/205
Installing : perl-parent-1:0.238-460.el9.noarch 151/205
Installing : perl-MIME-Base64-3.16-4.el9.x86_64 152/205
Installing : perl-Scalar-List-Utils-4:1.56-461.el9.x86_64 153/205
Installing : perl-constant-1.33-461.el9.noarch 154/205
Installing : perl-Errno-1.30-480.el9.x86_64 155/205
Installing : perl-Storable-1:3.21-460.el9.x86_64 156/205
Installing : perl-File-Basename-2.85-480.el9.noarch 157/205
Installing : perl-overload-1.31-480.el9.noarch 158/205
Installing : perl-Getopt-Std-1.12-480.el9.noarch 159/205
Installing : perl-vars-1.05-480.el9.noarch 160/205
Installing : perl-Getopt-Long-1:2.52-4.el9.noarch 161/205
Installing : perl-Exporter-5.74-461.el9.noarch 162/205
Installing : perl-Carp-1.50-460.el9.noarch 163/205
Installing : perl-PathTools-3.78-461.el9.x86_64 164/205
Installing : perl-Encode-4:3.08-462.el9.x86_64 165/205
Installing : perl-libs-4:5.32.1-480.el9.x86_64 166/205
Installing : perl-interpreter-4:5.32.1-480.el9.x86_64 167/205
Installing : kernel-srpm-macros-1.0-13.el9.noarch 168/205
Installing : openssl-1:3.0.7-25.el9_3.x86_64 169/205
Installing : libpwquality-1.4.4-8.el9.x86_64 170/205
Installing : pam-1.5.1-15.el9.x86_64 171/205
Installing : libevent-2.1.12-6.el9.x86_64 172/205
Installing : openldap-2.6.3-1.el9.x86_64 173/205
Installing : libarchive-3.5.3-4.el9.x86_64 174/205
Installing : tar-2:1.34-6.el9_1.x86_64 175/205
Installing : libsemanage-3.5-2.el9.x86_64 176/205
Installing : shadow-utils-2:4.9-8.el9.x86_64 177/205
Running scriptlet: libutempter-1.2.1-6.el9.x86_64 178/205
Installing : libutempter-1.2.1-6.el9.x86_64 178/205
Installing : patch-2.7.6-16.el9.x86_64 179/205
Installing : publicsuffix-list-dafsa-20210518-3.el9.noarch 180/205
Installing : libpsl-0.21.1-5.el9.x86_64 181/205
Installing : libcurl-7.76.1-26.el9_3.3.x86_64 182/205
Installing : elfutils-debuginfod-client-0.189-3.el9.x86_64 183/205
Installing : binutils-gold-2.35.2-42.el9_3.1.x86_64 184/205
Installing : binutils-2.35.2-42.el9_3.1.x86_64 185/205
Running scriptlet: binutils-2.35.2-42.el9_3.1.x86_64 185/205
Installing : elfutils-0.189-3.el9.x86_64 186/205
Installing : gdb-minimal-10.2-11.1.el9_3.x86_64 187/205
Installing : debugedit-5.0-4.el9.x86_64 188/205
Installing : curl-7.76.1-26.el9_3.3.x86_64 189/205
Installing : rpm-libs-4.16.1.3-27.el9_3.x86_64 190/205
Installing : rpm-4.16.1.3-27.el9_3.x86_64 191/205
Installing : lua-srpm-macros-1-6.el9.noarch 192/205
Installing : efi-srpm-macros-6-2.el9_0.noarch 193/205
Installing : python-srpm-macros-3.9-52.el9.noarch 194/205
Installing : fonts-srpm-macros-1:2.0.5-7.el9.1.noarch 195/205
Installing : go-srpm-macros-3.2.0-2.el9.noarch 196/205
Installing : redhat-rpm-config-201-1.el9.noarch 197/205
Installing : forge-srpm-macros-0.3.1-1.el9.noarch 198/205
Installing : go-srpm-macros-epel-3.3.0.5-1.el9.noarch 199/205
Installing : rpmautospec-rpm-macros-0.6.3-1.el9.noarch 200/205
Installing : rpm-build-libs-4.16.1.3-27.el9_3.x86_64 201/205
Installing : rpm-build-4.16.1.3-27.el9_3.x86_64 202/205
Installing : epel-rpm-macros-9-14.el9.noarch 203/205
Installing : util-linux-2.37.4-15.el9.x86_64 204/205
Installing : which-2.21-29.el9.x86_64 205/205
Running scriptlet: filesystem-3.16-2.el9.x86_64 205/205
Running scriptlet: ca-certificates-2023.2.60_v7.0.306-90.1.el9_2.no 205/205
Running scriptlet: rpm-4.16.1.3-27.el9_3.x86_64 205/205
Running scriptlet: which-2.21-29.el9.x86_64 205/205
Verifying : basesystem-11-13.el9.noarch 1/205
Verifying : bzip2-1.0.8-8.el9.x86_64 2/205
Verifying : bzip2-libs-1.0.8-8.el9.x86_64 3/205
Verifying : cpio-2.13-16.el9.x86_64 4/205
Verifying : cracklib-2.9.6-27.el9.x86_64 5/205
Verifying : ed-1.14.2-12.el9.x86_64 6/205
Verifying : filesystem-3.16-2.el9.x86_64 7/205
Verifying : grep-3.6-5.el9.x86_64 8/205
Verifying : groff-base-1.22.4-10.el9.x86_64 9/205
Verifying : info-6.7-15.el9.x86_64 10/205
Verifying : libacl-2.3.1-3.el9.x86_64 11/205
Verifying : libattr-2.5.1-3.el9.x86_64 12/205
Verifying : libbrotli-1.0.9-6.el9.x86_64 13/205
Verifying : libcap-ng-0.8.2-7.el9.x86_64 14/205
Verifying : libdb-5.3.28-53.el9.x86_64 15/205
Verifying : libevent-2.1.12-6.el9.x86_64 16/205
Verifying : libgpg-error-1.42-5.el9.x86_64 17/205
Verifying : libidn2-2.3.0-7.el9.x86_64 18/205
Verifying : libpsl-0.21.1-5.el9.x86_64 19/205
Verifying : libpwquality-1.4.4-8.el9.x86_64 20/205
Verifying : libsigsegv-2.13-4.el9.x86_64 21/205
Verifying : libunistring-0.9.10-15.el9.x86_64 22/205
Verifying : libutempter-1.2.1-6.el9.x86_64 23/205
Verifying : libverto-0.3.2-3.el9.x86_64 24/205
Verifying : libxcrypt-4.4.18-3.el9.x86_64 25/205
Verifying : libzstd-1.5.1-2.el9.x86_64 26/205
Verifying : lz4-libs-1.9.3-5.el9.x86_64 27/205
Verifying : mpfr-4.1.0-7.el9.x86_64 28/205
Verifying : p11-kit-0.24.1-2.el9.x86_64 29/205
Verifying : pcre-8.44-3.el9.3.x86_64 30/205
Verifying : popt-1.18-8.el9.x86_64 31/205
Verifying : publicsuffix-list-dafsa-20210518-3.el9.noarch 32/205
Verifying : readline-8.1-4.el9.x86_64 33/205
Verifying : sed-4.8-9.el9.x86_64 34/205
Verifying : unzip-6.0-56.el9.x86_64 35/205
Verifying : cracklib-dicts-2.9.6-27.el9.x86_64 36/205
Verifying : diffutils-3.7-12.el9.x86_64 37/205
Verifying : gawk-5.1.0-6.el9.x86_64 38/205
Verifying : gdbm-libs-1:1.19-4.el9.x86_64 39/205
Verifying : libcom_err-1.46.5-3.el9.x86_64 40/205
Verifying : p11-kit-trust-0.24.1-2.el9.x86_64 41/205
Verifying : pcre2-syntax-10.40-2.el9.noarch 42/205
Verifying : xz-5.2.5-8.el9_0.x86_64 43/205
Verifying : xz-libs-5.2.5-8.el9_0.x86_64 44/205
Verifying : zstd-1.5.1-2.el9.x86_64 45/205
Verifying : bash-5.1.8-6.el9_1.x86_64 46/205
Verifying : cyrus-sasl-lib-2.1.27-21.el9.x86_64 47/205
Verifying : gzip-1.12-1.el9.x86_64 48/205
Verifying : libselinux-3.5-1.el9.x86_64 49/205
Verifying : libtasn1-4.16.0-8.el9_1.x86_64 50/205
Verifying : pcre2-10.40-2.el9.x86_64 51/205
Verifying : tar-2:1.34-6.el9_1.x86_64 52/205
Verifying : ca-certificates-2023.2.60_v7.0.306-90.1.el9_2.no 53/205
Verifying : coreutils-8.32-34.el9.x86_64 54/205
Verifying : coreutils-common-8.32-34.el9.x86_64 55/205
Verifying : keyutils-libs-1.6.3-1.el9.x86_64 56/205
Verifying : libarchive-3.5.3-4.el9.x86_64 57/205
Verifying : libcap-2.48-9.el9_2.x86_64 58/205
Verifying : libeconf-0.4.1-3.el9_2.x86_64 59/205
Verifying : libgcrypt-1.10.0-10.el9_2.x86_64 60/205
Verifying : libpkgconf-1.7.3-10.el9.x86_64 61/205
Verifying : libsepol-3.5-1.el9.x86_64 62/205
Verifying : pkgconf-1.7.3-10.el9.x86_64 63/205
Verifying : pkgconf-m4-1.7.3-10.el9.noarch 64/205
Verifying : pkgconf-pkg-config-1.7.3-10.el9.x86_64 65/205
Verifying : setup-2.13.7-9.el9.noarch 66/205
Verifying : zip-3.0-35.el9.x86_64 67/205
Verifying : alternatives-1.24-1.el9.x86_64 68/205
Verifying : audit-libs-3.0.7-104.el9.x86_64 69/205
Verifying : crypto-policies-20230731-1.git94f0e2c.el9_3.1.no 70/205
Verifying : elfutils-0.189-3.el9.x86_64 71/205
Verifying : elfutils-debuginfod-client-0.189-3.el9.x86_64 72/205
Verifying : elfutils-default-yama-scope-0.189-3.el9.noarch 73/205
Verifying : elfutils-libelf-0.189-3.el9.x86_64 74/205
Verifying : elfutils-libs-0.189-3.el9.x86_64 75/205
Verifying : file-5.39-14.el9.x86_64 76/205
Verifying : file-libs-5.39-14.el9.x86_64 77/205
Verifying : findutils-1:4.8.0-6.el9.x86_64 78/205
Verifying : gmp-1:6.2.0-13.el9.x86_64 79/205
Verifying : krb5-libs-1.21.1-1.el9.x86_64 80/205
Verifying : libblkid-2.37.4-15.el9.x86_64 81/205
Verifying : libfdisk-2.37.4-15.el9.x86_64 82/205
Verifying : libffi-3.4.2-8.el9.x86_64 83/205
Verifying : libgcc-11.4.1-2.1.el9.x86_64 84/205
Verifying : libgomp-11.4.1-2.1.el9.x86_64 85/205
Verifying : libmount-2.37.4-15.el9.x86_64 86/205
Verifying : libnghttp2-1.43.0-5.el9_3.1.x86_64 87/205
Verifying : libsemanage-3.5-2.el9.x86_64 88/205
Verifying : libsmartcols-2.37.4-15.el9.x86_64 89/205
Verifying : libstdc++-11.4.1-2.1.el9.x86_64 90/205
Verifying : libuuid-2.37.4-15.el9.x86_64 91/205
Verifying : lua-libs-5.4.4-4.el9.x86_64 92/205
Verifying : ncurses-6.2-10.20210508.el9.x86_64 93/205
Verifying : ncurses-base-6.2-10.20210508.el9.noarch 94/205
Verifying : ncurses-libs-6.2-10.20210508.el9.x86_64 95/205
Verifying : openldap-2.6.3-1.el9.x86_64 96/205
Verifying : pam-1.5.1-15.el9.x86_64 97/205
Verifying : redhat-release-9.3-0.5.el9.x86_64 98/205
Verifying : shadow-utils-2:4.9-8.el9.x86_64 99/205
Verifying : systemd-libs-252-18.el9.x86_64 100/205
Verifying : util-linux-2.37.4-15.el9.x86_64 101/205
Verifying : util-linux-core-2.37.4-15.el9.x86_64 102/205
Verifying : which-2.21-29.el9.x86_64 103/205
Verifying : zlib-1.2.11-40.el9.x86_64 104/205
Verifying : libxml2-2.9.13-5.el9_3.x86_64 105/205
Verifying : openssl-1:3.0.7-25.el9_3.x86_64 106/205
Verifying : openssl-libs-1:3.0.7-25.el9_3.x86_64 107/205
Verifying : rpm-4.16.1.3-27.el9_3.x86_64 108/205
Verifying : rpm-build-libs-4.16.1.3-27.el9_3.x86_64 109/205
Verifying : rpm-libs-4.16.1.3-27.el9_3.x86_64 110/205
Verifying : sqlite-libs-3.34.1-7.el9_3.x86_64 111/205
Verifying : tzdata-2024a-1.el9.noarch 112/205
Verifying : binutils-2.35.2-42.el9_3.1.x86_64 113/205
Verifying : binutils-gold-2.35.2-42.el9_3.1.x86_64 114/205
Verifying : curl-7.76.1-26.el9_3.3.x86_64 115/205
Verifying : glibc-2.34-83.el9_3.12.x86_64 116/205
Verifying : glibc-common-2.34-83.el9_3.12.x86_64 117/205
Verifying : glibc-gconv-extra-2.34-83.el9_3.12.x86_64 118/205
Verifying : glibc-minimal-langpack-2.34-83.el9_3.12.x86_64 119/205
Verifying : libcurl-7.76.1-26.el9_3.3.x86_64 120/205
Verifying : libssh-0.10.4-12.el9_3.x86_64 121/205
Verifying : libssh-config-0.10.4-12.el9_3.noarch 122/205
Verifying : ghc-srpm-macros-1.5.0-6.el9.noarch 123/205
Verifying : lua-srpm-macros-1-6.el9.noarch 124/205
Verifying : perl-Data-Dumper-2.174-462.el9.x86_64 125/205
Verifying : perl-Digest-MD5-2.58-4.el9.x86_64 126/205
Verifying : perl-Encode-4:3.08-462.el9.x86_64 127/205
Verifying : perl-IO-Socket-SSL-2.073-1.el9.noarch 128/205
Verifying : perl-Mozilla-CA-20200520-6.el9.noarch 129/205
Verifying : perl-Pod-Simple-1:3.42-4.el9.noarch 130/205
Verifying : perl-Term-Cap-1.17-460.el9.noarch 131/205
Verifying : perl-Time-Local-2:1.300-7.el9.noarch 132/205
Verifying : rust-srpm-macros-17-4.el9.noarch 133/205
Verifying : perl-Pod-Escapes-1:1.07-460.el9.noarch 134/205
Verifying : perl-Storable-1:3.21-460.el9.x86_64 135/205
Verifying : perl-podlators-1:4.14-460.el9.noarch 136/205
Verifying : python-srpm-macros-3.9-52.el9.noarch 137/205
Verifying : dwz-0.14-3.el9.x86_64 138/205
Verifying : perl-Exporter-5.74-461.el9.noarch 139/205
Verifying : perl-File-Temp-1:0.231.100-4.el9.noarch 140/205
Verifying : perl-Getopt-Long-1:2.52-4.el9.noarch 141/205
Verifying : perl-MIME-Base64-3.16-4.el9.x86_64 142/205
Verifying : perl-Text-Tabs+Wrap-2013.0523-460.el9.noarch 143/205
Verifying : perl-parent-1:0.238-460.el9.noarch 144/205
Verifying : perl-srpm-macros-1-41.el9.noarch 145/205
Verifying : efi-srpm-macros-6-2.el9_0.noarch 146/205
Verifying : openblas-srpm-macros-2-11.el9.noarch 147/205
Verifying : perl-Digest-1.19-4.el9.noarch 148/205
Verifying : perl-File-Path-2.18-4.el9.noarch 149/205
Verifying : perl-IO-Socket-IP-0.41-5.el9.noarch 150/205
Verifying : perl-Pod-Usage-4:2.01-4.el9.noarch 151/205
Verifying : perl-Scalar-List-Utils-4:1.56-461.el9.x86_64 152/205
Verifying : perl-Socket-4:2.031-4.el9.x86_64 153/205
Verifying : perl-Term-ANSIColor-5.01-461.el9.noarch 154/205
Verifying : perl-Text-ParseWords-3.30-460.el9.noarch 155/205
Verifying : perl-URI-5.09-3.el9.noarch 156/205
Verifying : perl-constant-1.33-461.el9.noarch 157/205
Verifying : fonts-srpm-macros-1:2.0.5-7.el9.1.noarch 158/205
Verifying : ocaml-srpm-macros-6-6.el9.noarch 159/205
Verifying : patch-2.7.6-16.el9.x86_64 160/205
Verifying : perl-Pod-Perldoc-3.28.01-461.el9.noarch 161/205
Verifying : perl-libnet-3.13-4.el9.noarch 162/205
Verifying : perl-Carp-1.50-460.el9.noarch 163/205
Verifying : perl-PathTools-3.78-461.el9.x86_64 164/205
Verifying : perl-Net-SSLeay-1.92-2.el9.x86_64 165/205
Verifying : perl-AutoLoader-5.74-480.el9.noarch 166/205
Verifying : perl-B-1.80-480.el9.x86_64 167/205
Verifying : perl-Class-Struct-0.66-480.el9.noarch 168/205
Verifying : perl-Errno-1.30-480.el9.x86_64 169/205
Verifying : perl-Fcntl-1.13-480.el9.x86_64 170/205
Verifying : perl-File-Basename-2.85-480.el9.noarch 171/205
Verifying : perl-File-stat-1.09-480.el9.noarch 172/205
Verifying : perl-FileHandle-2.03-480.el9.noarch 173/205
Verifying : perl-IPC-Open3-1.21-480.el9.noarch 174/205
Verifying : perl-POSIX-1.94-480.el9.x86_64 175/205
Verifying : perl-Symbol-1.08-480.el9.noarch 176/205
Verifying : perl-interpreter-4:5.32.1-480.el9.x86_64 177/205
Verifying : perl-libs-4:5.32.1-480.el9.x86_64 178/205
Verifying : perl-mro-1.23-480.el9.x86_64 179/205
Verifying : perl-overload-1.31-480.el9.noarch 180/205
Verifying : perl-overloading-0.02-480.el9.noarch 181/205
Verifying : perl-Getopt-Std-1.12-480.el9.noarch 182/205
Verifying : perl-IO-1.43-480.el9.x86_64 183/205
Verifying : perl-SelectSaver-1.02-480.el9.noarch 184/205
Verifying : perl-base-2.27-480.el9.noarch 185/205
Verifying : perl-if-0.60.800-480.el9.noarch 186/205
Verifying : perl-subs-1.03-480.el9.noarch 187/205
Verifying : perl-vars-1.05-480.el9.noarch 188/205
Verifying : debugedit-5.0-4.el9.x86_64 189/205
Verifying : pyproject-srpm-macros-1.9.0-1.el9.noarch 190/205
Verifying : redhat-rpm-config-201-1.el9.noarch 191/205
Verifying : go-srpm-macros-3.2.0-2.el9.noarch 192/205
Verifying : kernel-srpm-macros-1.0-13.el9.noarch 193/205
Verifying : perl-HTTP-Tiny-0.076-461.el9.noarch 194/205
Verifying : qt5-srpm-macros-5.15.9-1.el9.noarch 195/205
Verifying : rpm-build-4.16.1.3-27.el9_3.x86_64 196/205
Verifying : gdb-minimal-10.2-11.1.el9_3.x86_64 197/205
Verifying : ansible-srpm-macros-1-12.el9.noarch 198/205
Verifying : epel-rpm-macros-9-14.el9.noarch 199/205
Verifying : forge-srpm-macros-0.3.1-1.el9.noarch 200/205
Verifying : fpc-srpm-macros-1.3-7.el9.noarch 201/205
Verifying : go-srpm-macros-epel-3.3.0.5-1.el9.noarch 202/205
Verifying : qt6-srpm-macros-6.5.2-3.el9.noarch 203/205
Verifying : rpmautospec-rpm-macros-0.6.3-1.el9.noarch 204/205
Verifying : rust-srpm-macros-epel-26.2-1.el9.noarch 205/205
Installed products updated.
Installed:
alternatives-1.24-1.el9.x86_64
ansible-srpm-macros-1-12.el9.noarch
audit-libs-3.0.7-104.el9.x86_64
basesystem-11-13.el9.noarch
bash-5.1.8-6.el9_1.x86_64
binutils-2.35.2-42.el9_3.1.x86_64
binutils-gold-2.35.2-42.el9_3.1.x86_64
bzip2-1.0.8-8.el9.x86_64
bzip2-libs-1.0.8-8.el9.x86_64
ca-certificates-2023.2.60_v7.0.306-90.1.el9_2.noarch
coreutils-8.32-34.el9.x86_64
coreutils-common-8.32-34.el9.x86_64
cpio-2.13-16.el9.x86_64
cracklib-2.9.6-27.el9.x86_64
cracklib-dicts-2.9.6-27.el9.x86_64
crypto-policies-20230731-1.git94f0e2c.el9_3.1.noarch
curl-7.76.1-26.el9_3.3.x86_64
cyrus-sasl-lib-2.1.27-21.el9.x86_64
debugedit-5.0-4.el9.x86_64
diffutils-3.7-12.el9.x86_64
dwz-0.14-3.el9.x86_64
ed-1.14.2-12.el9.x86_64
efi-srpm-macros-6-2.el9_0.noarch
elfutils-0.189-3.el9.x86_64
elfutils-debuginfod-client-0.189-3.el9.x86_64
elfutils-default-yama-scope-0.189-3.el9.noarch
elfutils-libelf-0.189-3.el9.x86_64
elfutils-libs-0.189-3.el9.x86_64
epel-rpm-macros-9-14.el9.noarch
file-5.39-14.el9.x86_64
file-libs-5.39-14.el9.x86_64
filesystem-3.16-2.el9.x86_64
findutils-1:4.8.0-6.el9.x86_64
fonts-srpm-macros-1:2.0.5-7.el9.1.noarch
forge-srpm-macros-0.3.1-1.el9.noarch
fpc-srpm-macros-1.3-7.el9.noarch
gawk-5.1.0-6.el9.x86_64
gdb-minimal-10.2-11.1.el9_3.x86_64
gdbm-libs-1:1.19-4.el9.x86_64
ghc-srpm-macros-1.5.0-6.el9.noarch
glibc-2.34-83.el9_3.12.x86_64
glibc-common-2.34-83.el9_3.12.x86_64
glibc-gconv-extra-2.34-83.el9_3.12.x86_64
glibc-minimal-langpack-2.34-83.el9_3.12.x86_64
gmp-1:6.2.0-13.el9.x86_64
go-srpm-macros-3.2.0-2.el9.noarch
go-srpm-macros-epel-3.3.0.5-1.el9.noarch
grep-3.6-5.el9.x86_64
groff-base-1.22.4-10.el9.x86_64
gzip-1.12-1.el9.x86_64
info-6.7-15.el9.x86_64
kernel-srpm-macros-1.0-13.el9.noarch
keyutils-libs-1.6.3-1.el9.x86_64
krb5-libs-1.21.1-1.el9.x86_64
libacl-2.3.1-3.el9.x86_64
libarchive-3.5.3-4.el9.x86_64
libattr-2.5.1-3.el9.x86_64
libblkid-2.37.4-15.el9.x86_64
libbrotli-1.0.9-6.el9.x86_64
libcap-2.48-9.el9_2.x86_64
libcap-ng-0.8.2-7.el9.x86_64
libcom_err-1.46.5-3.el9.x86_64
libcurl-7.76.1-26.el9_3.3.x86_64
libdb-5.3.28-53.el9.x86_64
libeconf-0.4.1-3.el9_2.x86_64
libevent-2.1.12-6.el9.x86_64
libfdisk-2.37.4-15.el9.x86_64
libffi-3.4.2-8.el9.x86_64
libgcc-11.4.1-2.1.el9.x86_64
libgcrypt-1.10.0-10.el9_2.x86_64
libgomp-11.4.1-2.1.el9.x86_64
libgpg-error-1.42-5.el9.x86_64
libidn2-2.3.0-7.el9.x86_64
libmount-2.37.4-15.el9.x86_64
libnghttp2-1.43.0-5.el9_3.1.x86_64
libpkgconf-1.7.3-10.el9.x86_64
libpsl-0.21.1-5.el9.x86_64
libpwquality-1.4.4-8.el9.x86_64
libselinux-3.5-1.el9.x86_64
libsemanage-3.5-2.el9.x86_64
libsepol-3.5-1.el9.x86_64
libsigsegv-2.13-4.el9.x86_64
libsmartcols-2.37.4-15.el9.x86_64
libssh-0.10.4-12.el9_3.x86_64
libssh-config-0.10.4-12.el9_3.noarch
libstdc++-11.4.1-2.1.el9.x86_64
libtasn1-4.16.0-8.el9_1.x86_64
libunistring-0.9.10-15.el9.x86_64
libutempter-1.2.1-6.el9.x86_64
libuuid-2.37.4-15.el9.x86_64
libverto-0.3.2-3.el9.x86_64
libxcrypt-4.4.18-3.el9.x86_64
libxml2-2.9.13-5.el9_3.x86_64
libzstd-1.5.1-2.el9.x86_64
lua-libs-5.4.4-4.el9.x86_64
lua-srpm-macros-1-6.el9.noarch
lz4-libs-1.9.3-5.el9.x86_64
mpfr-4.1.0-7.el9.x86_64
ncurses-6.2-10.20210508.el9.x86_64
ncurses-base-6.2-10.20210508.el9.noarch
ncurses-libs-6.2-10.20210508.el9.x86_64
ocaml-srpm-macros-6-6.el9.noarch
openblas-srpm-macros-2-11.el9.noarch
openldap-2.6.3-1.el9.x86_64
openssl-1:3.0.7-25.el9_3.x86_64
openssl-libs-1:3.0.7-25.el9_3.x86_64
p11-kit-0.24.1-2.el9.x86_64
p11-kit-trust-0.24.1-2.el9.x86_64
pam-1.5.1-15.el9.x86_64
patch-2.7.6-16.el9.x86_64
pcre-8.44-3.el9.3.x86_64
pcre2-10.40-2.el9.x86_64
pcre2-syntax-10.40-2.el9.noarch
perl-AutoLoader-5.74-480.el9.noarch
perl-B-1.80-480.el9.x86_64
perl-Carp-1.50-460.el9.noarch
perl-Class-Struct-0.66-480.el9.noarch
perl-Data-Dumper-2.174-462.el9.x86_64
perl-Digest-1.19-4.el9.noarch
perl-Digest-MD5-2.58-4.el9.x86_64
perl-Encode-4:3.08-462.el9.x86_64
perl-Errno-1.30-480.el9.x86_64
perl-Exporter-5.74-461.el9.noarch
perl-Fcntl-1.13-480.el9.x86_64
perl-File-Basename-2.85-480.el9.noarch
perl-File-Path-2.18-4.el9.noarch
perl-File-Temp-1:0.231.100-4.el9.noarch
perl-File-stat-1.09-480.el9.noarch
perl-FileHandle-2.03-480.el9.noarch
perl-Getopt-Long-1:2.52-4.el9.noarch
perl-Getopt-Std-1.12-480.el9.noarch
perl-HTTP-Tiny-0.076-461.el9.noarch
perl-IO-1.43-480.el9.x86_64
perl-IO-Socket-IP-0.41-5.el9.noarch
perl-IO-Socket-SSL-2.073-1.el9.noarch
perl-IPC-Open3-1.21-480.el9.noarch
perl-MIME-Base64-3.16-4.el9.x86_64
perl-Mozilla-CA-20200520-6.el9.noarch
perl-Net-SSLeay-1.92-2.el9.x86_64
perl-POSIX-1.94-480.el9.x86_64
perl-PathTools-3.78-461.el9.x86_64
perl-Pod-Escapes-1:1.07-460.el9.noarch
perl-Pod-Perldoc-3.28.01-461.el9.noarch
perl-Pod-Simple-1:3.42-4.el9.noarch
perl-Pod-Usage-4:2.01-4.el9.noarch
perl-Scalar-List-Utils-4:1.56-461.el9.x86_64
perl-SelectSaver-1.02-480.el9.noarch
perl-Socket-4:2.031-4.el9.x86_64
perl-Storable-1:3.21-460.el9.x86_64
perl-Symbol-1.08-480.el9.noarch
perl-Term-ANSIColor-5.01-461.el9.noarch
perl-Term-Cap-1.17-460.el9.noarch
perl-Text-ParseWords-3.30-460.el9.noarch
perl-Text-Tabs+Wrap-2013.0523-460.el9.noarch
perl-Time-Local-2:1.300-7.el9.noarch
perl-URI-5.09-3.el9.noarch
perl-base-2.27-480.el9.noarch
perl-constant-1.33-461.el9.noarch
perl-if-0.60.800-480.el9.noarch
perl-interpreter-4:5.32.1-480.el9.x86_64
perl-libnet-3.13-4.el9.noarch
perl-libs-4:5.32.1-480.el9.x86_64
perl-mro-1.23-480.el9.x86_64
perl-overload-1.31-480.el9.noarch
perl-overloading-0.02-480.el9.noarch
perl-parent-1:0.238-460.el9.noarch
perl-podlators-1:4.14-460.el9.noarch
perl-srpm-macros-1-41.el9.noarch
perl-subs-1.03-480.el9.noarch
perl-vars-1.05-480.el9.noarch
pkgconf-1.7.3-10.el9.x86_64
pkgconf-m4-1.7.3-10.el9.noarch
pkgconf-pkg-config-1.7.3-10.el9.x86_64
popt-1.18-8.el9.x86_64
publicsuffix-list-dafsa-20210518-3.el9.noarch
pyproject-srpm-macros-1.9.0-1.el9.noarch
python-srpm-macros-3.9-52.el9.noarch
qt5-srpm-macros-5.15.9-1.el9.noarch
qt6-srpm-macros-6.5.2-3.el9.noarch
readline-8.1-4.el9.x86_64
redhat-release-9.3-0.5.el9.x86_64
redhat-rpm-config-201-1.el9.noarch
rpm-4.16.1.3-27.el9_3.x86_64
rpm-build-4.16.1.3-27.el9_3.x86_64
rpm-build-libs-4.16.1.3-27.el9_3.x86_64
rpm-libs-4.16.1.3-27.el9_3.x86_64
rpmautospec-rpm-macros-0.6.3-1.el9.noarch
rust-srpm-macros-17-4.el9.noarch
rust-srpm-macros-epel-26.2-1.el9.noarch
sed-4.8-9.el9.x86_64
setup-2.13.7-9.el9.noarch
shadow-utils-2:4.9-8.el9.x86_64
sqlite-libs-3.34.1-7.el9_3.x86_64
systemd-libs-252-18.el9.x86_64
tar-2:1.34-6.el9_1.x86_64
tzdata-2024a-1.el9.noarch
unzip-6.0-56.el9.x86_64
util-linux-2.37.4-15.el9.x86_64
util-linux-core-2.37.4-15.el9.x86_64
which-2.21-29.el9.x86_64
xz-5.2.5-8.el9_0.x86_64
xz-libs-5.2.5-8.el9_0.x86_64
zip-3.0-35.el9.x86_64
zlib-1.2.11-40.el9.x86_64
zstd-1.5.1-2.el9.x86_64
Complete!
No matches found for the following disable plugin patterns: local, spacewalk, versionlock
Updating Subscription Management repositories.
Unable to read consumer identity
This system is not registered with an entitlement server. You can use subscription-manager to register.
Copr repository 30 kB/s | 1.8 kB 00:00
Copr repository 461 kB/s | 68 kB 00:00
Additional repo https_download_opensuse_org_rep 5.1 kB/s | 1.7 kB 00:00
Additional repo https_download_opensuse_org_rep 5.1 kB/s | 1.7 kB 00:00
Additional repo https_download_opensuse_org_rep 5.0 kB/s | 1.7 kB 00:00
Additional repo https_raw_githubusercontent_com 39 kB/s | 3.0 kB 00:00
Red Hat Enterprise Linux - BaseOS 16 kB/s | 4.1 kB 00:00
Red Hat Enterprise Linux - AppStream 25 kB/s | 4.5 kB 00:00
Red Hat Enterprise Linux - CodeReady Linux Buil 24 kB/s | 4.5 kB 00:00
Extra Packages for Enterprise Linux 9 - x86_64 99 kB/s | 9.7 kB 00:00
Dependencies resolved.
==================================================================================================================================================================================================
Package Arch Version Repository Size
==================================================================================================================================================================================================
Installing:
javapackages-tools-compat noarch 1.0.2-11.9 https_download_opensuse_org_repositories_home_sbluhm_branches_systemsmanagement_Uyuni_Master_Other_EL_EL_9 13 k
make x86_64 1:4.3-7.el9 baseos 542 k
Installing dependencies:
alsa-lib x86_64 1.2.9-1.el9 appstream 523 k
apache-commons-cli noarch 1.4-17.el9 appstream 73 k
apache-commons-codec noarch 1.15-7.el9 appstream 304 k
apache-commons-compress noarch 1.21-3.el9 codeready-builder 571 k
apache-commons-io noarch 1:2.11.0-4.el9 https_raw_githubusercontent_com_sbluhm_spacewalk_support_master_packages 321 k
apache-commons-lang3 noarch 3.12.0-6.el9 appstream 561 k
atinject noarch 1.0.3-6.el9 appstream 25 k
avahi-libs x86_64 0.8-15.el9 baseos 71 k
beust-jcommander noarch 1.78-9.el9 codeready-builder 93 k
cal10n noarch 0.8.1.10-40.23 https_download_opensuse_org_repositories_home_sbluhm_branches_systemsmanagement_Uyuni_Master_Other_EL_EL_9 50 k
cdi-api noarch 2.0.2-6.el9 appstream 56 k
copy-jdk-configs noarch 4.0-3.el9 appstream 29 k
crypto-policies-scripts noarch 20230731-1.git94f0e2c.el9_3.1 baseos 97 k
cups-libs x86_64 1:2.3.3op2-21.el9 baseos 265 k
dbus-libs x86_64 1:1.12.20-8.el9 baseos 154 k
dejavu-sans-fonts noarch 2.37-18.el9 baseos 1.3 M
expat x86_64 2.5.0-1.el9_3.1 baseos 119 k
fontconfig x86_64 2.14.0-2.el9_1 appstream 301 k
fonts-filesystem noarch 1:2.0.5-7.el9.1 baseos 11 k
freetype x86_64 2.10.4-9.el9 baseos 391 k
glib2 x86_64 2.68.4-11.el9 baseos 2.6 M
gnutls x86_64 3.7.6-23.el9_3.4 baseos 1.0 M
google-guice noarch 4.2.3-9.el9 appstream 474 k
graphite2 x86_64 1.3.14-9.el9 baseos 98 k
guava noarch 30.1.1-2.71 https_download_opensuse_org_repositories_home_sbluhm_branches_systemsmanagement_Uyuni_Master_Other_EL_9 2.4 M
harfbuzz x86_64 2.7.4-8.el9 baseos 629 k
httpcomponents-client noarch 4.5.13-3.el9 appstream 659 k
httpcomponents-core noarch 4.4.13-7.el9 appstream 635 k
jakarta-annotations noarch 1.3.5-13.el9 appstream 48 k
jansi x86_64 2.3.3-6.el9 appstream 113 k
java-11-openjdk x86_64 1:11.0.23.0.9-3.el9 appstream 438 k
java-11-openjdk-headless x86_64 1:11.0.23.0.9-3.el9 appstream 40 M
javapackages-filesystem noarch 6.0.0-4.el9 appstream 17 k
javapackages-tools noarch 6.0.0-4.el9 appstream 29 k
jcl-over-slf4j noarch 1.7.36-6.40 https_download_opensuse_org_repositories_home_sbluhm_branches_systemsmanagement_Uyuni_Master_Other_EL_9 25 k
jsoup noarch 1.13.1-10.el9 appstream 379 k
jsr-305 noarch 3.0.2-6.el9 appstream 40 k
langpacks-core-font-en noarch 3.0-16.el9 appstream 11 k
libX11 x86_64 1.7.0-8.el9 appstream 652 k
libX11-common noarch 1.7.0-8.el9 appstream 209 k
libXau x86_64 1.0.9-8.el9 appstream 34 k
libXcomposite x86_64 0.4.5-7.el9 appstream 26 k
libXext x86_64 1.3.4-8.el9 appstream 42 k
libXi x86_64 1.7.10-8.el9 appstream 41 k
libXrender x86_64 0.9.10-16.el9 appstream 30 k
libXtst x86_64 1.2.3-16.el9 appstream 23 k
libfontenc x86_64 1.1.3-17.el9 appstream 33 k
libpng x86_64 2:1.6.37-12.el9 baseos 119 k
libxcb x86_64 1.13.1-9.el9 appstream 247 k
lksctp-tools x86_64 1.0.19-2.el9 baseos 98 k
lua x86_64 5.4.4-4.el9 appstream 192 k
lua-posix x86_64 35.0-8.el9 appstream 155 k
maven noarch 1:3.6.3-15.el9 appstream 21 k
maven-lib noarch 1:3.6.3-15.el9 appstream 1.5 M
maven-openjdk11 noarch 1:3.6.3-15.el9 appstream 9.3 k
maven-resolver noarch 1:1.6.1-10.el9 appstream 521 k
maven-shared-utils noarch 3.3.4-3.el9 appstream 153 k
maven-wagon noarch 3.4.2-7.el9 appstream 116 k
mkfontscale x86_64 1.2.1-3.el9 appstream 34 k
nettle x86_64 3.8-3.el9_0 baseos 552 k
nspr x86_64 4.35.0-6.el9_3 appstream 138 k
nss x86_64 3.90.0-6.el9_3 appstream 709 k
nss-softokn x86_64 3.90.0-6.el9_3 appstream 387 k
nss-softokn-freebl x86_64 3.90.0-6.el9_3 appstream 309 k
nss-sysinit x86_64 3.90.0-6.el9_3 appstream 21 k
nss-util x86_64 3.90.0-6.el9_3 appstream 90 k
objectweb-asm noarch 9.3-2.78 https_download_opensuse_org_repositories_home_sbluhm_branches_systemsmanagement_Uyuni_Master_Other_EL_9 371 k
plexus-cipher noarch 1.7-27.el9 appstream 28 k
plexus-classworlds noarch 2.6.0-11.el9 appstream 62 k
plexus-containers-component-annotations noarch 2.1.1-2.el9 https_raw_githubusercontent_com_sbluhm_spacewalk_support_master_packages 18 k
plexus-interpolation noarch 1.26-11.el9 appstream 81 k
plexus-sec-dispatcher noarch 1.4-37.el9 appstream 35 k
plexus-utils noarch 3.3.0-10.el9 appstream 256 k
publicsuffix-list noarch 20210518-3.el9 appstream 85 k
python3 x86_64 3.9.18-1.el9_3.1 baseos 29 k
python3-libs x86_64 3.9.18-1.el9_3.1 baseos 7.8 M
python3-pip-wheel noarch 21.2.3-7.el9_3.1 baseos 1.1 M
python3-setuptools-wheel noarch 53.0.0-12.el9 baseos 470 k
sisu noarch 1:0.3.4-10.el9 appstream 511 k
slf4j noarch 1.7.36-6.40 https_download_opensuse_org_repositories_home_sbluhm_branches_systemsmanagement_Uyuni_Master_Other_EL_9 64 k
ttmkfdir x86_64 3.0.9-65.el9 appstream 55 k
tzdata-java noarch 2024a-1.el9 appstream 234 k
xml-common noarch 0.6.3-58.el9 appstream 36 k
xmvn-core noarch 4.0.0-2.el9 codeready-builder 125 k
xmvn-minimal noarch 4.0.0-2.el9 codeready-builder 62 k
xmvn-tools noarch 4.0.0-2.el9 codeready-builder 118 k
xorg-x11-fonts-Type1 noarch 7.5-33.el9 appstream 509 k
Transaction Summary
==================================================================================================================================================================================================
Install 89 Packages
Total size: 74 M
Installed size: 268 M
Downloading Packages:
[SKIPPED] guava-30.1.1-2.71.noarch.rpm: Already downloaded
[SKIPPED] jcl-over-slf4j-1.7.36-6.40.noarch.rpm: Already downloaded
[SKIPPED] objectweb-asm-9.3-2.78.noarch.rpm: Already downloaded
[SKIPPED] slf4j-1.7.36-6.40.noarch.rpm: Already downloaded
[SKIPPED] cal10n-0.8.1.10-40.23.noarch.rpm: Already downloaded
[SKIPPED] javapackages-tools-compat-1.0.2-11.9.noarch.rpm: Already downloaded
[SKIPPED] apache-commons-io-2.11.0-4.el9.noarch.rpm: Already downloaded
[SKIPPED] plexus-containers-component-annotations-2.1.1-2.el9.noarch.rpm: Already downloaded
[SKIPPED] dejavu-sans-fonts-2.37-18.el9.noarch.rpm: Already downloaded
[SKIPPED] fonts-filesystem-2.0.5-7.el9.1.noarch.rpm: Already downloaded
[SKIPPED] graphite2-1.3.14-9.el9.x86_64.rpm: Already downloaded
[SKIPPED] libpng-1.6.37-12.el9.x86_64.rpm: Already downloaded
[SKIPPED] make-4.3-7.el9.x86_64.rpm: Already downloaded
[SKIPPED] lksctp-tools-1.0.19-2.el9.x86_64.rpm: Already downloaded
[SKIPPED] nettle-3.8-3.el9_0.x86_64.rpm: Already downloaded
[SKIPPED] freetype-2.10.4-9.el9.x86_64.rpm: Already downloaded
[SKIPPED] harfbuzz-2.7.4-8.el9.x86_64.rpm: Already downloaded
[SKIPPED] python3-setuptools-wheel-53.0.0-12.el9.noarch.rpm: Already downloaded
[SKIPPED] avahi-libs-0.8-15.el9.x86_64.rpm: Already downloaded
[SKIPPED] crypto-policies-scripts-20230731-1.git94f0e2c.el9_3.1.noarch.rpm: Already downloaded
[SKIPPED] cups-libs-2.3.3op2-21.el9.x86_64.rpm: Already downloaded
[SKIPPED] dbus-libs-1.12.20-8.el9.x86_64.rpm: Already downloaded
[SKIPPED] glib2-2.68.4-11.el9.x86_64.rpm: Already downloaded
[SKIPPED] python3-3.9.18-1.el9_3.1.x86_64.rpm: Already downloaded
[SKIPPED] python3-libs-3.9.18-1.el9_3.1.x86_64.rpm: Already downloaded
[SKIPPED] python3-pip-wheel-21.2.3-7.el9_3.1.noarch.rpm: Already downloaded
[SKIPPED] expat-2.5.0-1.el9_3.1.x86_64.rpm: Already downloaded
[SKIPPED] gnutls-3.7.6-23.el9_3.4.x86_64.rpm: Already downloaded
[SKIPPED] copy-jdk-configs-4.0-3.el9.noarch.rpm: Already downloaded
[SKIPPED] libXext-1.3.4-8.el9.x86_64.rpm: Already downloaded
[SKIPPED] libXtst-1.2.3-16.el9.x86_64.rpm: Already downloaded
[SKIPPED] publicsuffix-list-20210518-3.el9.noarch.rpm: Already downloaded
[SKIPPED] langpacks-core-font-en-3.0-16.el9.noarch.rpm: Already downloaded
[SKIPPED] lua-posix-35.0-8.el9.x86_64.rpm: Already downloaded
[SKIPPED] mkfontscale-1.2.1-3.el9.x86_64.rpm: Already downloaded
[SKIPPED] libXi-1.7.10-8.el9.x86_64.rpm: Already downloaded
[SKIPPED] ttmkfdir-3.0.9-65.el9.x86_64.rpm: Already downloaded
[SKIPPED] libXcomposite-0.4.5-7.el9.x86_64.rpm: Already downloaded
[SKIPPED] libfontenc-1.1.3-17.el9.x86_64.rpm: Already downloaded
[SKIPPED] xml-common-0.6.3-58.el9.noarch.rpm: Already downloaded
[SKIPPED] libXau-1.0.9-8.el9.x86_64.rpm: Already downloaded
[SKIPPED] libXrender-0.9.10-16.el9.x86_64.rpm: Already downloaded
[SKIPPED] libxcb-1.13.1-9.el9.x86_64.rpm: Already downloaded
[SKIPPED] xorg-x11-fonts-Type1-7.5-33.el9.noarch.rpm: Already downloaded
[SKIPPED] fontconfig-2.14.0-2.el9_1.x86_64.rpm: Already downloaded
[SKIPPED] apache-commons-cli-1.4-17.el9.noarch.rpm: Already downloaded
[SKIPPED] apache-commons-codec-1.15-7.el9.noarch.rpm: Already downloaded
[SKIPPED] apache-commons-lang3-3.12.0-6.el9.noarch.rpm: Already downloaded
[SKIPPED] atinject-1.0.3-6.el9.noarch.rpm: Already downloaded
[SKIPPED] cdi-api-2.0.2-6.el9.noarch.rpm: Already downloaded
[SKIPPED] google-guice-4.2.3-9.el9.noarch.rpm: Already downloaded
[SKIPPED] httpcomponents-client-4.5.13-3.el9.noarch.rpm: Already downloaded
[SKIPPED] httpcomponents-core-4.4.13-7.el9.noarch.rpm: Already downloaded
[SKIPPED] jakarta-annotations-1.3.5-13.el9.noarch.rpm: Already downloaded
[SKIPPED] jansi-2.3.3-6.el9.x86_64.rpm: Already downloaded
[SKIPPED] maven-3.6.3-15.el9.noarch.rpm: Already downloaded
[SKIPPED] maven-resolver-1.6.1-10.el9.noarch.rpm: Already downloaded
[SKIPPED] maven-shared-utils-3.3.4-3.el9.noarch.rpm: Already downloaded
[SKIPPED] maven-wagon-3.4.2-7.el9.noarch.rpm: Already downloaded
[SKIPPED] plexus-cipher-1.7-27.el9.noarch.rpm: Already downloaded
[SKIPPED] plexus-classworlds-2.6.0-11.el9.noarch.rpm: Already downloaded
[SKIPPED] plexus-interpolation-1.26-11.el9.noarch.rpm: Already downloaded
[SKIPPED] plexus-utils-3.3.0-10.el9.noarch.rpm: Already downloaded
[SKIPPED] javapackages-filesystem-6.0.0-4.el9.noarch.rpm: Already downloaded
[SKIPPED] javapackages-tools-6.0.0-4.el9.noarch.rpm: Already downloaded
[SKIPPED] jsoup-1.13.1-10.el9.noarch.rpm: Already downloaded
[SKIPPED] jsr-305-3.0.2-6.el9.noarch.rpm: Already downloaded
[SKIPPED] maven-lib-3.6.3-15.el9.noarch.rpm: Already downloaded
[SKIPPED] maven-openjdk11-3.6.3-15.el9.noarch.rpm: Already downloaded
[SKIPPED] plexus-sec-dispatcher-1.4-37.el9.noarch.rpm: Already downloaded
[SKIPPED] sisu-0.3.4-10.el9.noarch.rpm: Already downloaded
[SKIPPED] alsa-lib-1.2.9-1.el9.x86_64.rpm: Already downloaded
[SKIPPED] libX11-common-1.7.0-8.el9.noarch.rpm: Already downloaded
[SKIPPED] lua-5.4.4-4.el9.x86_64.rpm: Already downloaded
[SKIPPED] libX11-1.7.0-8.el9.x86_64.rpm: Already downloaded
[SKIPPED] tzdata-java-2024a-1.el9.noarch.rpm: Already downloaded
[SKIPPED] nspr-4.35.0-6.el9_3.x86_64.rpm: Already downloaded
[SKIPPED] nss-3.90.0-6.el9_3.x86_64.rpm: Already downloaded
[SKIPPED] nss-softokn-3.90.0-6.el9_3.x86_64.rpm: Already downloaded
[SKIPPED] nss-softokn-freebl-3.90.0-6.el9_3.x86_64.rpm: Already downloaded
[SKIPPED] nss-sysinit-3.90.0-6.el9_3.x86_64.rpm: Already downloaded
[SKIPPED] nss-util-3.90.0-6.el9_3.x86_64.rpm: Already downloaded
[SKIPPED] java-11-openjdk-11.0.23.0.9-3.el9.x86_64.rpm: Already downloaded
[SKIPPED] java-11-openjdk-headless-11.0.23.0.9-3.el9.x86_64.rpm: Already downloaded
[SKIPPED] beust-jcommander-1.78-9.el9.noarch.rpm: Already downloaded
[SKIPPED] xmvn-core-4.0.0-2.el9.noarch.rpm: Already downloaded
[SKIPPED] apache-commons-compress-1.21-3.el9.noarch.rpm: Already downloaded
[SKIPPED] xmvn-minimal-4.0.0-2.el9.noarch.rpm: Already downloaded
[SKIPPED] xmvn-tools-4.0.0-2.el9.noarch.rpm: Already downloaded
Running transaction check
Transaction check succeeded.
Running transaction test
Transaction test succeeded.
Running transaction
Running scriptlet: copy-jdk-configs-4.0-3.el9.noarch 1/1
Running scriptlet: java-11-openjdk-headless-1:11.0.23.0.9-3.el9.x86_64 1/1
Running scriptlet: xmvn-minimal-4.0.0-2.el9.noarch 1/1
Preparing : 1/1
Installing : javapackages-filesystem-6.0.0-4.el9.noarch 1/89
Installing : nspr-4.35.0-6.el9_3.x86_64 2/89
Installing : nss-util-3.90.0-6.el9_3.x86_64 3/89
Installing : fonts-filesystem-1:2.0.5-7.el9.1.noarch 4/89
Installing : dejavu-sans-fonts-2.37-18.el9.noarch 5/89
Installing : langpacks-core-font-en-3.0-16.el9.noarch 6/89
Installing : nss-softokn-freebl-3.90.0-6.el9_3.x86_64 7/89
Installing : nss-softokn-3.90.0-6.el9_3.x86_64 8/89
Installing : tzdata-java-2024a-1.el9.noarch 9/89
Installing : lua-5.4.4-4.el9.x86_64 10/89
Installing : libX11-common-1.7.0-8.el9.noarch 11/89
Installing : alsa-lib-1.2.9-1.el9.x86_64 12/89
Installing : libXau-1.0.9-8.el9.x86_64 13/89
Installing : libxcb-1.13.1-9.el9.x86_64 14/89
Installing : libX11-1.7.0-8.el9.x86_64 15/89
Installing : libXext-1.3.4-8.el9.x86_64 16/89
Installing : libXi-1.7.10-8.el9.x86_64 17/89
Installing : libXtst-1.2.3-16.el9.x86_64 18/89
Installing : libXcomposite-0.4.5-7.el9.x86_64 19/89
Installing : libXrender-0.9.10-16.el9.x86_64 20/89
Running scriptlet: xml-common-0.6.3-58.el9.noarch 21/89
Installing : xml-common-0.6.3-58.el9.noarch 21/89
Installing : libfontenc-1.1.3-17.el9.x86_64 22/89
Installing : lua-posix-35.0-8.el9.x86_64 23/89
Installing : copy-jdk-configs-4.0-3.el9.noarch 24/89
Installing : publicsuffix-list-20210518-3.el9.noarch 25/89
Installing : expat-2.5.0-1.el9_3.1.x86_64 26/89
Installing : python3-pip-wheel-21.2.3-7.el9_3.1.noarch 27/89
Installing : dbus-libs-1:1.12.20-8.el9.x86_64 28/89
Installing : avahi-libs-0.8-15.el9.x86_64 29/89
Installing : python3-setuptools-wheel-53.0.0-12.el9.noarch 30/89
Installing : python3-3.9.18-1.el9_3.1.x86_64 31/89
Installing : python3-libs-3.9.18-1.el9_3.1.x86_64 32/89
Installing : crypto-policies-scripts-20230731-1.git94f0e2c.el9_ 33/89
Installing : nss-sysinit-3.90.0-6.el9_3.x86_64 34/89
Installing : nss-3.90.0-6.el9_3.x86_64 35/89
Running scriptlet: nss-3.90.0-6.el9_3.x86_64 35/89
Installing : nettle-3.8-3.el9_0.x86_64 36/89
Installing : gnutls-3.7.6-23.el9_3.4.x86_64 37/89
Installing : cups-libs-1:2.3.3op2-21.el9.x86_64 38/89
Installing : glib2-2.68.4-11.el9.x86_64 39/89
Installing : lksctp-tools-1.0.19-2.el9.x86_64 40/89
Installing : java-11-openjdk-headless-1:11.0.23.0.9-3.el9.x86_6 41/89
Running scriptlet: java-11-openjdk-headless-1:11.0.23.0.9-3.el9.x86_6 41/89
Installing : plexus-utils-3.3.0-10.el9.noarch 42/89
Installing : atinject-1.0.3-6.el9.noarch 43/89
Installing : plexus-containers-component-annotations-2.1.1-2.el 44/89
Installing : apache-commons-lang3-3.12.0-6.el9.noarch 45/89
Installing : plexus-cipher-1.7-27.el9.noarch 46/89
Installing : plexus-classworlds-2.6.0-11.el9.noarch 47/89
Installing : plexus-sec-dispatcher-1.4-37.el9.noarch 48/89
Installing : objectweb-asm-9.3-2.78.noarch 49/89
Installing : apache-commons-io-1:2.11.0-4.el9.noarch 50/89
Installing : apache-commons-cli-1.4-17.el9.noarch 51/89
Installing : httpcomponents-core-4.4.13-7.el9.noarch 52/89
Installing : plexus-interpolation-1.26-11.el9.noarch 53/89
Installing : beust-jcommander-1.78-9.el9.noarch 54/89
Installing : xmvn-core-4.0.0-2.el9.noarch 55/89
Installing : apache-commons-compress-1.21-3.el9.noarch 56/89
Installing : maven-shared-utils-3.3.4-3.el9.noarch 57/89
Installing : cdi-api-2.0.2-6.el9.noarch 58/89
Installing : sisu-1:0.3.4-10.el9.noarch 59/89
Installing : apache-commons-codec-1.15-7.el9.noarch 60/89
Installing : httpcomponents-client-4.5.13-3.el9.noarch 61/89
Installing : jakarta-annotations-1.3.5-13.el9.noarch 62/89
Installing : jansi-2.3.3-6.el9.x86_64 63/89
Installing : javapackages-tools-6.0.0-4.el9.noarch 64/89
Installing : jsoup-1.13.1-10.el9.noarch 65/89
Installing : jsr-305-3.0.2-6.el9.noarch 66/89
Installing : guava-30.1.1-2.71.noarch 67/89
Installing : google-guice-4.2.3-9.el9.noarch 68/89
Installing : libpng-2:1.6.37-12.el9.x86_64 69/89
Installing : graphite2-1.3.14-9.el9.x86_64 70/89
Installing : freetype-2.10.4-9.el9.x86_64 71/89
Installing : harfbuzz-2.7.4-8.el9.x86_64 72/89
Installing : fontconfig-2.14.0-2.el9_1.x86_64 73/89
Running scriptlet: fontconfig-2.14.0-2.el9_1.x86_64 73/89
Installing : mkfontscale-1.2.1-3.el9.x86_64 74/89
Installing : ttmkfdir-3.0.9-65.el9.x86_64 75/89
Installing : xorg-x11-fonts-Type1-7.5-33.el9.noarch 76/89
Running scriptlet: xorg-x11-fonts-Type1-7.5-33.el9.noarch 76/89
Installing : java-11-openjdk-1:11.0.23.0.9-3.el9.x86_64 77/89
Running scriptlet: java-11-openjdk-1:11.0.23.0.9-3.el9.x86_64 77/89
Installing : cal10n-0.8.1.10-40.23.noarch 78/89
Installing : slf4j-1.7.36-6.40.noarch 79/89
Installing : xmvn-tools-4.0.0-2.el9.noarch 80/89
Installing : jcl-over-slf4j-1.7.36-6.40.noarch 81/89
Installing : maven-wagon-3.4.2-7.el9.noarch 82/89
Installing : maven-resolver-1:1.6.1-10.el9.noarch 83/89
Installing : maven-openjdk11-1:3.6.3-15.el9.noarch 84/89
Installing : maven-1:3.6.3-15.el9.noarch 85/89
Running scriptlet: maven-1:3.6.3-15.el9.noarch 85/89
Installing : maven-lib-1:3.6.3-15.el9.noarch 86/89
Installing : xmvn-minimal-4.0.0-2.el9.noarch 87/89
Installing : javapackages-tools-compat-1.0.2-11.9.noarch 88/89
Installing : make-1:4.3-7.el9.x86_64 89/89
Running scriptlet: copy-jdk-configs-4.0-3.el9.noarch 89/89
Running scriptlet: crypto-policies-scripts-20230731-1.git94f0e2c.el9_ 89/89
Running scriptlet: nss-3.90.0-6.el9_3.x86_64 89/89
Running scriptlet: java-11-openjdk-headless-1:11.0.23.0.9-3.el9.x86_6 89/89
Running scriptlet: fontconfig-2.14.0-2.el9_1.x86_64 89/89
Running scriptlet: java-11-openjdk-1:11.0.23.0.9-3.el9.x86_64 89/89
Running scriptlet: make-1:4.3-7.el9.x86_64 89/89
Verifying : guava-30.1.1-2.71.noarch 1/89
Verifying : jcl-over-slf4j-1.7.36-6.40.noarch 2/89
Verifying : objectweb-asm-9.3-2.78.noarch 3/89
Verifying : slf4j-1.7.36-6.40.noarch 4/89
Verifying : cal10n-0.8.1.10-40.23.noarch 5/89
Verifying : javapackages-tools-compat-1.0.2-11.9.noarch 6/89
Verifying : apache-commons-io-1:2.11.0-4.el9.noarch 7/89
Verifying : plexus-containers-component-annotations-2.1.1-2.el 8/89
Verifying : dejavu-sans-fonts-2.37-18.el9.noarch 9/89
Verifying : fonts-filesystem-1:2.0.5-7.el9.1.noarch 10/89
Verifying : graphite2-1.3.14-9.el9.x86_64 11/89
Verifying : libpng-2:1.6.37-12.el9.x86_64 12/89
Verifying : make-1:4.3-7.el9.x86_64 13/89
Verifying : lksctp-tools-1.0.19-2.el9.x86_64 14/89
Verifying : nettle-3.8-3.el9_0.x86_64 15/89
Verifying : freetype-2.10.4-9.el9.x86_64 16/89
Verifying : harfbuzz-2.7.4-8.el9.x86_64 17/89
Verifying : python3-setuptools-wheel-53.0.0-12.el9.noarch 18/89
Verifying : avahi-libs-0.8-15.el9.x86_64 19/89
Verifying : crypto-policies-scripts-20230731-1.git94f0e2c.el9_ 20/89
Verifying : cups-libs-1:2.3.3op2-21.el9.x86_64 21/89
Verifying : dbus-libs-1:1.12.20-8.el9.x86_64 22/89
Verifying : glib2-2.68.4-11.el9.x86_64 23/89
Verifying : python3-3.9.18-1.el9_3.1.x86_64 24/89
Verifying : python3-libs-3.9.18-1.el9_3.1.x86_64 25/89
Verifying : python3-pip-wheel-21.2.3-7.el9_3.1.noarch 26/89
Verifying : expat-2.5.0-1.el9_3.1.x86_64 27/89
Verifying : gnutls-3.7.6-23.el9_3.4.x86_64 28/89
Verifying : copy-jdk-configs-4.0-3.el9.noarch 29/89
Verifying : libXext-1.3.4-8.el9.x86_64 30/89
Verifying : libXtst-1.2.3-16.el9.x86_64 31/89
Verifying : publicsuffix-list-20210518-3.el9.noarch 32/89
Verifying : langpacks-core-font-en-3.0-16.el9.noarch 33/89
Verifying : lua-posix-35.0-8.el9.x86_64 34/89
Verifying : mkfontscale-1.2.1-3.el9.x86_64 35/89
Verifying : libXi-1.7.10-8.el9.x86_64 36/89
Verifying : ttmkfdir-3.0.9-65.el9.x86_64 37/89
Verifying : libXcomposite-0.4.5-7.el9.x86_64 38/89
Verifying : libfontenc-1.1.3-17.el9.x86_64 39/89
Verifying : xml-common-0.6.3-58.el9.noarch 40/89
Verifying : libXau-1.0.9-8.el9.x86_64 41/89
Verifying : libXrender-0.9.10-16.el9.x86_64 42/89
Verifying : libxcb-1.13.1-9.el9.x86_64 43/89
Verifying : xorg-x11-fonts-Type1-7.5-33.el9.noarch 44/89
Verifying : fontconfig-2.14.0-2.el9_1.x86_64 45/89
Verifying : apache-commons-cli-1.4-17.el9.noarch 46/89
Verifying : apache-commons-codec-1.15-7.el9.noarch 47/89
Verifying : apache-commons-lang3-3.12.0-6.el9.noarch 48/89
Verifying : atinject-1.0.3-6.el9.noarch 49/89
Verifying : cdi-api-2.0.2-6.el9.noarch 50/89
Verifying : google-guice-4.2.3-9.el9.noarch 51/89
Verifying : httpcomponents-client-4.5.13-3.el9.noarch 52/89
Verifying : httpcomponents-core-4.4.13-7.el9.noarch 53/89
Verifying : jakarta-annotations-1.3.5-13.el9.noarch 54/89
Verifying : jansi-2.3.3-6.el9.x86_64 55/89
Verifying : maven-1:3.6.3-15.el9.noarch 56/89
Verifying : maven-resolver-1:1.6.1-10.el9.noarch 57/89
Verifying : maven-shared-utils-3.3.4-3.el9.noarch 58/89
Verifying : maven-wagon-3.4.2-7.el9.noarch 59/89
Verifying : plexus-cipher-1.7-27.el9.noarch 60/89
Verifying : plexus-classworlds-2.6.0-11.el9.noarch 61/89
Verifying : plexus-interpolation-1.26-11.el9.noarch 62/89
Verifying : plexus-utils-3.3.0-10.el9.noarch 63/89
Verifying : javapackages-filesystem-6.0.0-4.el9.noarch 64/89
Verifying : javapackages-tools-6.0.0-4.el9.noarch 65/89
Verifying : jsoup-1.13.1-10.el9.noarch 66/89
Verifying : jsr-305-3.0.2-6.el9.noarch 67/89
Verifying : maven-lib-1:3.6.3-15.el9.noarch 68/89
Verifying : maven-openjdk11-1:3.6.3-15.el9.noarch 69/89
Verifying : plexus-sec-dispatcher-1.4-37.el9.noarch 70/89
Verifying : sisu-1:0.3.4-10.el9.noarch 71/89
Verifying : alsa-lib-1.2.9-1.el9.x86_64 72/89
Verifying : libX11-common-1.7.0-8.el9.noarch 73/89
Verifying : lua-5.4.4-4.el9.x86_64 74/89
Verifying : libX11-1.7.0-8.el9.x86_64 75/89
Verifying : tzdata-java-2024a-1.el9.noarch 76/89
Verifying : nspr-4.35.0-6.el9_3.x86_64 77/89
Verifying : nss-3.90.0-6.el9_3.x86_64 78/89
Verifying : nss-softokn-3.90.0-6.el9_3.x86_64 79/89
Verifying : nss-softokn-freebl-3.90.0-6.el9_3.x86_64 80/89
Verifying : nss-sysinit-3.90.0-6.el9_3.x86_64 81/89
Verifying : nss-util-3.90.0-6.el9_3.x86_64 82/89
Verifying : java-11-openjdk-1:11.0.23.0.9-3.el9.x86_64 83/89
Verifying : java-11-openjdk-headless-1:11.0.23.0.9-3.el9.x86_6 84/89
Verifying : beust-jcommander-1.78-9.el9.noarch 85/89
Verifying : xmvn-core-4.0.0-2.el9.noarch 86/89
Verifying : apache-commons-compress-1.21-3.el9.noarch 87/89
Verifying : xmvn-minimal-4.0.0-2.el9.noarch 88/89
Verifying : xmvn-tools-4.0.0-2.el9.noarch 89/89
Installed products updated.
Installed:
alsa-lib-1.2.9-1.el9.x86_64
apache-commons-cli-1.4-17.el9.noarch
apache-commons-codec-1.15-7.el9.noarch
apache-commons-compress-1.21-3.el9.noarch
apache-commons-io-1:2.11.0-4.el9.noarch
apache-commons-lang3-3.12.0-6.el9.noarch
atinject-1.0.3-6.el9.noarch
avahi-libs-0.8-15.el9.x86_64
beust-jcommander-1.78-9.el9.noarch
cal10n-0.8.1.10-40.23.noarch
cdi-api-2.0.2-6.el9.noarch
copy-jdk-configs-4.0-3.el9.noarch
crypto-policies-scripts-20230731-1.git94f0e2c.el9_3.1.noarch
cups-libs-1:2.3.3op2-21.el9.x86_64
dbus-libs-1:1.12.20-8.el9.x86_64
dejavu-sans-fonts-2.37-18.el9.noarch
expat-2.5.0-1.el9_3.1.x86_64
fontconfig-2.14.0-2.el9_1.x86_64
fonts-filesystem-1:2.0.5-7.el9.1.noarch
freetype-2.10.4-9.el9.x86_64
glib2-2.68.4-11.el9.x86_64
gnutls-3.7.6-23.el9_3.4.x86_64
google-guice-4.2.3-9.el9.noarch
graphite2-1.3.14-9.el9.x86_64
guava-30.1.1-2.71.noarch
harfbuzz-2.7.4-8.el9.x86_64
httpcomponents-client-4.5.13-3.el9.noarch
httpcomponents-core-4.4.13-7.el9.noarch
jakarta-annotations-1.3.5-13.el9.noarch
jansi-2.3.3-6.el9.x86_64
java-11-openjdk-1:11.0.23.0.9-3.el9.x86_64
java-11-openjdk-headless-1:11.0.23.0.9-3.el9.x86_64
javapackages-filesystem-6.0.0-4.el9.noarch
javapackages-tools-6.0.0-4.el9.noarch
javapackages-tools-compat-1.0.2-11.9.noarch
jcl-over-slf4j-1.7.36-6.40.noarch
jsoup-1.13.1-10.el9.noarch
jsr-305-3.0.2-6.el9.noarch
langpacks-core-font-en-3.0-16.el9.noarch
libX11-1.7.0-8.el9.x86_64
libX11-common-1.7.0-8.el9.noarch
libXau-1.0.9-8.el9.x86_64
libXcomposite-0.4.5-7.el9.x86_64
libXext-1.3.4-8.el9.x86_64
libXi-1.7.10-8.el9.x86_64
libXrender-0.9.10-16.el9.x86_64
libXtst-1.2.3-16.el9.x86_64
libfontenc-1.1.3-17.el9.x86_64
libpng-2:1.6.37-12.el9.x86_64
libxcb-1.13.1-9.el9.x86_64
lksctp-tools-1.0.19-2.el9.x86_64
lua-5.4.4-4.el9.x86_64
lua-posix-35.0-8.el9.x86_64
make-1:4.3-7.el9.x86_64
maven-1:3.6.3-15.el9.noarch
maven-lib-1:3.6.3-15.el9.noarch
maven-openjdk11-1:3.6.3-15.el9.noarch
maven-resolver-1:1.6.1-10.el9.noarch
maven-shared-utils-3.3.4-3.el9.noarch
maven-wagon-3.4.2-7.el9.noarch
mkfontscale-1.2.1-3.el9.x86_64
nettle-3.8-3.el9_0.x86_64
nspr-4.35.0-6.el9_3.x86_64
nss-3.90.0-6.el9_3.x86_64
nss-softokn-3.90.0-6.el9_3.x86_64
nss-softokn-freebl-3.90.0-6.el9_3.x86_64
nss-sysinit-3.90.0-6.el9_3.x86_64
nss-util-3.90.0-6.el9_3.x86_64
objectweb-asm-9.3-2.78.noarch
plexus-cipher-1.7-27.el9.noarch
plexus-classworlds-2.6.0-11.el9.noarch
plexus-containers-component-annotations-2.1.1-2.el9.noarch
plexus-interpolation-1.26-11.el9.noarch
plexus-sec-dispatcher-1.4-37.el9.noarch
plexus-utils-3.3.0-10.el9.noarch
publicsuffix-list-20210518-3.el9.noarch
python3-3.9.18-1.el9_3.1.x86_64
python3-libs-3.9.18-1.el9_3.1.x86_64
python3-pip-wheel-21.2.3-7.el9_3.1.noarch
python3-setuptools-wheel-53.0.0-12.el9.noarch
sisu-1:0.3.4-10.el9.noarch
slf4j-1.7.36-6.40.noarch
ttmkfdir-3.0.9-65.el9.x86_64
tzdata-java-2024a-1.el9.noarch
xml-common-0.6.3-58.el9.noarch
xmvn-core-4.0.0-2.el9.noarch
xmvn-minimal-4.0.0-2.el9.noarch
xmvn-tools-4.0.0-2.el9.noarch
xorg-x11-fonts-Type1-7.5-33.el9.noarch
Complete!
Finish: installing minimal buildroot with dnf
Start: creating root cache
Finish: creating root cache
Finish: chroot init
INFO: Installed packages:
INFO: alsa-lib-1.2.9-1.el9.x86_64
alternatives-1.24-1.el9.x86_64
ansible-srpm-macros-1-12.el9.noarch
apache-commons-cli-1.4-17.el9.noarch
apache-commons-codec-1.15-7.el9.noarch
apache-commons-compress-1.21-3.el9.noarch
apache-commons-io-2.11.0-4.el9.noarch
apache-commons-lang3-3.12.0-6.el9.noarch
atinject-1.0.3-6.el9.noarch
audit-libs-3.0.7-104.el9.x86_64
avahi-libs-0.8-15.el9.x86_64
basesystem-11-13.el9.noarch
bash-5.1.8-6.el9_1.x86_64
beust-jcommander-1.78-9.el9.noarch
binutils-2.35.2-42.el9_3.1.x86_64
binutils-gold-2.35.2-42.el9_3.1.x86_64
bzip2-1.0.8-8.el9.x86_64
bzip2-libs-1.0.8-8.el9.x86_64
ca-certificates-2023.2.60_v7.0.306-90.1.el9_2.noarch
cal10n-0.8.1.10-40.23.noarch
cdi-api-2.0.2-6.el9.noarch
copy-jdk-configs-4.0-3.el9.noarch
coreutils-8.32-34.el9.x86_64
coreutils-common-8.32-34.el9.x86_64
cpio-2.13-16.el9.x86_64
cracklib-2.9.6-27.el9.x86_64
cracklib-dicts-2.9.6-27.el9.x86_64
crypto-policies-20230731-1.git94f0e2c.el9_3.1.noarch
crypto-policies-scripts-20230731-1.git94f0e2c.el9_3.1.noarch
cups-libs-2.3.3op2-21.el9.x86_64
curl-7.76.1-26.el9_3.3.x86_64
cyrus-sasl-lib-2.1.27-21.el9.x86_64
dbus-libs-1.12.20-8.el9.x86_64
debugedit-5.0-4.el9.x86_64
dejavu-sans-fonts-2.37-18.el9.noarch
diffutils-3.7-12.el9.x86_64
dwz-0.14-3.el9.x86_64
ed-1.14.2-12.el9.x86_64
efi-srpm-macros-6-2.el9_0.noarch
elfutils-0.189-3.el9.x86_64
elfutils-debuginfod-client-0.189-3.el9.x86_64
elfutils-default-yama-scope-0.189-3.el9.noarch
elfutils-libelf-0.189-3.el9.x86_64
elfutils-libs-0.189-3.el9.x86_64
epel-rpm-macros-9-14.el9.noarch
expat-2.5.0-1.el9_3.1.x86_64
file-5.39-14.el9.x86_64
file-libs-5.39-14.el9.x86_64
filesystem-3.16-2.el9.x86_64
findutils-4.8.0-6.el9.x86_64
fontconfig-2.14.0-2.el9_1.x86_64
fonts-filesystem-2.0.5-7.el9.1.noarch
fonts-srpm-macros-2.0.5-7.el9.1.noarch
forge-srpm-macros-0.3.1-1.el9.noarch
fpc-srpm-macros-1.3-7.el9.noarch
freetype-2.10.4-9.el9.x86_64
gawk-5.1.0-6.el9.x86_64
gdb-minimal-10.2-11.1.el9_3.x86_64
gdbm-libs-1.19-4.el9.x86_64
ghc-srpm-macros-1.5.0-6.el9.noarch
glib2-2.68.4-11.el9.x86_64
glibc-2.34-83.el9_3.12.x86_64
glibc-common-2.34-83.el9_3.12.x86_64
glibc-gconv-extra-2.34-83.el9_3.12.x86_64
glibc-minimal-langpack-2.34-83.el9_3.12.x86_64
gmp-6.2.0-13.el9.x86_64
gnutls-3.7.6-23.el9_3.4.x86_64
go-srpm-macros-3.2.0-2.el9.noarch
go-srpm-macros-epel-3.3.0.5-1.el9.noarch
google-guice-4.2.3-9.el9.noarch
gpg-pubkey-3228467c-613798eb
gpg-pubkey-5a6340b3-6229229e
gpg-pubkey-fd431d51-4ae0493b
graphite2-1.3.14-9.el9.x86_64
grep-3.6-5.el9.x86_64
groff-base-1.22.4-10.el9.x86_64
guava-30.1.1-2.71.noarch
gzip-1.12-1.el9.x86_64
harfbuzz-2.7.4-8.el9.x86_64
httpcomponents-client-4.5.13-3.el9.noarch
httpcomponents-core-4.4.13-7.el9.noarch
info-6.7-15.el9.x86_64
jakarta-annotations-1.3.5-13.el9.noarch
jansi-2.3.3-6.el9.x86_64
java-11-openjdk-11.0.23.0.9-3.el9.x86_64
java-11-openjdk-headless-11.0.23.0.9-3.el9.x86_64
javapackages-filesystem-6.0.0-4.el9.noarch
javapackages-tools-6.0.0-4.el9.noarch
javapackages-tools-compat-1.0.2-11.9.noarch
jcl-over-slf4j-1.7.36-6.40.noarch
jsoup-1.13.1-10.el9.noarch
jsr-305-3.0.2-6.el9.noarch
kernel-srpm-macros-1.0-13.el9.noarch
keyutils-libs-1.6.3-1.el9.x86_64
krb5-libs-1.21.1-1.el9.x86_64
langpacks-core-font-en-3.0-16.el9.noarch
libX11-1.7.0-8.el9.x86_64
libX11-common-1.7.0-8.el9.noarch
libXau-1.0.9-8.el9.x86_64
libXcomposite-0.4.5-7.el9.x86_64
libXext-1.3.4-8.el9.x86_64
libXi-1.7.10-8.el9.x86_64
libXrender-0.9.10-16.el9.x86_64
libXtst-1.2.3-16.el9.x86_64
libacl-2.3.1-3.el9.x86_64
libarchive-3.5.3-4.el9.x86_64
libattr-2.5.1-3.el9.x86_64
libblkid-2.37.4-15.el9.x86_64
libbrotli-1.0.9-6.el9.x86_64
libcap-2.48-9.el9_2.x86_64
libcap-ng-0.8.2-7.el9.x86_64
libcom_err-1.46.5-3.el9.x86_64
libcurl-7.76.1-26.el9_3.3.x86_64
libdb-5.3.28-53.el9.x86_64
libeconf-0.4.1-3.el9_2.x86_64
libevent-2.1.12-6.el9.x86_64
libfdisk-2.37.4-15.el9.x86_64
libffi-3.4.2-8.el9.x86_64
libfontenc-1.1.3-17.el9.x86_64
libgcc-11.4.1-2.1.el9.x86_64
libgcrypt-1.10.0-10.el9_2.x86_64
libgomp-11.4.1-2.1.el9.x86_64
libgpg-error-1.42-5.el9.x86_64
libidn2-2.3.0-7.el9.x86_64
libmount-2.37.4-15.el9.x86_64
libnghttp2-1.43.0-5.el9_3.1.x86_64
libpkgconf-1.7.3-10.el9.x86_64
libpng-1.6.37-12.el9.x86_64
libpsl-0.21.1-5.el9.x86_64
libpwquality-1.4.4-8.el9.x86_64
libselinux-3.5-1.el9.x86_64
libsemanage-3.5-2.el9.x86_64
libsepol-3.5-1.el9.x86_64
libsigsegv-2.13-4.el9.x86_64
libsmartcols-2.37.4-15.el9.x86_64
libssh-0.10.4-12.el9_3.x86_64
libssh-config-0.10.4-12.el9_3.noarch
libstdc++-11.4.1-2.1.el9.x86_64
libtasn1-4.16.0-8.el9_1.x86_64
libunistring-0.9.10-15.el9.x86_64
libutempter-1.2.1-6.el9.x86_64
libuuid-2.37.4-15.el9.x86_64
libverto-0.3.2-3.el9.x86_64
libxcb-1.13.1-9.el9.x86_64
libxcrypt-4.4.18-3.el9.x86_64
libxml2-2.9.13-5.el9_3.x86_64
libzstd-1.5.1-2.el9.x86_64
lksctp-tools-1.0.19-2.el9.x86_64
lua-5.4.4-4.el9.x86_64
lua-libs-5.4.4-4.el9.x86_64
lua-posix-35.0-8.el9.x86_64
lua-srpm-macros-1-6.el9.noarch
lz4-libs-1.9.3-5.el9.x86_64
make-4.3-7.el9.x86_64
maven-3.6.3-15.el9.noarch
maven-lib-3.6.3-15.el9.noarch
maven-openjdk11-3.6.3-15.el9.noarch
maven-resolver-1.6.1-10.el9.noarch
maven-shared-utils-3.3.4-3.el9.noarch
maven-wagon-3.4.2-7.el9.noarch
mkfontscale-1.2.1-3.el9.x86_64
mpfr-4.1.0-7.el9.x86_64
ncurses-6.2-10.20210508.el9.x86_64
ncurses-base-6.2-10.20210508.el9.noarch
ncurses-libs-6.2-10.20210508.el9.x86_64
nettle-3.8-3.el9_0.x86_64
nspr-4.35.0-6.el9_3.x86_64
nss-3.90.0-6.el9_3.x86_64
nss-softokn-3.90.0-6.el9_3.x86_64
nss-softokn-freebl-3.90.0-6.el9_3.x86_64
nss-sysinit-3.90.0-6.el9_3.x86_64
nss-util-3.90.0-6.el9_3.x86_64
objectweb-asm-9.3-2.78.noarch
ocaml-srpm-macros-6-6.el9.noarch
openblas-srpm-macros-2-11.el9.noarch
openldap-2.6.3-1.el9.x86_64
openssl-3.0.7-25.el9_3.x86_64
openssl-libs-3.0.7-25.el9_3.x86_64
p11-kit-0.24.1-2.el9.x86_64
p11-kit-trust-0.24.1-2.el9.x86_64
pam-1.5.1-15.el9.x86_64
patch-2.7.6-16.el9.x86_64
pcre-8.44-3.el9.3.x86_64
pcre2-10.40-2.el9.x86_64
pcre2-syntax-10.40-2.el9.noarch
perl-AutoLoader-5.74-480.el9.noarch
perl-B-1.80-480.el9.x86_64
perl-Carp-1.50-460.el9.noarch
perl-Class-Struct-0.66-480.el9.noarch
perl-Data-Dumper-2.174-462.el9.x86_64
perl-Digest-1.19-4.el9.noarch
perl-Digest-MD5-2.58-4.el9.x86_64
perl-Encode-3.08-462.el9.x86_64
perl-Errno-1.30-480.el9.x86_64
perl-Exporter-5.74-461.el9.noarch
perl-Fcntl-1.13-480.el9.x86_64
perl-File-Basename-2.85-480.el9.noarch
perl-File-Path-2.18-4.el9.noarch
perl-File-Temp-0.231.100-4.el9.noarch
perl-File-stat-1.09-480.el9.noarch
perl-FileHandle-2.03-480.el9.noarch
perl-Getopt-Long-2.52-4.el9.noarch
perl-Getopt-Std-1.12-480.el9.noarch
perl-HTTP-Tiny-0.076-461.el9.noarch
perl-IO-1.43-480.el9.x86_64
perl-IO-Socket-IP-0.41-5.el9.noarch
perl-IO-Socket-SSL-2.073-1.el9.noarch
perl-IPC-Open3-1.21-480.el9.noarch
perl-MIME-Base64-3.16-4.el9.x86_64
perl-Mozilla-CA-20200520-6.el9.noarch
perl-Net-SSLeay-1.92-2.el9.x86_64
perl-POSIX-1.94-480.el9.x86_64
perl-PathTools-3.78-461.el9.x86_64
perl-Pod-Escapes-1.07-460.el9.noarch
perl-Pod-Perldoc-3.28.01-461.el9.noarch
perl-Pod-Simple-3.42-4.el9.noarch
perl-Pod-Usage-2.01-4.el9.noarch
perl-Scalar-List-Utils-1.56-461.el9.x86_64
perl-SelectSaver-1.02-480.el9.noarch
perl-Socket-2.031-4.el9.x86_64
perl-Storable-3.21-460.el9.x86_64
perl-Symbol-1.08-480.el9.noarch
perl-Term-ANSIColor-5.01-461.el9.noarch
perl-Term-Cap-1.17-460.el9.noarch
perl-Text-ParseWords-3.30-460.el9.noarch
perl-Text-Tabs+Wrap-2013.0523-460.el9.noarch
perl-Time-Local-1.300-7.el9.noarch
perl-URI-5.09-3.el9.noarch
perl-base-2.27-480.el9.noarch
perl-constant-1.33-461.el9.noarch
perl-if-0.60.800-480.el9.noarch
perl-interpreter-5.32.1-480.el9.x86_64
perl-libnet-3.13-4.el9.noarch
perl-libs-5.32.1-480.el9.x86_64
perl-mro-1.23-480.el9.x86_64
perl-overload-1.31-480.el9.noarch
perl-overloading-0.02-480.el9.noarch
perl-parent-0.238-460.el9.noarch
perl-podlators-4.14-460.el9.noarch
perl-srpm-macros-1-41.el9.noarch
perl-subs-1.03-480.el9.noarch
perl-vars-1.05-480.el9.noarch
pkgconf-1.7.3-10.el9.x86_64
pkgconf-m4-1.7.3-10.el9.noarch
pkgconf-pkg-config-1.7.3-10.el9.x86_64
plexus-cipher-1.7-27.el9.noarch
plexus-classworlds-2.6.0-11.el9.noarch
plexus-containers-component-annotations-2.1.1-2.el9.noarch
plexus-interpolation-1.26-11.el9.noarch
plexus-sec-dispatcher-1.4-37.el9.noarch
plexus-utils-3.3.0-10.el9.noarch
popt-1.18-8.el9.x86_64
publicsuffix-list-20210518-3.el9.noarch
publicsuffix-list-dafsa-20210518-3.el9.noarch
pyproject-srpm-macros-1.9.0-1.el9.noarch
python-srpm-macros-3.9-52.el9.noarch
python3-3.9.18-1.el9_3.1.x86_64
python3-libs-3.9.18-1.el9_3.1.x86_64
python3-pip-wheel-21.2.3-7.el9_3.1.noarch
python3-setuptools-wheel-53.0.0-12.el9.noarch
qt5-srpm-macros-5.15.9-1.el9.noarch
qt6-srpm-macros-6.5.2-3.el9.noarch
readline-8.1-4.el9.x86_64
redhat-release-9.3-0.5.el9.x86_64
redhat-rpm-config-201-1.el9.noarch
rpm-4.16.1.3-27.el9_3.x86_64
rpm-build-4.16.1.3-27.el9_3.x86_64
rpm-build-libs-4.16.1.3-27.el9_3.x86_64
rpm-libs-4.16.1.3-27.el9_3.x86_64
rpmautospec-rpm-macros-0.6.3-1.el9.noarch
rust-srpm-macros-17-4.el9.noarch
rust-srpm-macros-epel-26.2-1.el9.noarch
sed-4.8-9.el9.x86_64
setup-2.13.7-9.el9.noarch
shadow-utils-4.9-8.el9.x86_64
sisu-0.3.4-10.el9.noarch
slf4j-1.7.36-6.40.noarch
sqlite-libs-3.34.1-7.el9_3.x86_64
systemd-libs-252-18.el9.x86_64
tar-1.34-6.el9_1.x86_64
ttmkfdir-3.0.9-65.el9.x86_64
tzdata-2024a-1.el9.noarch
tzdata-java-2024a-1.el9.noarch
unzip-6.0-56.el9.x86_64
util-linux-2.37.4-15.el9.x86_64
util-linux-core-2.37.4-15.el9.x86_64
which-2.21-29.el9.x86_64
xml-common-0.6.3-58.el9.noarch
xmvn-core-4.0.0-2.el9.noarch
xmvn-minimal-4.0.0-2.el9.noarch
xmvn-tools-4.0.0-2.el9.noarch
xorg-x11-fonts-Type1-7.5-33.el9.noarch
xz-5.2.5-8.el9_0.x86_64
xz-libs-5.2.5-8.el9_0.x86_64
zip-3.0-35.el9.x86_64
zlib-1.2.11-40.el9.x86_64
zstd-1.5.1-2.el9.x86_64
Start: buildsrpm
Start: rpmbuild -bs
Building target platforms: x86_64
Building for target x86_64
setting SOURCE_DATE_EPOCH=1649808000
Wrote: /builddir/build/SRPMS/sitemesh-2.1-0.12.54.uyuni3.src.rpm
Finish: rpmbuild -bs
cp: preserving permissions for ‘/var/lib/copr-rpmbuild/results/chroot_scan/var/lib/mock/rhel+epel-9-x86_64-1714022811.608410/root/var/log’: No such file or directory
INFO: chroot_scan: 3 files copied to /var/lib/copr-rpmbuild/results/chroot_scan
INFO: /var/lib/mock/rhel+epel-9-x86_64-1714022811.608410/root/var/log/dnf.log
/var/lib/mock/rhel+epel-9-x86_64-1714022811.608410/root/var/log/dnf.librepo.log
/var/lib/mock/rhel+epel-9-x86_64-1714022811.608410/root/var/log/dnf.rpm.log
Finish: buildsrpm
INFO: Done(/var/lib/copr-rpmbuild/workspace/workdir-ogpg3sbx/sitemesh/sitemesh.spec) Config(child) 0 minutes 49 seconds
INFO: Results and/or logs in: /var/lib/copr-rpmbuild/results
INFO: Cleaning up build root ('cleanup_on_success=True')
Start: clean chroot
INFO: unmounting tmpfs.
Finish: clean chroot
INFO: Start(/var/lib/copr-rpmbuild/results/sitemesh-2.1-0.12.54.uyuni3.src.rpm) Config(rhel+epel-9-x86_64)
Start(bootstrap): chroot init
INFO: mounting tmpfs at /var/lib/mock/rhel+epel-9-x86_64-bootstrap-1714022811.608410/root.
INFO: reusing tmpfs at /var/lib/mock/rhel+epel-9-x86_64-bootstrap-1714022811.608410/root.
INFO: calling preinit hooks
INFO: enabled root cache
INFO: enabled package manager cache
Start(bootstrap): cleaning package manager metadata
Finish(bootstrap): cleaning package manager metadata
Finish(bootstrap): chroot init
Start: chroot init
INFO: mounting tmpfs at /var/lib/mock/rhel+epel-9-x86_64-1714022811.608410/root.
INFO: calling preinit hooks
INFO: enabled root cache
Start: unpacking root cache
Finish: unpacking root cache
INFO: enabled package manager cache
Start: cleaning package manager metadata
Finish: cleaning package manager metadata
INFO: enabled HW Info plugin
INFO: Buildroot is handled by package management downloaded with a bootstrap image:
rpm-4.16.1.3-27.el9_3.x86_64
python3-dnf-4.14.0-8.el9.noarch
python3-dnf-plugins-core-4.3.0-11.el9_3.noarch
yum-4.14.0-8.el9.noarch
Finish: chroot init
Start: build phase for sitemesh-2.1-0.12.54.uyuni3.src.rpm
Start: build setup for sitemesh-2.1-0.12.54.uyuni3.src.rpm
Building target platforms: x86_64
Building for target x86_64
setting SOURCE_DATE_EPOCH=1649808000
Wrote: /builddir/build/SRPMS/sitemesh-2.1-0.12.54.uyuni3.src.rpm
No matches found for the following disable plugin patterns: local, spacewalk, versionlock
Updating Subscription Management repositories.
Unable to read consumer identity
This system is not registered with an entitlement server. You can use subscription-manager to register.
Copr repository 30 kB/s | 1.8 kB 00:00
Copr repository 521 kB/s | 80 kB 00:00
Additional repo https_download_opensuse_org_rep 5.1 kB/s | 1.7 kB 00:00
Additional repo https_download_opensuse_org_rep 5.0 kB/s | 1.7 kB 00:00
Additional repo https_download_opensuse_org_rep 4.8 kB/s | 1.7 kB 00:00
Additional repo https_raw_githubusercontent_com 41 kB/s | 3.0 kB 00:00
Red Hat Enterprise Linux - BaseOS 20 kB/s | 4.1 kB 00:00
Red Hat Enterprise Linux - AppStream 27 kB/s | 4.5 kB 00:00
Red Hat Enterprise Linux - CodeReady Linux Buil 30 kB/s | 4.5 kB 00:00
Extra Packages for Enterprise Linux 9 - x86_64 27 kB/s | 9.7 kB 00:00
Package unzip-6.0-56.el9.x86_64 is already installed.
Dependencies resolved.
===========================================================================================================================================================================
Package Arch Version Repository Size
===========================================================================================================================================================================
Installing:
ant-junit noarch 1.10.12-15.11 https_download_opensuse_org_repositories_home_sbluhm_branches_systemsmanagement_Uyuni_Master_Other_EL_EL_9 158 k
apache-commons-collections noarch 3.2.2-26.el9 codeready-builder 529 k
fdupes x86_64 1:2.3.0-1.el9 epel 57 k
java-11-openjdk-devel x86_64 1:11.0.23.0.9-3.el9 appstream 3.3 M
junit noarch 1:4.13.1-5.el9 appstream 345 k
servletapi4 noarch 4.0.4-4.27 https_download_opensuse_org_repositories_home_sbluhm_branches_systemsmanagement_Uyuni_Master_Other_EL_EL_9 77 k
xerces-j2 noarch 2.12.1-6.el9 appstream 1.2 M
Installing dependencies:
ant noarch 1.10.12-15.11 https_download_opensuse_org_repositories_home_sbluhm_branches_systemsmanagement_Uyuni_Master_Other_EL_EL_9 166 k
ant-lib noarch 1.10.12-15.11 https_download_opensuse_org_repositories_home_sbluhm_branches_systemsmanagement_Uyuni_Master_Other_EL_EL_9 2.0 M
hamcrest noarch 2.2-7.el9 appstream 122 k
pcre2-utf32 x86_64 10.40-2.el9 appstream 207 k
xml-commons-apis noarch 1.4.01-36.el9 appstream 236 k
xml-commons-resolver noarch 1.2-36.el9 appstream 113 k
Transaction Summary
===========================================================================================================================================================================
Install 13 Packages
Total download size: 8.5 M
Installed size: 12 M
Downloading Packages:
(1/13): ant-1.10.12-15.11.noarch.rpm 170 kB/s | 166 kB 00:00
(2/13): ant-junit-1.10.12-15.11.noarch.rpm 157 kB/s | 158 kB 00:01
(3/13): hamcrest-2.2-7.el9.noarch.rpm 523 kB/s | 122 kB 00:00
(4/13): ant-lib-1.10.12-15.11.noarch.rpm 1.5 MB/s | 2.0 MB 00:01
(5/13): servletapi4-4.0.4-4.27.noarch.rpm 217 kB/s | 77 kB 00:00
(6/13): xerces-j2-2.12.1-6.el9.noarch.rpm 4.4 MB/s | 1.2 MB 00:00
(7/13): xml-commons-resolver-1.2-36.el9.noarch. 443 kB/s | 113 kB 00:00
(8/13): xml-commons-apis-1.4.01-36.el9.noarch.r 2.6 MB/s | 236 kB 00:00
(9/13): junit-4.13.1-5.el9.noarch.rpm 1.1 MB/s | 345 kB 00:00
(10/13): java-11-openjdk-devel-11.0.23.0.9-3.el 25 MB/s | 3.3 MB 00:00
(11/13): pcre2-utf32-10.40-2.el9.x86_64.rpm 1.2 MB/s | 207 kB 00:00
(12/13): apache-commons-collections-3.2.2-26.el 2.8 MB/s | 529 kB 00:00
(13/13): fdupes-2.3.0-1.el9.x86_64.rpm 649 kB/s | 57 kB 00:00
--------------------------------------------------------------------------------
Total 4.4 MB/s | 8.5 MB 00:01
Running transaction check
Transaction check succeeded.
Running transaction test
Transaction test succeeded.
Running transaction
Preparing : 1/1
Installing : ant-lib-1.10.12-15.11.noarch 1/13
Installing : java-11-openjdk-devel-1:11.0.23.0.9-3.el9.x86_64 2/13
Running scriptlet: java-11-openjdk-devel-1:11.0.23.0.9-3.el9.x86_64 2/13
Installing : ant-1.10.12-15.11.noarch 3/13
Installing : pcre2-utf32-10.40-2.el9.x86_64 4/13
Installing : xml-commons-apis-1.4.01-36.el9.noarch 5/13
Installing : xml-commons-resolver-1.2-36.el9.noarch 6/13
Installing : hamcrest-2.2-7.el9.noarch 7/13
Installing : junit-1:4.13.1-5.el9.noarch 8/13
Installing : ant-junit-1.10.12-15.11.noarch 9/13
Installing : xerces-j2-2.12.1-6.el9.noarch 10/13
Running scriptlet: xerces-j2-2.12.1-6.el9.noarch 10/13
Installing : fdupes-1:2.3.0-1.el9.x86_64 11/13
Installing : apache-commons-collections-3.2.2-26.el9.noarch 12/13
Installing : servletapi4-4.0.4-4.27.noarch 13/13
Running scriptlet: servletapi4-4.0.4-4.27.noarch 13/13
Running scriptlet: java-11-openjdk-devel-1:11.0.23.0.9-3.el9.x86_64 13/13
Running scriptlet: servletapi4-4.0.4-4.27.noarch 13/13
Verifying : ant-1.10.12-15.11.noarch 1/13
Verifying : ant-junit-1.10.12-15.11.noarch 2/13
Verifying : ant-lib-1.10.12-15.11.noarch 3/13
Verifying : servletapi4-4.0.4-4.27.noarch 4/13
Verifying : hamcrest-2.2-7.el9.noarch 5/13
Verifying : xerces-j2-2.12.1-6.el9.noarch 6/13
Verifying : xml-commons-resolver-1.2-36.el9.noarch 7/13
Verifying : junit-1:4.13.1-5.el9.noarch 8/13
Verifying : xml-commons-apis-1.4.01-36.el9.noarch 9/13
Verifying : pcre2-utf32-10.40-2.el9.x86_64 10/13
Verifying : java-11-openjdk-devel-1:11.0.23.0.9-3.el9.x86_64 11/13
Verifying : apache-commons-collections-3.2.2-26.el9.noarch 12/13
Verifying : fdupes-1:2.3.0-1.el9.x86_64 13/13
Installed products updated.
Installed:
ant-1.10.12-15.11.noarch
ant-junit-1.10.12-15.11.noarch
ant-lib-1.10.12-15.11.noarch
apache-commons-collections-3.2.2-26.el9.noarch
fdupes-1:2.3.0-1.el9.x86_64
hamcrest-2.2-7.el9.noarch
java-11-openjdk-devel-1:11.0.23.0.9-3.el9.x86_64
junit-1:4.13.1-5.el9.noarch
pcre2-utf32-10.40-2.el9.x86_64
servletapi4-4.0.4-4.27.noarch
xerces-j2-2.12.1-6.el9.noarch
xml-commons-apis-1.4.01-36.el9.noarch
xml-commons-resolver-1.2-36.el9.noarch
Complete!
Finish: build setup for sitemesh-2.1-0.12.54.uyuni3.src.rpm
Start: rpmbuild sitemesh-2.1-0.12.54.uyuni3.src.rpm
Building target platforms: x86_64
Building for target x86_64
setting SOURCE_DATE_EPOCH=1649808000
Executing(%prep): /bin/sh -e /var/tmp/rpm-tmp.ItACoC
+ umask 022
+ cd /builddir/build/BUILD
+ mkdir sitemesh
+ cd sitemesh
+ unzip /builddir/build/SOURCES/sitemesh-2.1-sources.zip
Archive: /builddir/build/SOURCES/sitemesh-2.1-sources.zip
creating: docs/
creating: docs/images/
creating: lib/
creating: src/
creating: src/etc/
creating: src/etc/blank/
creating: src/etc/blank/WEB-INF/
creating: src/etc/blank/decorators/
creating: src/etc/dtd/
creating: src/etc/tld/
creating: src/etc/tld/jsp1.2/
creating: src/example-webapp/
creating: src/example-webapp/WEB-INF/
creating: src/example-webapp/decorators/
creating: src/java/
creating: src/java/com/
creating: src/java/com/opensymphony/
creating: src/java/com/opensymphony/module/
creating: src/java/com/opensymphony/module/sitemesh/
creating: src/java/com/opensymphony/module/sitemesh/factory/
creating: src/java/com/opensymphony/module/sitemesh/filter/
creating: src/java/com/opensymphony/module/sitemesh/freemarker/
creating: src/java/com/opensymphony/module/sitemesh/mapper/
creating: src/java/com/opensymphony/module/sitemesh/parser/
creating: src/java/com/opensymphony/module/sitemesh/servlets/
creating: src/java/com/opensymphony/module/sitemesh/taglib/
creating: src/java/com/opensymphony/module/sitemesh/taglib/decorator/
creating: src/java/com/opensymphony/module/sitemesh/taglib/page/
creating: src/java/com/opensymphony/module/sitemesh/util/
creating: src/java/com/opensymphony/module/sitemesh/velocity/
creating: src/parser-tests/
creating: src/test/
creating: src/test/com/
creating: src/test/com/opensymphony/
creating: src/test/com/opensymphony/module/
creating: src/test/com/opensymphony/module/sitemesh/
creating: src/test/com/opensymphony/module/sitemesh/mapper/
creating: src/test/com/opensymphony/module/sitemesh/parser/
creating: src/test/com/opensymphony/module/sitemesh/parser/testdata/
creating: testsuite/
creating: testsuite/lib/
creating: testsuite/src/
creating: testsuite/src/java/
creating: testsuite/src/java/com/
creating: testsuite/src/java/com/opensymphony/
creating: testsuite/src/java/com/opensymphony/module/
creating: testsuite/src/java/com/opensymphony/module/sitemesh/
creating: testsuite/src/java/com/opensymphony/module/sitemesh/mapper/
creating: testsuite/src/java/testsuite/
creating: testsuite/src/java/testsuite/config/
creating: testsuite/src/java/testsuite/deploy/
creating: testsuite/src/java/testsuite/i18n/
creating: testsuite/src/java/testsuite/sitemesh/
creating: testsuite/src/java/testsuite/tester/
creating: testsuite/src/java/testsuite/unittests/
creating: testsuite/src/java/testsuite/unittests/repeatable/
creating: testsuite/src/parser-tests/
creating: testsuite/src/webapp/
creating: testsuite/src/webapp/WEB-INF/
creating: testsuite/src/webapp/WEB-INF/src/
creating: testsuite/src/webapp/WEB-INF/src/testsuite/
creating: testsuite/src/webapp/WEB-INF/src/testsuite/servlets/
creating: testsuite/src/webapp/basic/
creating: testsuite/src/webapp/binary/
creating: testsuite/src/webapp/decorators/
creating: testsuite/src/webapp/freemarker/
creating: testsuite/src/webapp/inline/
creating: testsuite/src/webapp/redirect/
creating: testsuite/src/webapp/simple/
creating: testsuite/src/webapp/simple/exclude/
creating: testsuite/src/webapp/velocity/
creating: testsuite/src/webapp/welcomepage/
creating: www/
inflating: docs/faq.html
inflating: docs/api.css
inflating: docs/dm.html
inflating: docs/cache.jsp.txt
inflating: docs/charsets.html
inflating: docs/decorators.html
inflating: docs/images/flowdiagram.gif
inflating: docs/images/overview.gif
inflating: docs/download.html
inflating: docs/features.html
inflating: docs/flow.html
inflating: docs/freemarker-decorators.html
inflating: docs/history.html
inflating: docs/index.html
inflating: docs/install.html
inflating: docs/navpanel.jsp
inflating: docs/requirements.html
inflating: docs/style.jsp.txt
inflating: docs/tags.html
inflating: docs/testsuite.html
inflating: docs/velocity-decorators.html
inflating: lib/commons-collections.jar
inflating: lib/crimson.jar
inflating: lib/freemarker.jar
inflating: lib/jaxp.jar
inflating: lib/junit-3.8.1.jar
inflating: lib/servlet.jar
inflating: lib/velocity-dep-1.3.1.jar
inflating: lib/velocity-tools-view-1.1.jar
inflating: README.txt
inflating: build.properties
inflating: build.xml
inflating: src/etc/blank/WEB-INF/decorators.xml
inflating: src/etc/blank/WEB-INF/web.xml
inflating: src/etc/blank/index.jsp
inflating: src/etc/blank/decorators/main.jsp
inflating: src/etc/blank/decorators/panel.jsp
inflating: src/etc/blank/decorators/printable.jsp
inflating: src/etc/dtd/sitemesh_1_0_decorators.dtd
inflating: src/etc/dtd/sitemesh_1_5_decorators.dtd
inflating: src/etc/tld/jsp1.2/sitemesh-decorator.tld
inflating: src/etc/tld/jsp1.2/sitemesh-page.tld
inflating: src/etc/tld/sitemesh-decorator.tld
inflating: src/etc/tld/sitemesh-page.tld
inflating: src/example-webapp/WEB-INF/decorators.xml
inflating: src/example-webapp/WEB-INF/orion-web.xml
inflating: src/example-webapp/WEB-INF/sitemesh.xml
inflating: src/example-webapp/WEB-INF/web.xml
inflating: src/example-webapp/agent.jsp
inflating: src/example-webapp/badpanel.html
inflating: src/example-webapp/badsource.html
inflating: src/example-webapp/counter-syntaxerror.jsp
inflating: src/example-webapp/counter.jsp
inflating: src/example-webapp/freemarker.html
inflating: src/example-webapp/google.html
inflating: src/example-webapp/index.html
inflating: src/example-webapp/inline.jsp
inflating: src/example-webapp/mandelbrot.pl
inflating: src/example-webapp/meta.html
inflating: src/example-webapp/meta2.html
inflating: src/example-webapp/random.pl
inflating: src/example-webapp/tiny-panel.html
inflating: src/example-webapp/toggledecorator.jsp
inflating: src/example-webapp/velocity.html
inflating: src/example-webapp/decorators/badpanelsource.jsp
inflating: src/example-webapp/decorators/black.jsp
inflating: src/example-webapp/decorators/freemarker.ftl
inflating: src/example-webapp/decorators/main.css
inflating: src/example-webapp/decorators/main.jsp
inflating: src/example-webapp/decorators/nopanelsource.jsp
inflating: src/example-webapp/decorators/panel.jsp
inflating: src/example-webapp/decorators/printable.jsp
inflating: src/example-webapp/decorators/test-ie.jsp
inflating: src/example-webapp/decorators/test-lynx.jsp
inflating: src/example-webapp/decorators/test-ns.jsp
inflating: src/example-webapp/decorators/test-opera.jsp
inflating: src/example-webapp/decorators/test.jsp
inflating: src/example-webapp/decorators/velocity.vm
inflating: src/java/com/opensymphony/module/sitemesh/factory/BaseFactory.java
inflating: src/java/com/opensymphony/module/sitemesh/factory/DefaultFactory.java
inflating: src/java/com/opensymphony/module/sitemesh/factory/FactoryException.java
inflating: src/java/com/opensymphony/module/sitemesh/factory/sitemesh-default.xml
inflating: src/java/com/opensymphony/module/sitemesh/Config.java
inflating: src/java/com/opensymphony/module/sitemesh/Decorator.java
inflating: src/java/com/opensymphony/module/sitemesh/DecoratorMapper.java
inflating: src/java/com/opensymphony/module/sitemesh/Factory.java
inflating: src/java/com/opensymphony/module/sitemesh/HTMLPage.java
inflating: src/java/com/opensymphony/module/sitemesh/Page.java
inflating: src/java/com/opensymphony/module/sitemesh/PageParser.java
inflating: src/java/com/opensymphony/module/sitemesh/RequestConstants.java
inflating: src/java/com/opensymphony/module/sitemesh/filter/DebugPageWriter.java
inflating: src/java/com/opensymphony/module/sitemesh/filter/DebugResponseWrapper.java
inflating: src/java/com/opensymphony/module/sitemesh/filter/NullOutputBuffer.java
inflating: src/java/com/opensymphony/module/sitemesh/filter/OutputBuffer.java
inflating: src/java/com/opensymphony/module/sitemesh/filter/PageFilter.java
inflating: src/java/com/opensymphony/module/sitemesh/filter/PageOutputStream.java
inflating: src/java/com/opensymphony/module/sitemesh/filter/PageRequestWrapper.java
inflating: src/java/com/opensymphony/module/sitemesh/filter/PageResponseWrapper.java
inflating: src/java/com/opensymphony/module/sitemesh/filter/PageWriter.java
inflating: src/java/com/opensymphony/module/sitemesh/filter/RequestDispatcherWrapper.java
inflating: src/java/com/opensymphony/module/sitemesh/freemarker/FreemarkerDecoratorServlet.java
inflating: src/java/com/opensymphony/module/sitemesh/mapper/AbstractDecoratorMapper.java
inflating: src/java/com/opensymphony/module/sitemesh/mapper/AgentDecoratorMapper.java
inflating: src/java/com/opensymphony/module/sitemesh/mapper/ConfigDecoratorMapper.java
inflating: src/java/com/opensymphony/module/sitemesh/mapper/ConfigLoader.java
inflating: src/java/com/opensymphony/module/sitemesh/mapper/CookieDecoratorMapper.java
inflating: src/java/com/opensymphony/module/sitemesh/mapper/DefaultDecorator.java
inflating: src/java/com/opensymphony/module/sitemesh/mapper/EnvEntryDecoratorMapper.java
inflating: src/java/com/opensymphony/module/sitemesh/mapper/FileDecoratorMapper.java
inflating: src/java/com/opensymphony/module/sitemesh/mapper/FrameSetDecoratorMapper.java
inflating: src/java/com/opensymphony/module/sitemesh/mapper/InlineDecoratorMapper.java
inflating: src/java/com/opensymphony/module/sitemesh/mapper/LanguageDecoratorMapper.java
inflating: src/java/com/opensymphony/module/sitemesh/mapper/NullDecoratorMapper.java
inflating: src/java/com/opensymphony/module/sitemesh/mapper/OSDecoratorMapper.java
inflating: src/java/com/opensymphony/module/sitemesh/mapper/PageDecoratorMapper.java
inflating: src/java/com/opensymphony/module/sitemesh/mapper/ParameterDecoratorMapper.java
inflating: src/java/com/opensymphony/module/sitemesh/mapper/PathMapper.java
inflating: src/java/com/opensymphony/module/sitemesh/mapper/PrintableDecoratorMapper.java
inflating: src/java/com/opensymphony/module/sitemesh/mapper/RobotDecoratorMapper.java
inflating: src/java/com/opensymphony/module/sitemesh/parser/AbstractHTMLPage.java
inflating: src/java/com/opensymphony/module/sitemesh/parser/AbstractPage.java
inflating: src/java/com/opensymphony/module/sitemesh/parser/DefaultPageParser.java
inflating: src/java/com/opensymphony/module/sitemesh/parser/FastPage.java
inflating: src/java/com/opensymphony/module/sitemesh/parser/FastPageParser.java
inflating: src/java/com/opensymphony/module/sitemesh/parser/UnParsedPage.java
inflating: src/java/com/opensymphony/module/sitemesh/taglib/decorator/BodyTag.java
inflating: src/java/com/opensymphony/module/sitemesh/taglib/decorator/HeadTag.java
inflating: src/java/com/opensymphony/module/sitemesh/taglib/decorator/PropertyTag.java
inflating: src/java/com/opensymphony/module/sitemesh/taglib/decorator/TitleTag.java
inflating: src/java/com/opensymphony/module/sitemesh/taglib/decorator/UseHTMLPageTEI.java
inflating: src/java/com/opensymphony/module/sitemesh/taglib/decorator/UsePageTEI.java
inflating: src/java/com/opensymphony/module/sitemesh/taglib/decorator/UsePageTag.java
inflating: src/java/com/opensymphony/module/sitemesh/taglib/AbstractTag.java
inflating: src/java/com/opensymphony/module/sitemesh/taglib/page/ApplyDecoratorTag.java
inflating: src/java/com/opensymphony/module/sitemesh/taglib/page/ParamTag.java
inflating: src/java/com/opensymphony/module/sitemesh/util/CharArray.java
inflating: src/java/com/opensymphony/module/sitemesh/util/CharArrayReader.java
inflating: src/java/com/opensymphony/module/sitemesh/util/Container.java
inflating: src/java/com/opensymphony/module/sitemesh/util/FastByteArrayOutputStream.java
inflating: src/java/com/opensymphony/module/sitemesh/util/OutputConverter.java
inflating: src/java/com/opensymphony/module/sitemesh/velocity/VelocityDecoratorServlet.java
inflating: src/parser-tests/ignore.txt
inflating: src/parser-tests/readme.txt
inflating: src/parser-tests/test01.txt
inflating: src/parser-tests/test02.txt
inflating: src/parser-tests/test03.txt
inflating: src/parser-tests/test04.txt
inflating: src/parser-tests/test05.txt
inflating: src/parser-tests/test06.txt
inflating: src/parser-tests/test07.txt
inflating: src/parser-tests/test08.txt
inflating: src/parser-tests/test09.txt
inflating: src/parser-tests/test10.txt
inflating: src/parser-tests/test11.txt
inflating: src/parser-tests/test12.txt
inflating: src/parser-tests/test13.txt
inflating: src/parser-tests/test14.txt
inflating: src/parser-tests/test15.txt
inflating: src/parser-tests/test16.txt
inflating: src/parser-tests/test17.txt
inflating: src/parser-tests/test18.txt
inflating: src/parser-tests/test19.txt
inflating: src/parser-tests/test20.txt
inflating: src/parser-tests/test21.txt
inflating: src/parser-tests/test22.txt
inflating: src/parser-tests/test23.txt
inflating: src/parser-tests/test24.txt
inflating: src/parser-tests/test25.txt
inflating: src/parser-tests/test26.txt
inflating: src/parser-tests/test27.txt
inflating: src/parser-tests/test28.txt
inflating: src/parser-tests/test29.txt
inflating: src/parser-tests/test30.txt
inflating: src/parser-tests/test31.txt
inflating: src/parser-tests/test32.txt
inflating: src/parser-tests/test33.txt
inflating: src/parser-tests/test34.txt
inflating: src/test/com/opensymphony/module/sitemesh/mapper/ConfigLoaderTest.java
inflating: src/test/com/opensymphony/module/sitemesh/mapper/PathMapperTest.java
inflating: src/test/com/opensymphony/module/sitemesh/parser/HTMLPageParserTest.java
inflating: testsuite/lib/commons-logging.jar
inflating: testsuite/lib/crimson.jar
inflating: testsuite/lib/electricxml.jar
inflating: testsuite/lib/httpunit.jar
inflating: testsuite/lib/jaxp.jar
inflating: testsuite/lib/jtidy.jar
inflating: testsuite/lib/junit-3.8.1.jar
inflating: testsuite/lib/log4j-core.jar
inflating: testsuite/lib/oscore-2.2.4.jar
inflating: testsuite/src/java/testsuite/config/Application.java
inflating: testsuite/src/java/testsuite/config/ConfigException.java
inflating: testsuite/src/java/testsuite/config/ConfigReader.java
inflating: testsuite/src/java/testsuite/config/Server.java
inflating: testsuite/src/java/testsuite/deploy/DeployWebApps.java
inflating: testsuite/src/java/testsuite/i18n/EncodingFilter.java
inflating: testsuite/src/java/testsuite/sitemesh/BasicPageTest.java
inflating: testsuite/src/java/testsuite/sitemesh/BinaryFileTest.java
inflating: testsuite/src/java/testsuite/sitemesh/ContentLengthTest.java
inflating: testsuite/src/java/testsuite/sitemesh/FreemarkerDecoratorTest.java
inflating: testsuite/src/java/testsuite/sitemesh/InlineDecoratorTest.java
inflating: testsuite/src/java/testsuite/sitemesh/RedirectTest.java
inflating: testsuite/src/java/testsuite/sitemesh/SimpleDecoratorTest.java
inflating: testsuite/src/java/testsuite/sitemesh/SiteMeshTestSuite.java
inflating: testsuite/src/java/testsuite/sitemesh/VelocityDecoratorTest.java
inflating: testsuite/src/java/testsuite/sitemesh/WelcomePageTest.java
inflating: testsuite/src/java/testsuite/tester/Report.java
inflating: testsuite/src/java/testsuite/tester/WebTest.java
inflating: testsuite/src/java/testsuite/unittests/ParserGrinder.java
inflating: testsuite/src/webapp/WEB-INF/src/testsuite/servlets/OutputServlet.java
inflating: testsuite/src/webapp/WEB-INF/decorators.xml
inflating: testsuite/src/webapp/WEB-INF/orion-web.xml
inflating: testsuite/src/webapp/WEB-INF/sitemesh.xml
inflating: testsuite/src/webapp/WEB-INF/web.xml
inflating: testsuite/src/webapp/default.jsp
inflating: testsuite/src/webapp/basic/error-500.jsp
inflating: testsuite/src/webapp/basic/error-exception.jsp
inflating: testsuite/src/webapp/basic/page.jsp
inflating: testsuite/src/webapp/basic/text.jsp
inflating: testsuite/src/webapp/binary/harry_potter.gif
inflating: testsuite/src/webapp/decorators/freemarker.ftl
inflating: testsuite/src/webapp/decorators/simple.jsp
inflating: testsuite/src/webapp/decorators/velocity.vm
inflating: testsuite/src/webapp/freemarker/freemarker.jsp
inflating: testsuite/src/webapp/inline/dec-1.jsp
inflating: testsuite/src/webapp/inline/dec-2.jsp
inflating: testsuite/src/webapp/inline/dec-3.jsp
inflating: testsuite/src/webapp/inline/dec-5.jsp
inflating: testsuite/src/webapp/inline/dec-6.jsp
inflating: testsuite/src/webapp/inline/dec-7.jsp
inflating: testsuite/src/webapp/inline/dec-panel.jsp
inflating: testsuite/src/webapp/inline/page1.jsp
inflating: testsuite/src/webapp/inline/page2.jsp
inflating: testsuite/src/webapp/inline/page3.jsp
inflating: testsuite/src/webapp/inline/page4.jsp
inflating: testsuite/src/webapp/inline/page5.jsp
inflating: testsuite/src/webapp/inline/page6.jsp
inflating: testsuite/src/webapp/inline/page7.html
inflating: testsuite/src/webapp/inline/page7.jsp
inflating: testsuite/src/webapp/inline/panel1.jsp
inflating: testsuite/src/webapp/inline/panel2.jsp
inflating: testsuite/src/webapp/redirect/page.jsp
inflating: testsuite/src/webapp/redirect/simple-forward.jsp
inflating: testsuite/src/webapp/redirect/simple-include.jsp
inflating: testsuite/src/webapp/redirect/simple-rdforward.jsp
inflating: testsuite/src/webapp/redirect/simple-rdinclude.jsp
inflating: testsuite/src/webapp/redirect/simple-redirect.jsp
inflating: testsuite/src/webapp/simple/exclude/page1.jsp
inflating: testsuite/src/webapp/simple/exclude.jsp
inflating: testsuite/src/webapp/simple/page1.jsp
inflating: testsuite/src/webapp/simple/page2.jsp
inflating: testsuite/src/webapp/simple/page3.jsp
inflating: testsuite/src/webapp/simple/page4.jsp
inflating: testsuite/src/webapp/simple/page5.jsp
inflating: testsuite/src/webapp/simple/static.html
inflating: testsuite/src/webapp/velocity/velocity.jsp
inflating: testsuite/src/webapp/welcomepage/default.jsp
inflating: testsuite/README.txt
inflating: testsuite/build.xml
inflating: testsuite/tests.xml
inflating: www/index.html
inflating: CHANGES.txt
Patch #0 (sitemesh-2.1-sources-fix-author.patch):
+ echo 'Patch #0 (sitemesh-2.1-sources-fix-author.patch):'
+ /usr/bin/patch --no-backup-if-mismatch -p1 --fuzz=0
patching file src/java/com/opensymphony/module/sitemesh/util/FastByteArrayOutputStream.java
Patch #1 (sitemesh-2.1-jdk11.patch):
+ echo 'Patch #1 (sitemesh-2.1-jdk11.patch):'
+ /usr/bin/patch --no-backup-if-mismatch -p0 --fuzz=0
patching file src/java/com/opensymphony/module/sitemesh/Factory.java
Patch #2 (no-velocity.patch):
+ echo 'Patch #2 (no-velocity.patch):'
+ /usr/bin/patch --no-backup-if-mismatch -p1 --fuzz=0
patching file src/java/com/opensymphony/module/sitemesh/velocity/VelocityDecoratorServlet.java
+ rm -Rfv lib/commons-collections.jar lib/crimson.jar lib/freemarker.jar lib/jaxp.jar lib/junit-3.8.1.jar lib/servlet.jar lib/velocity-dep-1.3.1.jar lib/velocity-tools-view-1.1.jar
removed 'lib/commons-collections.jar'
removed 'lib/crimson.jar'
removed 'lib/freemarker.jar'
removed 'lib/jaxp.jar'
removed 'lib/junit-3.8.1.jar'
removed 'lib/servlet.jar'
removed 'lib/velocity-dep-1.3.1.jar'
removed 'lib/velocity-tools-view-1.1.jar'
+ build-jar-repository -p lib/ commons-collections xerces-j2 junit servletapi4
+ find . -name freemarker -type d
+ xargs rm -Rfv
removed './src/java/com/opensymphony/module/sitemesh/freemarker/FreemarkerDecoratorServlet.java'
removed directory './src/java/com/opensymphony/module/sitemesh/freemarker'
removed './testsuite/src/webapp/freemarker/freemarker.jsp'
removed directory './testsuite/src/webapp/freemarker'
+ RPM_EC=0
++ jobs -p
+ exit 0
Executing(%build): /bin/sh -e /var/tmp/rpm-tmp.oB3sNr
+ umask 022
+ cd /builddir/build/BUILD
+ cd sitemesh
+ ls -l lib
total 2452
-rw-r--r--. 1 mockbuild mock 598861 Apr 25 05:27 commons-collections.jar
-rw-r--r--. 1 mockbuild mock 384813 Apr 25 05:27 junit.jar
-rw-r--r--. 1 mockbuild mock 77047 Apr 25 05:27 servletapi4.jar
-rw-r--r--. 1 mockbuild mock 1445859 Apr 25 05:27 xerces-j2.jar
+ export JAVA_HOME=/usr/lib/jvm/java-11-openjdk/
+ JAVA_HOME=/usr/lib/jvm/java-11-openjdk/
+ ant
Buildfile: /builddir/build/BUILD/sitemesh/build.xml
clean:
javadocs:
[mkdir] Created dir: /builddir/build/BUILD/sitemesh/dist/docs/api
[javadoc] Generating Javadoc
[javadoc] Javadoc execution
[javadoc] Loading source files for package com.opensymphony.module.sitemesh...
[javadoc] Loading source files for package com.opensymphony.module.sitemesh.factory...
[javadoc] Loading source files for package com.opensymphony.module.sitemesh.filter...
[javadoc] Loading source files for package com.opensymphony.module.sitemesh.mapper...
[javadoc] Loading source files for package com.opensymphony.module.sitemesh.parser...
[javadoc] Loading source files for package com.opensymphony.module.sitemesh.taglib...
[javadoc] Loading source files for package com.opensymphony.module.sitemesh.taglib.decorator...
[javadoc] Loading source files for package com.opensymphony.module.sitemesh.taglib.page...
[javadoc] Loading source files for package com.opensymphony.module.sitemesh.util...
[javadoc] Constructing Javadoc information...
[javadoc] Standard Doclet version 11.0.23
[javadoc] /builddir/build/BUILD/sitemesh/src/java/com/opensymphony/module/sitemesh/HTMLPage.java:52: error: header used out of sequence:
[javadoc] * Example
[javadoc] ^
[javadoc] /builddir/build/BUILD/sitemesh/src/java/com/opensymphony/module/sitemesh/HTMLPage.java:54: error: unknown tag: xmp
[javadoc] *
[javadoc] ^
[javadoc] /builddir/build/BUILD/sitemesh/src/java/com/opensymphony/module/sitemesh/HTMLPage.java:55: error: element not allowed in documentation comments:
[javadoc] *
[javadoc] ^
[javadoc] /builddir/build/BUILD/sitemesh/src/java/com/opensymphony/module/sitemesh/HTMLPage.java:55: error: attribute not supported in HTML5: template
[javadoc] Building tree for all the packages and classes...
[javadoc] *
[javadoc] ^
[javadoc] /builddir/build/BUILD/sitemesh/src/java/com/opensymphony/module/sitemesh/HTMLPage.java:56: error: element not allowed in documentation comments:
[javadoc] *
[javadoc] ^
[javadoc] /builddir/build/BUILD/sitemesh/src/java/com/opensymphony/module/sitemesh/HTMLPage.java:57: error: element not allowed in documentation comments:
[javadoc] * My Funky Page
[javadoc] ^
[javadoc] /builddir/build/BUILD/sitemesh/src/java/com/opensymphony/module/sitemesh/HTMLPage.java:58: error: element not allowed in documentation comments:
[javadoc] *
[javadoc] ^
[javadoc] /builddir/build/BUILD/sitemesh/src/java/com/opensymphony/module/sitemesh/HTMLPage.java:58: error: attribute not supported in HTML5: name
[javadoc] *
[javadoc] ^
[javadoc] /builddir/build/BUILD/sitemesh/src/java/com/opensymphony/module/sitemesh/HTMLPage.java:58: error: attribute not supported in HTML5: content
[javadoc] *
[javadoc] ^
[javadoc] /builddir/build/BUILD/sitemesh/src/java/com/opensymphony/module/sitemesh/HTMLPage.java:59: error: element not allowed in documentation comments:
[javadoc] *
[javadoc] ^
[javadoc] /builddir/build/BUILD/sitemesh/src/java/com/opensymphony/module/sitemesh/HTMLPage.java:59: error: attribute not supported in HTML5: name
[javadoc] *
[javadoc] ^
[javadoc] /builddir/build/BUILD/sitemesh/src/java/com/opensymphony/module/sitemesh/HTMLPage.java:59: error: attribute not supported in HTML5: content
[javadoc] *
[javadoc] ^
[javadoc] /builddir/build/BUILD/sitemesh/src/java/com/opensymphony/module/sitemesh/HTMLPage.java:62: error: element not allowed in documentation comments:
[javadoc] *
[javadoc] ^
[javadoc] /builddir/build/BUILD/sitemesh/src/java/com/opensymphony/module/sitemesh/HTMLPage.java:62: error: attribute not supported in HTML5: text
[javadoc] *
[javadoc] ^
[javadoc] /builddir/build/BUILD/sitemesh/src/java/com/opensymphony/module/sitemesh/HTMLPage.java:62: error: attribute not supported in HTML5: bgcolor
[javadoc] *
[javadoc] ^
[javadoc] /builddir/build/BUILD/sitemesh/src/java/com/opensymphony/module/sitemesh/HTMLPage.java:66: error: unknown tag: xmp
[javadoc] *
[javadoc] ^
[javadoc] /builddir/build/BUILD/sitemesh/src/java/com/opensymphony/module/sitemesh/mapper/ParameterDecoratorMapper.java:37: error: semicolon missing
[javadoc] * the URI myurl.jsp?decorator=mydecorator&confirm=true will map the decorator mydecorator.
[javadoc] ^
[javadoc] /builddir/build/BUILD/sitemesh/src/java/com/opensymphony/module/sitemesh/mapper/ParameterDecoratorMapper.java:38: error: semicolon missing
[javadoc] * where as the URIs myurl.jsp?decorator=mydecorator and myurl.jsp?decorator=mydecorator&confirm=false will
[javadoc] ^
[javadoc] /builddir/build/BUILD/sitemesh/src/java/com/opensymphony/module/sitemesh/util/CharArray.java:5: error: self-closing element not allowed
[javadoc] *
[javadoc] ^
[javadoc] /builddir/build/BUILD/sitemesh/src/java/com/opensymphony/module/sitemesh/Decorator.java:28: warning: no @return
[javadoc] String getPage();
[javadoc] ^
[javadoc] /builddir/build/BUILD/sitemesh/src/java/com/opensymphony/module/sitemesh/Decorator.java:31: warning: no @return
[javadoc] String getName();
[javadoc] ^
[javadoc] /builddir/build/BUILD/sitemesh/src/java/com/opensymphony/module/sitemesh/Decorator.java:34: warning: no @return
[javadoc] String getURIPath();
[javadoc] ^
[javadoc] /builddir/build/BUILD/sitemesh/src/java/com/opensymphony/module/sitemesh/Decorator.java:37: warning: no @return
[javadoc] String getRole();
[javadoc] ^
[javadoc] /builddir/build/BUILD/sitemesh/src/java/com/opensymphony/module/sitemesh/Decorator.java:52: warning: no @return
[javadoc] Iterator getInitParameterNames();
[javadoc] ^
[javadoc] /builddir/build/BUILD/sitemesh/src/java/com/opensymphony/module/sitemesh/DecoratorMapper.java:35: warning: no @param for parent
[javadoc] void init(Config config, Properties properties, DecoratorMapper parent) throws InstantiationException;
[javadoc] ^
[javadoc] /builddir/build/BUILD/sitemesh/src/java/com/opensymphony/module/sitemesh/DecoratorMapper.java:45: warning: no @param for request
[javadoc] Decorator getDecorator(HttpServletRequest request, Page page);
[javadoc] ^
[javadoc] /builddir/build/BUILD/sitemesh/src/java/com/opensymphony/module/sitemesh/DecoratorMapper.java:45: warning: no @param for page
[javadoc] Decorator getDecorator(HttpServletRequest request, Page page);
[javadoc] ^
[javadoc] /builddir/build/BUILD/sitemesh/src/java/com/opensymphony/module/sitemesh/DecoratorMapper.java:45: warning: no @return
[javadoc] Decorator getDecorator(HttpServletRequest request, Page page);
[javadoc] ^
[javadoc] /builddir/build/BUILD/sitemesh/src/java/com/opensymphony/module/sitemesh/DecoratorMapper.java:48: warning: no @param for request
[javadoc] Decorator getNamedDecorator(HttpServletRequest request, String name);
[javadoc] ^
[javadoc] /builddir/build/BUILD/sitemesh/src/java/com/opensymphony/module/sitemesh/DecoratorMapper.java:48: warning: no @param for name
[javadoc] Decorator getNamedDecorator(HttpServletRequest request, String name);
[javadoc] ^
[javadoc] /builddir/build/BUILD/sitemesh/src/java/com/opensymphony/module/sitemesh/DecoratorMapper.java:48: warning: no @return
[javadoc] Decorator getNamedDecorator(HttpServletRequest request, String name);
[javadoc] ^
[javadoc] /builddir/build/BUILD/sitemesh/src/java/com/opensymphony/module/sitemesh/Factory.java:37: warning: no @param for config
[javadoc] public static Factory getInstance(Config config) {
[javadoc] ^
[javadoc] /builddir/build/BUILD/sitemesh/src/java/com/opensymphony/module/sitemesh/Factory.java:37: warning: no @return
[javadoc] public static Factory getInstance(Config config) {
[javadoc] ^
[javadoc] /builddir/build/BUILD/sitemesh/src/java/com/opensymphony/module/sitemesh/Factory.java:62: warning: no @return
[javadoc] public abstract DecoratorMapper getDecoratorMapper();
[javadoc] ^
[javadoc] /builddir/build/BUILD/sitemesh/src/java/com/opensymphony/module/sitemesh/Factory.java:77: warning: no @param for contentType
[javadoc] public abstract boolean shouldParsePage(String contentType);
[javadoc] ^
[javadoc] /builddir/build/BUILD/sitemesh/src/java/com/opensymphony/module/sitemesh/Factory.java:77: warning: no @return
[javadoc] public abstract boolean shouldParsePage(String contentType);
[javadoc] ^
[javadoc] /builddir/build/BUILD/sitemesh/src/java/com/opensymphony/module/sitemesh/Factory.java:82: warning: no @param for path
[javadoc] public abstract boolean isPathExcluded(String path);
[javadoc] ^
[javadoc] /builddir/build/BUILD/sitemesh/src/java/com/opensymphony/module/sitemesh/Factory.java:82: warning: no @return
[javadoc] public abstract boolean isPathExcluded(String path);
[javadoc] ^
[javadoc] /builddir/build/BUILD/sitemesh/src/java/com/opensymphony/module/sitemesh/Factory.java:85: warning: no @param for msg
[javadoc] protected static void report(String msg, Exception e) {
[javadoc] ^
[javadoc] /builddir/build/BUILD/sitemesh/src/java/com/opensymphony/module/sitemesh/Factory.java:85: warning: no @param for e
[javadoc] protected static void report(String msg, Exception e) {
[javadoc] ^
[javadoc] /builddir/build/BUILD/sitemesh/src/java/com/opensymphony/module/sitemesh/Factory.java:90: warning: no @param for envEntry
[javadoc] private static String getEnvEntry(String envEntry, String defaultValue) {
[javadoc] ^
[javadoc] /builddir/build/BUILD/sitemesh/src/java/com/opensymphony/module/sitemesh/Factory.java:90: warning: no @param for defaultValue
[javadoc] private static String getEnvEntry(String envEntry, String defaultValue) {
[javadoc] ^
[javadoc] /builddir/build/BUILD/sitemesh/src/java/com/opensymphony/module/sitemesh/Factory.java:90: warning: no @return
[javadoc] private static String getEnvEntry(String envEntry, String defaultValue) {
[javadoc] ^
[javadoc] /builddir/build/BUILD/sitemesh/src/java/com/opensymphony/module/sitemesh/Page.java:47: warning: no @param for out
[javadoc] void writeBody(Writer out) throws IOException;
[javadoc] ^
[javadoc] /builddir/build/BUILD/sitemesh/src/java/com/opensymphony/module/sitemesh/Page.java:47: warning: no @throws for java.io.IOException
[javadoc] void writeBody(Writer out) throws IOException;
[javadoc] ^
[javadoc] /builddir/build/BUILD/sitemesh/src/java/com/opensymphony/module/sitemesh/Page.java:52: warning: no @return
[javadoc] String getTitle();
[javadoc] ^
[javadoc] /builddir/build/BUILD/sitemesh/src/java/com/opensymphony/module/sitemesh/Page.java:123: warning: no @return
[javadoc] HttpServletRequest getRequest();
[javadoc] ^
[javadoc] /builddir/build/BUILD/sitemesh/src/java/com/opensymphony/module/sitemesh/Page.java:129: warning: no @param for request
[javadoc] void setRequest(HttpServletRequest request);
[javadoc] ^
[javadoc] /builddir/build/BUILD/sitemesh/src/java/com/opensymphony/module/sitemesh/Page.java:134: warning: no @param for name
[javadoc] void addProperty(String name, String value);
[javadoc] ^
[javadoc] /builddir/build/BUILD/sitemesh/src/java/com/opensymphony/module/sitemesh/Page.java:134: warning: no @param for value
[javadoc] void addProperty(String name, String value);
[javadoc] ^
[javadoc] /builddir/build/BUILD/sitemesh/src/java/com/opensymphony/module/sitemesh/HTMLPage.java:82: warning: no @param for out
[javadoc] void writeHead(Writer out) throws IOException;
[javadoc] ^
[javadoc] /builddir/build/BUILD/sitemesh/src/java/com/opensymphony/module/sitemesh/HTMLPage.java:82: warning: no @throws for java.io.IOException
[javadoc] void writeHead(Writer out) throws IOException;
[javadoc] ^
[javadoc] /builddir/build/BUILD/sitemesh/src/java/com/opensymphony/module/sitemesh/HTMLPage.java:88: warning: no @return
[javadoc] boolean isFrameSet();
[javadoc] ^
[javadoc] /builddir/build/BUILD/sitemesh/src/java/com/opensymphony/module/sitemesh/PageParser.java:31: warning: no @param for data
[javadoc] Page parse(char[] data) throws IOException;
[javadoc] ^
[javadoc] /builddir/build/BUILD/sitemesh/src/java/com/opensymphony/module/sitemesh/PageParser.java:31: warning: no @return
[javadoc] Page parse(char[] data) throws IOException;
[javadoc] ^
[javadoc] /builddir/build/BUILD/sitemesh/src/java/com/opensymphony/module/sitemesh/PageParser.java:31: warning: no @throws for java.io.IOException
[javadoc] Page parse(char[] data) throws IOException;
[javadoc] ^
[javadoc] /builddir/build/BUILD/sitemesh/src/java/com/opensymphony/module/sitemesh/factory/BaseFactory.java:53: warning: no @param for config
[javadoc] protected BaseFactory(Config config) {
[javadoc] ^
[javadoc] /builddir/build/BUILD/sitemesh/src/java/com/opensymphony/module/sitemesh/factory/BaseFactory.java:90: warning: no description for @param
[javadoc] * @param path
[javadoc] ^
[javadoc] /builddir/build/BUILD/sitemesh/src/java/com/opensymphony/module/sitemesh/factory/BaseFactory.java:105: warning: no @param for className
[javadoc] protected void pushDecoratorMapper(String className, Properties properties) {
[javadoc] ^
[javadoc] /builddir/build/BUILD/sitemesh/src/java/com/opensymphony/module/sitemesh/factory/BaseFactory.java:105: warning: no @param for properties
[javadoc] protected void pushDecoratorMapper(String className, Properties properties) {
[javadoc] ^
[javadoc] /builddir/build/BUILD/sitemesh/src/java/com/opensymphony/module/sitemesh/factory/BaseFactory.java:135: warning: no @param for contentType
[javadoc] protected void mapParser(String contentType, String className) {
[javadoc] ^
[javadoc] /builddir/build/BUILD/sitemesh/src/java/com/opensymphony/module/sitemesh/factory/BaseFactory.java:135: warning: no @param for className
[javadoc] protected void mapParser(String contentType, String className) {
[javadoc] ^
[javadoc] /builddir/build/BUILD/sitemesh/src/java/com/opensymphony/module/sitemesh/factory/DefaultFactory.java:211: warning: no @param for nodes
[javadoc] private void loadPageParsers(NodeList nodes) {
[javadoc] ^
[javadoc] /builddir/build/BUILD/sitemesh/src/java/com/opensymphony/module/sitemesh/factory/DefaultFactory.java:262: warning: no @param for nodes
[javadoc] private void loadExcludeUrls(NodeList nodes) {
[javadoc] ^
[javadoc] /builddir/build/BUILD/sitemesh/src/java/com/opensymphony/module/sitemesh/factory/FactoryException.java:46: warning: no @return
[javadoc] public Exception getRootCause() {
[javadoc] ^
[javadoc] /builddir/build/BUILD/sitemesh/src/java/com/opensymphony/module/sitemesh/filter/OutputBuffer.java:21: warning: no @return
[javadoc] public char[] getBuffer(String encoding);
[javadoc] ^
[javadoc] /builddir/build/BUILD/sitemesh/src/java/com/opensymphony/module/sitemesh/filter/PageResponseWrapper.java:62: warning: no @param for response
[javadoc] public PageResponseWrapper(HttpServletResponse response, Config config) throws IOException {
[javadoc] ^
[javadoc] /builddir/build/BUILD/sitemesh/src/java/com/opensymphony/module/sitemesh/filter/PageResponseWrapper.java:62: warning: no @param for config
[javadoc] public PageResponseWrapper(HttpServletResponse response, Config config) throws IOException {
[javadoc] ^
[javadoc] /builddir/build/BUILD/sitemesh/src/java/com/opensymphony/module/sitemesh/filter/PageResponseWrapper.java:62: warning: no @throws for java.io.IOException
[javadoc] public PageResponseWrapper(HttpServletResponse response, Config config) throws IOException {
[javadoc] ^
[javadoc] /builddir/build/BUILD/sitemesh/src/java/com/opensymphony/module/sitemesh/filter/PageResponseWrapper.java:67: warning: no @param for response
[javadoc] public PageResponseWrapper(HttpServletResponse response, Config config, boolean debug) throws IOException {
[javadoc] ^
[javadoc] /builddir/build/BUILD/sitemesh/src/java/com/opensymphony/module/sitemesh/filter/PageResponseWrapper.java:67: warning: no @param for config
[javadoc] public PageResponseWrapper(HttpServletResponse response, Config config, boolean debug) throws IOException {
[javadoc] ^
[javadoc] /builddir/build/BUILD/sitemesh/src/java/com/opensymphony/module/sitemesh/filter/PageResponseWrapper.java:67: warning: no @param for debug
[javadoc] public PageResponseWrapper(HttpServletResponse response, Config config, boolean debug) throws IOException {
[javadoc] ^
[javadoc] /builddir/build/BUILD/sitemesh/src/java/com/opensymphony/module/sitemesh/filter/PageResponseWrapper.java:67: warning: no @throws for java.io.IOException
[javadoc] public PageResponseWrapper(HttpServletResponse response, Config config, boolean debug) throws IOException {
[javadoc] ^
[javadoc] /builddir/build/BUILD/sitemesh/src/java/com/opensymphony/module/sitemesh/filter/PageResponseWrapper.java:158: warning: no description for @throws
[javadoc] * @throws IOException
[javadoc] ^
[javadoc] /builddir/build/BUILD/sitemesh/src/java/com/opensymphony/module/sitemesh/filter/PageResponseWrapper.java:207: warning: no @return
[javadoc] private PageWriter getPageWriter() throws IOException {
[javadoc] ^
[javadoc] /builddir/build/BUILD/sitemesh/src/java/com/opensymphony/module/sitemesh/filter/PageResponseWrapper.java:207: warning: no @throws for java.io.IOException
[javadoc] private PageWriter getPageWriter() throws IOException {
[javadoc] ^
[javadoc] /builddir/build/BUILD/sitemesh/src/java/com/opensymphony/module/sitemesh/filter/PageResponseWrapper.java:250: warning: no @return
[javadoc] public Page getPage() throws IOException {
[javadoc] ^
[javadoc] /builddir/build/BUILD/sitemesh/src/java/com/opensymphony/module/sitemesh/filter/PageResponseWrapper.java:250: warning: no @throws for java.io.IOException
[javadoc] public Page getPage() throws IOException {
[javadoc] ^
[javadoc] /builddir/build/BUILD/sitemesh/src/java/com/opensymphony/module/sitemesh/filter/PageFilter.java:108: warning: no @return
[javadoc] public FilterConfig getFilterConfig() {
[javadoc] ^
[javadoc] /builddir/build/BUILD/sitemesh/src/java/com/opensymphony/module/sitemesh/filter/PageFilter.java:114: warning: no @param for filterConfig
[javadoc] public void setFilterConfig(FilterConfig filterConfig) {
[javadoc] ^
[javadoc] /builddir/build/BUILD/sitemesh/src/java/com/opensymphony/module/sitemesh/filter/PageFilter.java:136: error: unexpected end tag:
[javadoc] *
[javadoc] ^
[javadoc] /builddir/build/BUILD/sitemesh/src/java/com/opensymphony/module/sitemesh/filter/PageFilter.java:138: warning: no @param for request
[javadoc] protected Page parsePage(HttpServletRequest request, HttpServletResponse response, FilterChain chain) throws IOException, ServletException {
[javadoc] ^
[javadoc] /builddir/build/BUILD/sitemesh/src/java/com/opensymphony/module/sitemesh/filter/PageFilter.java:138: warning: no @param for response
[javadoc] protected Page parsePage(HttpServletRequest request, HttpServletResponse response, FilterChain chain) throws IOException, ServletException {
[javadoc] ^
[javadoc] /builddir/build/BUILD/sitemesh/src/java/com/opensymphony/module/sitemesh/filter/PageFilter.java:138: warning: no @param for chain
[javadoc] protected Page parsePage(HttpServletRequest request, HttpServletResponse response, FilterChain chain) throws IOException, ServletException {
[javadoc] ^
[javadoc] /builddir/build/BUILD/sitemesh/src/java/com/opensymphony/module/sitemesh/filter/PageFilter.java:138: warning: no @return
[javadoc] protected Page parsePage(HttpServletRequest request, HttpServletResponse response, FilterChain chain) throws IOException, ServletException {
[javadoc] ^
[javadoc] /builddir/build/BUILD/sitemesh/src/java/com/opensymphony/module/sitemesh/filter/PageFilter.java:138: warning: no @throws for java.io.IOException
[javadoc] protected Page parsePage(HttpServletRequest request, HttpServletResponse response, FilterChain chain) throws IOException, ServletException {
[javadoc] ^
[javadoc] /builddir/build/BUILD/sitemesh/src/java/com/opensymphony/module/sitemesh/filter/PageFilter.java:138: warning: no @throws for javax.servlet.ServletException
[javadoc] protected Page parsePage(HttpServletRequest request, HttpServletResponse response, FilterChain chain) throws IOException, ServletException {
[javadoc] ^
[javadoc] /builddir/build/BUILD/sitemesh/src/java/com/opensymphony/module/sitemesh/filter/PageFilter.java:166: warning: no @param for page
[javadoc] protected void applyDecorator(Page page, Decorator decorator, HttpServletRequest request, HttpServletResponse response) throws ServletException, IOException {
[javadoc] ^
[javadoc] /builddir/build/BUILD/sitemesh/src/java/com/opensymphony/module/sitemesh/filter/PageFilter.java:166: warning: no @param for decorator
[javadoc] protected void applyDecorator(Page page, Decorator decorator, HttpServletRequest request, HttpServletResponse response) throws ServletException, IOException {
[javadoc] ^
[javadoc] /builddir/build/BUILD/sitemesh/src/java/com/opensymphony/module/sitemesh/filter/PageFilter.java:166: warning: no @param for request
[javadoc] protected void applyDecorator(Page page, Decorator decorator, HttpServletRequest request, HttpServletResponse response) throws ServletException, IOException {
[javadoc] ^
[javadoc] /builddir/build/BUILD/sitemesh/src/java/com/opensymphony/module/sitemesh/filter/PageFilter.java:166: warning: no @param for response
[javadoc] protected void applyDecorator(Page page, Decorator decorator, HttpServletRequest request, HttpServletResponse response) throws ServletException, IOException {
[javadoc] ^
[javadoc] /builddir/build/BUILD/sitemesh/src/java/com/opensymphony/module/sitemesh/filter/PageFilter.java:166: warning: no @throws for javax.servlet.ServletException
[javadoc] protected void applyDecorator(Page page, Decorator decorator, HttpServletRequest request, HttpServletResponse response) throws ServletException, IOException {
[javadoc] ^
[javadoc] /builddir/build/BUILD/sitemesh/src/java/com/opensymphony/module/sitemesh/filter/PageFilter.java:166: warning: no @throws for java.io.IOException
[javadoc] protected void applyDecorator(Page page, Decorator decorator, HttpServletRequest request, HttpServletResponse response) throws ServletException, IOException {
[javadoc] ^
[javadoc] /builddir/build/BUILD/sitemesh/src/java/com/opensymphony/module/sitemesh/filter/PageFilter.java:205: warning: no @param for request
[javadoc] private void writeOriginal(HttpServletRequest request, HttpServletResponse response, Page page) throws IOException {
[javadoc] ^
[javadoc] /builddir/build/BUILD/sitemesh/src/java/com/opensymphony/module/sitemesh/filter/PageFilter.java:205: warning: no @param for response
[javadoc] private void writeOriginal(HttpServletRequest request, HttpServletResponse response, Page page) throws IOException {
[javadoc] ^
[javadoc] /builddir/build/BUILD/sitemesh/src/java/com/opensymphony/module/sitemesh/filter/PageFilter.java:205: warning: no @param for page
[javadoc] private void writeOriginal(HttpServletRequest request, HttpServletResponse response, Page page) throws IOException {
[javadoc] ^
[javadoc] /builddir/build/BUILD/sitemesh/src/java/com/opensymphony/module/sitemesh/filter/PageFilter.java:205: warning: no @throws for java.io.IOException
[javadoc] private void writeOriginal(HttpServletRequest request, HttpServletResponse response, Page page) throws IOException {
[javadoc] ^
[javadoc] /builddir/build/BUILD/sitemesh/src/java/com/opensymphony/module/sitemesh/filter/PageOutputStream.java:40: error: semicolon missing
[javadoc] * More information: http://marc.theaimsgroup.com/?l=tomcat-user&m=107569601410973&w=2, SIM-74, SIM-82
[javadoc] ^
[javadoc] /builddir/build/BUILD/sitemesh/src/java/com/opensymphony/module/sitemesh/filter/PageOutputStream.java:40: error: semicolon missing
[javadoc] * More information: http://marc.theaimsgroup.com/?l=tomcat-user&m=107569601410973&w=2, SIM-74, SIM-82
[javadoc] ^
[javadoc] /builddir/build/BUILD/sitemesh/src/java/com/opensymphony/module/sitemesh/filter/PageOutputStream.java:47: warning: no @param for response
[javadoc] public PageOutputStream(ServletResponse response) {
[javadoc] ^
[javadoc] /builddir/build/BUILD/sitemesh/src/java/com/opensymphony/module/sitemesh/mapper/AgentDecoratorMapper.java:82: warning: no @param for userAgent
[javadoc] private String getExt(String userAgent) {
[javadoc] ^
[javadoc] /builddir/build/BUILD/sitemesh/src/java/com/opensymphony/module/sitemesh/mapper/AgentDecoratorMapper.java:82: warning: no @return
[javadoc] private String getExt(String userAgent) {
[javadoc] ^
[javadoc] /builddir/build/BUILD/sitemesh/src/java/com/opensymphony/module/sitemesh/mapper/AgentDecoratorMapper.java:93: warning: no @param for path
[javadoc] private static String modifyPath(String path, String ext) {
[javadoc] ^
[javadoc] /builddir/build/BUILD/sitemesh/src/java/com/opensymphony/module/sitemesh/mapper/AgentDecoratorMapper.java:93: warning: no @param for ext
[javadoc] private static String modifyPath(String path, String ext) {
[javadoc] ^
[javadoc] /builddir/build/BUILD/sitemesh/src/java/com/opensymphony/module/sitemesh/mapper/AgentDecoratorMapper.java:93: warning: no @return
[javadoc] private static String modifyPath(String path, String ext) {
[javadoc] ^
[javadoc] /builddir/build/BUILD/sitemesh/src/java/com/opensymphony/module/sitemesh/mapper/AgentDecoratorMapper.java:104: warning: no @param for props
[javadoc] private void initMap(Properties props) {
[javadoc] ^
[javadoc] /builddir/build/BUILD/sitemesh/src/java/com/opensymphony/module/sitemesh/mapper/ConfigLoader.java:65: warning: no @param for configFile
[javadoc] public ConfigLoader(File configFile) throws ServletException {
[javadoc] ^
[javadoc] /builddir/build/BUILD/sitemesh/src/java/com/opensymphony/module/sitemesh/mapper/ConfigLoader.java:65: warning: no @throws for javax.servlet.ServletException
[javadoc] public ConfigLoader(File configFile) throws ServletException {
[javadoc] ^
[javadoc] /builddir/build/BUILD/sitemesh/src/java/com/opensymphony/module/sitemesh/mapper/ConfigLoader.java:72: warning: no @param for configFileName
[javadoc] public ConfigLoader(String configFileName, Config config) throws ServletException {
[javadoc] ^
[javadoc] /builddir/build/BUILD/sitemesh/src/java/com/opensymphony/module/sitemesh/mapper/ConfigLoader.java:72: warning: no @param for config
[javadoc] public ConfigLoader(String configFileName, Config config) throws ServletException {
[javadoc] ^
[javadoc] /builddir/build/BUILD/sitemesh/src/java/com/opensymphony/module/sitemesh/mapper/ConfigLoader.java:72: warning: no @throws for javax.servlet.ServletException
[javadoc] public ConfigLoader(String configFileName, Config config) throws ServletException {
[javadoc] ^
[javadoc] /builddir/build/BUILD/sitemesh/src/java/com/opensymphony/module/sitemesh/mapper/ConfigLoader.java:82: warning: no @param for name
[javadoc] public Decorator getDecoratorByName(String name) throws ServletException {
[javadoc] ^
[javadoc] /builddir/build/BUILD/sitemesh/src/java/com/opensymphony/module/sitemesh/mapper/ConfigLoader.java:82: warning: no @return
[javadoc] public Decorator getDecoratorByName(String name) throws ServletException {
[javadoc] ^
[javadoc] /builddir/build/BUILD/sitemesh/src/java/com/opensymphony/module/sitemesh/mapper/ConfigLoader.java:82: warning: no @throws for javax.servlet.ServletException
[javadoc] public Decorator getDecoratorByName(String name) throws ServletException {
[javadoc] ^
[javadoc] /builddir/build/BUILD/sitemesh/src/java/com/opensymphony/module/sitemesh/mapper/ConfigLoader.java:88: warning: no @param for path
[javadoc] public String getMappedName(String path) throws ServletException {
[javadoc] ^
[javadoc] /builddir/build/BUILD/sitemesh/src/java/com/opensymphony/module/sitemesh/mapper/ConfigLoader.java:88: warning: no @return
[javadoc] public String getMappedName(String path) throws ServletException {
[javadoc] ^
[javadoc] /builddir/build/BUILD/sitemesh/src/java/com/opensymphony/module/sitemesh/mapper/ConfigLoader.java:88: warning: no @throws for javax.servlet.ServletException
[javadoc] public String getMappedName(String path) throws ServletException {
[javadoc] ^
[javadoc] /builddir/build/BUILD/sitemesh/src/java/com/opensymphony/module/sitemesh/mapper/ConfigLoader.java:94: warning: no @throws for javax.servlet.ServletException
[javadoc] private synchronized void loadConfig() throws ServletException {
[javadoc] ^
[javadoc] /builddir/build/BUILD/sitemesh/src/java/com/opensymphony/module/sitemesh/mapper/ConfigLoader.java:125: warning: no @param for document
[javadoc] private synchronized void parseConfig(Document document) {
[javadoc] ^
[javadoc] /builddir/build/BUILD/sitemesh/src/java/com/opensymphony/module/sitemesh/mapper/ConfigLoader.java:202: warning: no @param for patternNodes
[javadoc] private void populatePathMapper(NodeList patternNodes, String role, String name) {
[javadoc] ^
[javadoc] /builddir/build/BUILD/sitemesh/src/java/com/opensymphony/module/sitemesh/mapper/ConfigLoader.java:202: warning: no @param for role
[javadoc] private void populatePathMapper(NodeList patternNodes, String role, String name) {
[javadoc] ^
[javadoc] /builddir/build/BUILD/sitemesh/src/java/com/opensymphony/module/sitemesh/mapper/ConfigLoader.java:202: warning: no @param for name
[javadoc] private void populatePathMapper(NodeList patternNodes, String role, String name) {
[javadoc] ^
[javadoc] /builddir/build/BUILD/sitemesh/src/java/com/opensymphony/module/sitemesh/parser/FastPageParser.java:685: error: tag not supported in the generated HTML version: tt
[javadoc] * with a new name value (and the corresponding nameEndIdx value).
[javadoc] ^
[javadoc] /builddir/build/BUILD/sitemesh/src/java/com/opensymphony/module/sitemesh/parser/FastPageParser.java:685: error: tag not supported in the generated HTML version: tt
[javadoc] * with a new name value (and the corresponding nameEndIdx value).
[javadoc] ^
[javadoc] /builddir/build/BUILD/sitemesh/src/java/com/opensymphony/module/sitemesh/parser/FastPageParser.java:687: error: tag not supported in the generated HTML version: tt
[javadoc] * null.
[javadoc] ^
[javadoc] /builddir/build/BUILD/sitemesh/src/java/com/opensymphony/module/sitemesh/parser/FastPageParser.java:720: error: tag not supported in the generated HTML version: tt
[javadoc] * (ie, it has the name and nameEndIdx fields set correctly for the
[javadoc] ^
[javadoc] /builddir/build/BUILD/sitemesh/src/java/com/opensymphony/module/sitemesh/parser/FastPageParser.java:720: error: tag not supported in the generated HTML version: tt
[javadoc] * (ie, it has the name and nameEndIdx fields set correctly for the
[javadoc] ^
[javadoc] /builddir/build/BUILD/sitemesh/src/java/com/opensymphony/module/sitemesh/parser/FastPageParser.java:721: error: tag not supported in the generated HTML version: tt
[javadoc] * tag in question. The properties field can be in an undefined state - it
[javadoc] ^
[javadoc] /builddir/build/BUILD/sitemesh/src/java/com/opensymphony/module/sitemesh/parser/FastPageParser.java:723: error: tag not supported in the generated HTML version: tt
[javadoc] * @param buffer a CharArray containing the entire tag that is being parsed.
[javadoc] ^
[javadoc] /builddir/build/BUILD/sitemesh/src/java/com/opensymphony/module/sitemesh/util/CharArray.java:58: error: semicolon missing
[javadoc] * internal array will NOT be shrunk). If the new size is > the
[javadoc] ^
[javadoc] /builddir/build/BUILD/sitemesh/src/java/com/opensymphony/module/sitemesh/util/CharArray.java:60: error: tag not supported in the generated HTML version: tt
[javadoc] * ('\u0000').
[javadoc] ^
[javadoc] /builddir/build/BUILD/sitemesh/src/java/com/opensymphony/module/sitemesh/util/CharArray.java:96: error: tag not supported in the generated HTML version: tt
[javadoc] * Passing in a null CharArray will result in a NullPointerException.
[javadoc] ^
[javadoc] /builddir/build/BUILD/sitemesh/src/java/com/opensymphony/module/sitemesh/util/CharArray.java:96: error: tag not supported in the generated HTML version: tt
[javadoc] * Passing in a null CharArray will result in a NullPointerException.
[javadoc] ^
[javadoc] /builddir/build/BUILD/sitemesh/src/java/com/opensymphony/module/sitemesh/util/CharArray.java:132: error: tag not supported in the generated HTML version: tt
[javadoc] * Passing in a null string will result in a NullPointerException.
[javadoc] ^
[javadoc] /builddir/build/BUILD/sitemesh/src/java/com/opensymphony/module/sitemesh/util/CharArray.java:132: error: tag not supported in the generated HTML version: tt
[javadoc] * Passing in a null string will result in a NullPointerException.
[javadoc] ^
[javadoc] /builddir/build/BUILD/sitemesh/src/java/com/opensymphony/module/sitemesh/util/CharArray.java:205: error: tag not supported in the generated HTML version: tt
[javadoc] * This uses the same calculation as the String.hashCode() method
[javadoc] ^
[javadoc] /builddir/build/BUILD/sitemesh/src/java/com/opensymphony/module/sitemesh/util/CharArray.java:224: error: self-closing element not allowed
[javadoc] *
[javadoc] ^
[javadoc] /builddir/build/BUILD/sitemesh/src/java/com/opensymphony/module/sitemesh/util/CharArray.java:228: error: self-closing element not allowed
[javadoc] *
[javadoc] ^
[javadoc] /builddir/build/BUILD/sitemesh/src/java/com/opensymphony/module/sitemesh/util/CharArray.java:230: error: tag not supported in the generated HTML version: tt
[javadoc] * character array are considered equal, this method will return true.
[javadoc] ^
[javadoc] Generating /builddir/build/BUILD/sitemesh/dist/docs/api/serialized-form.html...
[javadoc] Copying file StandardDocFile[file:/builddir/build/BUILD/sitemesh/docs/api.css] to file api.css...
[javadoc] Building index for all the packages and classes...
[javadoc] Building index for all classes...
[javadoc] Building index for all classes...
[javadoc] Generating /builddir/build/BUILD/sitemesh/dist/docs/api/help-doc.html...
[javadoc] 39 errors
[javadoc] 100 warnings
docs:
[copy] Copying 20 files to /builddir/build/BUILD/sitemesh/dist/docs
[mkdir] Created dir: /builddir/build/BUILD/sitemesh/dist/docs/dtd
[copy] Copying 1 file to /builddir/build/BUILD/sitemesh/dist/docs
[copy] Copying 1 file to /builddir/build/BUILD/sitemesh/dist/docs
[copy] Copying 2 files to /builddir/build/BUILD/sitemesh/dist/docs/dtd
compile:
[mkdir] Created dir: /builddir/build/BUILD/sitemesh/dist/build/classes
[javac] /builddir/build/BUILD/sitemesh/build.xml:22: warning: 'includeantruntime' was not set, defaulting to build.sysclasspath=last; set to false for repeatable builds
[javac] Compiling 60 source files to /builddir/build/BUILD/sitemesh/dist/build/classes
[javac] /builddir/build/BUILD/sitemesh/src/java/com/opensymphony/module/sitemesh/Factory.java:51: warning: non-varargs call of varargs method with inexact argument type for last parameter;
[javac] instance = (Factory)con.newInstance(new Config[] { config });
[javac] ^
[javac] cast to Object for a varargs call
[javac] cast to Object[] for a non-varargs call and to suppress this warning
[javac] /builddir/build/BUILD/sitemesh/src/java/com/opensymphony/module/sitemesh/factory/BaseFactory.java:114: warning: [deprecation] newInstance() in Class has been deprecated
[javac] DecoratorMapper newMapper = (DecoratorMapper) decoratorMapperClass.newInstance();
[javac] ^
[javac] where T is a type-variable:
[javac] T extends Object declared in class Class
[javac] /builddir/build/BUILD/sitemesh/src/java/com/opensymphony/module/sitemesh/factory/BaseFactory.java:137: warning: [deprecation] newInstance() in Class has been deprecated
[javac] PageParser pp = (PageParser) Class.forName(className).newInstance();
[javac] ^
[javac] where T is a type-variable:
[javac] T extends Object declared in class Class
[javac] /builddir/build/BUILD/sitemesh/src/java/com/opensymphony/module/sitemesh/factory/DefaultFactory.java:150: warning: [deprecation] toURL() in File has been deprecated
[javac] is = configFile.toURL().openStream();
[javac] ^
[javac] /builddir/build/BUILD/sitemesh/src/java/com/opensymphony/module/sitemesh/factory/DefaultFactory.java:188: warning: [deprecation] toURL() in File has been deprecated
[javac] is = excludesFile.toURL().openStream();
[javac] ^
[javac] /builddir/build/BUILD/sitemesh/src/java/com/opensymphony/module/sitemesh/filter/PageFilter.java:108: warning: [dep-ann] deprecated item is not annotated with @Deprecated
[javac] public FilterConfig getFilterConfig() {
[javac] ^
[javac] /builddir/build/BUILD/sitemesh/src/java/com/opensymphony/module/sitemesh/filter/PageFilter.java:114: warning: [dep-ann] deprecated item is not annotated with @Deprecated
[javac] public void setFilterConfig(FilterConfig filterConfig) {
[javac] ^
[javac] /builddir/build/BUILD/sitemesh/src/java/com/opensymphony/module/sitemesh/filter/PageFilter.java:149: warning: [deprecation] Boolean(boolean) in Boolean has been deprecated
[javac] request.setAttribute(USING_STREAM, new Boolean(pageResponse.isUsingStream()));
[javac] ^
[javac] /builddir/build/BUILD/sitemesh/src/java/com/opensymphony/module/sitemesh/taglib/page/ApplyDecoratorTag.java:112: warning: [dep-ann] deprecated item is not annotated with @Deprecated
[javac] public void setDecorator(String decorator) {
[javac] ^
[javac] /builddir/build/BUILD/sitemesh/src/java/com/opensymphony/module/sitemesh/util/Container.java:49: warning: [deprecation] Integer(int) in Integer has been deprecated
[javac] classMappings.put("org.apache.jasper.runtime.JspFactoryImpl", new Integer(TOMCAT));
[javac] ^
[javac] /builddir/build/BUILD/sitemesh/src/java/com/opensymphony/module/sitemesh/util/Container.java:50: warning: [deprecation] Integer(int) in Integer has been deprecated
[javac] classMappings.put("com.caucho.jsp.JspServlet", new Integer(RESIN));
[javac] ^
[javac] /builddir/build/BUILD/sitemesh/src/java/com/opensymphony/module/sitemesh/util/Container.java:51: warning: [deprecation] Integer(int) in Integer has been deprecated
[javac] classMappings.put("com.evermind.server.http.JSPServlet", new Integer(ORION));
[javac] ^
[javac] /builddir/build/BUILD/sitemesh/src/java/com/opensymphony/module/sitemesh/util/Container.java:52: warning: [deprecation] Integer(int) in Integer has been deprecated
[javac] classMappings.put("weblogic.servlet.JSPServlet", new Integer(WEBLOGIC));
[javac] ^
[javac] /builddir/build/BUILD/sitemesh/src/java/com/opensymphony/module/sitemesh/util/Container.java:53: warning: [deprecation] Integer(int) in Integer has been deprecated
[javac] classMappings.put("com.hp.mwlabs.j2ee.containers.servlet.jsp.JspServlet", new Integer(HPAS));
[javac] ^
[javac] /builddir/build/BUILD/sitemesh/src/java/com/opensymphony/module/sitemesh/util/Container.java:54: warning: [deprecation] Integer(int) in Integer has been deprecated
[javac] classMappings.put("jrun.servlet.WebApplicationService", new Integer(JRUN));
[javac] ^
[javac] /builddir/build/BUILD/sitemesh/src/java/com/opensymphony/module/sitemesh/util/Container.java:55: warning: [deprecation] Integer(int) in Integer has been deprecated
[javac] classMappings.put("com.ibm.ws.webcontainer.jsp.servlet.JspServlet", new Integer(WEBSPHERE));
[javac] ^
[javac] Note: Some input files use unchecked or unsafe operations.
[javac] Note: Recompile with -Xlint:unchecked for details.
[javac] 16 warnings
test:
[mkdir] Created dir: /builddir/build/BUILD/sitemesh/dist/build/test-classes
[javac] /builddir/build/BUILD/sitemesh/build.xml:31: warning: 'includeantruntime' was not set, defaulting to build.sysclasspath=last; set to false for repeatable builds
[javac] Compiling 3 source files to /builddir/build/BUILD/sitemesh/dist/build/classes
[javac] Note: Some input files use or override a deprecated API.
[javac] Note: Recompile with -Xlint:deprecation for details.
[javac] Note: /builddir/build/BUILD/sitemesh/src/test/com/opensymphony/module/sitemesh/parser/HTMLPageParserTest.java uses unchecked or unsafe operations.
[javac] Note: Recompile with -Xlint:unchecked for details.
[echo] Running unit tests...
[junit] Testsuite: com.opensymphony.module.sitemesh.mapper.ConfigLoaderTest
[junit] Tests run: 3, Failures: 0, Errors: 0, Skipped: 0, Time elapsed: 0.087 sec
[junit]
[junit] Testsuite: com.opensymphony.module.sitemesh.mapper.PathMapperTest
[junit] Tests run: 4, Failures: 0, Errors: 0, Skipped: 0, Time elapsed: 0.001 sec
[junit]
[junit] Testsuite: com.opensymphony.module.sitemesh.parser.HTMLPageParserTest
[junit] Tests run: 170, Failures: 0, Errors: 0, Skipped: 0, Time elapsed: 0.088 sec
[junit]
jar:
[copy] Copying 1 file to /builddir/build/BUILD/sitemesh/dist/build/classes/com/opensymphony/module/sitemesh/factory
[jar] Building jar: /builddir/build/BUILD/sitemesh/dist/sitemesh-2.1.jar
blank:
[war] Building war: /builddir/build/BUILD/sitemesh/dist/sitemesh-blank.war
example:
[mkdir] Created dir: /builddir/build/BUILD/sitemesh/dist/build/example-temp
[copy] Copying 34 files to /builddir/build/BUILD/sitemesh/dist/build/example-temp
[move] Moving 34 files to /builddir/build/BUILD/sitemesh/dist/build/example-temp
[war] Building war: /builddir/build/BUILD/sitemesh/dist/sitemesh-example.war
dist:
[zip] Building zip: /builddir/build/BUILD/sitemesh/dist/sitemesh-2.1-sources.zip
BUILD SUCCESSFUL
Total time: 5 seconds
+ RPM_EC=0
++ jobs -p
+ exit 0
Executing(%install): /bin/sh -e /var/tmp/rpm-tmp.D5rcYl
+ umask 022
+ cd /builddir/build/BUILD
+ '[' /builddir/build/BUILDROOT/sitemesh-2.1-0.12.54.uyuni3.x86_64 '!=' / ']'
+ rm -rf /builddir/build/BUILDROOT/sitemesh-2.1-0.12.54.uyuni3.x86_64
++ dirname /builddir/build/BUILDROOT/sitemesh-2.1-0.12.54.uyuni3.x86_64
+ mkdir -p /builddir/build/BUILDROOT
+ mkdir /builddir/build/BUILDROOT/sitemesh-2.1-0.12.54.uyuni3.x86_64
+ rm -rf /builddir/build/BUILDROOT/sitemesh-2.1-0.12.54.uyuni3.x86_64
+ install -d -m 755 /builddir/build/BUILDROOT/sitemesh-2.1-0.12.54.uyuni3.x86_64/usr/share/java
+ install -m 644 sitemesh/dist/sitemesh-2.1.jar /builddir/build/BUILDROOT/sitemesh-2.1-0.12.54.uyuni3.x86_64/usr/share/java/sitemesh-2.1.jar
+ cd /builddir/build/BUILDROOT/sitemesh-2.1-0.12.54.uyuni3.x86_64/usr/share/java
+ for jar in *-2.1*
++ echo sitemesh-2.1.jar
++ sed 's|-2.1||g'
+ ln -sf sitemesh-2.1.jar sitemesh.jar
+ install -d -m 755 /builddir/build/BUILDROOT/sitemesh-2.1-0.12.54.uyuni3.x86_64/usr/share/javadoc/sitemesh-2.1
+ cp -pr sitemesh/dist/docs/api/allclasses-index.html sitemesh/dist/docs/api/allclasses.html sitemesh/dist/docs/api/allpackages-index.html sitemesh/dist/docs/api/api.css sitemesh/dist/docs/api/com sitemesh/dist/docs/api/constant-values.html sitemesh/dist/docs/api/deprecated-list.html sitemesh/dist/docs/api/element-list sitemesh/dist/docs/api/help-doc.html sitemesh/dist/docs/api/index-all.html sitemesh/dist/docs/api/index.html sitemesh/dist/docs/api/jquery sitemesh/dist/docs/api/jquery-ui.overrides.css sitemesh/dist/docs/api/legal sitemesh/dist/docs/api/member-search-index.js sitemesh/dist/docs/api/member-search-index.zip sitemesh/dist/docs/api/overview-summary.html sitemesh/dist/docs/api/overview-tree.html sitemesh/dist/docs/api/package-search-index.js sitemesh/dist/docs/api/package-search-index.zip sitemesh/dist/docs/api/resources sitemesh/dist/docs/api/script.js sitemesh/dist/docs/api/search.js sitemesh/dist/docs/api/serialized-form.html sitemesh/dist/docs/api/type-search-index.js sitemesh/dist/docs/api/type-search-index.zip /builddir/build/BUILDROOT/sitemesh-2.1-0.12.54.uyuni3.x86_64/usr/share/javadoc/sitemesh-2.1
+ _target=
+ _symlinks=0
+ _symlinks=1
+ fdupes -q -n -r -p /builddir/build/BUILDROOT/sitemesh-2.1-0.12.54.uyuni3.x86_64/usr/share/javadoc/sitemesh-2.1
+ read _file
+ /usr/lib/rpm/check-buildroot
+ /usr/lib/rpm/redhat/brp-ldconfig
+ /usr/lib/rpm/brp-compress
+ /usr/lib/rpm/brp-strip /usr/bin/strip
+ /usr/lib/rpm/brp-strip-comment-note /usr/bin/strip /usr/bin/objdump
+ /usr/lib/rpm/redhat/brp-strip-lto /usr/bin/strip
+ /usr/lib/rpm/brp-strip-static-archive /usr/bin/strip
+ /usr/lib/rpm/redhat/brp-python-bytecompile '' 1 0
+ /usr/lib/rpm/brp-python-hardlink
+ /usr/lib/rpm/redhat/brp-mangle-shebangs
Processing files: sitemesh-2.1-0.12.54.uyuni3.noarch
Provides: sitemesh = 2.1-0.12.54.uyuni3
Requires(rpmlib): rpmlib(CompressedFileNames) <= 3.0.4-1 rpmlib(FileDigests) <= 4.6.0-1 rpmlib(PayloadFilesHavePrefix) <= 4.0-1
Processing files: sitemesh-javadoc-2.1-0.12.54.uyuni3.noarch
Provides: sitemesh-javadoc = 2.1-0.12.54.uyuni3
Requires(interp): /bin/sh /bin/sh
Requires(rpmlib): rpmlib(CompressedFileNames) <= 3.0.4-1 rpmlib(FileDigests) <= 4.6.0-1 rpmlib(PayloadFilesHavePrefix) <= 4.0-1
Requires(post): /bin/sh
Requires(postun): /bin/sh
Checking for unpackaged file(s): /usr/lib/rpm/check-files /builddir/build/BUILDROOT/sitemesh-2.1-0.12.54.uyuni3.x86_64
Wrote: /builddir/build/RPMS/sitemesh-2.1-0.12.54.uyuni3.noarch.rpm
Wrote: /builddir/build/RPMS/sitemesh-javadoc-2.1-0.12.54.uyuni3.noarch.rpm
Executing(%clean): /bin/sh -e /var/tmp/rpm-tmp.oBaC5h
+ umask 022
+ cd /builddir/build/BUILD
+ rm -rf /builddir/build/BUILDROOT/sitemesh-2.1-0.12.54.uyuni3.x86_64
+ RPM_EC=0
++ jobs -p
+ exit 0
Finish: rpmbuild sitemesh-2.1-0.12.54.uyuni3.src.rpm
Finish: build phase for sitemesh-2.1-0.12.54.uyuni3.src.rpm
INFO: chroot_scan: 3 files copied to /var/lib/copr-rpmbuild/results/chroot_scan
INFO: /var/lib/mock/rhel+epel-9-x86_64-1714022811.608410/root/var/log/dnf.log
/var/lib/mock/rhel+epel-9-x86_64-1714022811.608410/root/var/log/dnf.librepo.log
/var/lib/mock/rhel+epel-9-x86_64-1714022811.608410/root/var/log/dnf.rpm.log
INFO: Done(/var/lib/copr-rpmbuild/results/sitemesh-2.1-0.12.54.uyuni3.src.rpm) Config(child) 0 minutes 19 seconds
INFO: Results and/or logs in: /var/lib/copr-rpmbuild/results
INFO: Cleaning up build root ('cleanup_on_success=True')
Start: clean chroot
INFO: unmounting tmpfs.
Finish: clean chroot
Finish: run
Running RPMResults tool
Package info:
{
"packages": [
{
"name": "sitemesh",
"epoch": null,
"version": "2.1",
"release": "0.12.54.uyuni3",
"arch": "src"
},
{
"name": "sitemesh",
"epoch": null,
"version": "2.1",
"release": "0.12.54.uyuni3",
"arch": "noarch"
},
{
"name": "sitemesh-javadoc",
"epoch": null,
"version": "2.1",
"release": "0.12.54.uyuni3",
"arch": "noarch"
}
]
}
RPMResults finished